SHARE
TWEET

Untitled

a guest Apr 20th, 2019 76 Never
Not a member of Pastebin yet? Sign Up, it unlocks many cool features!
  1. ====================[ Build | all | Debug ]=====================================
  2. "E:\CLion 2019.1.2\bin\cmake\win\bin\cmake.exe" --build "G:\downloads\testingpl z delete\cmake-build-debug" --target all -- -j 2
  3. [ 76%] Built target libcurl
  4. [ 84%] Built target cpr
  5. [ 99%] Built target sleepy-discord
  6. [100%] Linking CXX executable Discordance.exe
  7. CMakeFiles\Discordance.dir/objects.a(source.cpp.obj): In function `asio::ssl::detail::openssl_init_base::do_init::~do_init()':
  8. G:/DOWNLO~1/TESTIN~1/SLEEPY~1/deps/asio/asio/include/asio/ssl/detail/impl/openssl_init.ipp:89: undefined reference to `CONF_modules_unload'
  9. CMakeFiles\Discordance.dir/objects.a(source.cpp.obj): In function `asio::error::detail::ssl_category::message[abi:cxx11](int) const':
  10. G:/DOWNLO~1/TESTIN~1/SLEEPY~1/deps/asio/asio/include/asio/ssl/impl/error.ipp:38: undefined reference to `ERR_reason_error_string'
  11. sleepy-discord/sleepy_discord/libsleepy-discord-d.a(websocketpp_websocket.cpp.obj): In function `asio::ssl::context::context(asio::ssl::context_base::method)':
  12. G:/DOWNLO~1/TESTIN~1/SLEEPY~1/deps/asio/asio/include/asio/ssl/impl/context.ipp:65: undefined reference to `ERR_clear_error'
  13. G:/DOWNLO~1/TESTIN~1/SLEEPY~1/deps/asio/asio/include/asio/ssl/impl/context.ipp:92: undefined reference to `TLS_method'
  14. G:/DOWNLO~1/TESTIN~1/SLEEPY~1/deps/asio/asio/include/asio/ssl/impl/context.ipp:92: undefined reference to `SSL_CTX_new'
  15. G:/DOWNLO~1/TESTIN~1/SLEEPY~1/deps/asio/asio/include/asio/ssl/impl/context.ipp:95: undefined reference to `SSL_CTX_ctrl'
  16. G:/DOWNLO~1/TESTIN~1/SLEEPY~1/deps/asio/asio/include/asio/ssl/impl/context.ipp:96: undefined reference to `SSL_CTX_ctrl'
  17. G:/DOWNLO~1/TESTIN~1/SLEEPY~1/deps/asio/asio/include/asio/ssl/impl/context.ipp:100: undefined reference to `TLS_client_method'
  18. G:/DOWNLO~1/TESTIN~1/SLEEPY~1/deps/asio/asio/include/asio/ssl/impl/context.ipp:100: undefined reference to `SSL_CTX_new'
  19. G:/DOWNLO~1/TESTIN~1/SLEEPY~1/deps/asio/asio/include/asio/ssl/impl/context.ipp:103: undefined reference to `SSL_CTX_ctrl'
  20. G:/DOWNLO~1/TESTIN~1/SLEEPY~1/deps/asio/asio/include/asio/ssl/impl/context.ipp:104: undefined reference to `SSL_CTX_ctrl'
  21. G:/DOWNLO~1/TESTIN~1/SLEEPY~1/deps/asio/asio/include/asio/ssl/impl/context.ipp:108: undefined reference to `TLS_server_method'
  22. G:/DOWNLO~1/TESTIN~1/SLEEPY~1/deps/asio/asio/include/asio/ssl/impl/context.ipp:108: undefined reference to `SSL_CTX_new'
  23. G:/DOWNLO~1/TESTIN~1/SLEEPY~1/deps/asio/asio/include/asio/ssl/impl/context.ipp:111: undefined reference to `SSL_CTX_ctrl'
  24. G:/DOWNLO~1/TESTIN~1/SLEEPY~1/deps/asio/asio/include/asio/ssl/impl/context.ipp:112: undefined reference to `SSL_CTX_ctrl'
  25. G:/DOWNLO~1/TESTIN~1/SLEEPY~1/deps/asio/asio/include/asio/ssl/impl/context.ipp:137: undefined reference to `TLS_method'
  26. G:/DOWNLO~1/TESTIN~1/SLEEPY~1/deps/asio/asio/include/asio/ssl/impl/context.ipp:137: undefined reference to `SSL_CTX_new'
  27. G:/DOWNLO~1/TESTIN~1/SLEEPY~1/deps/asio/asio/include/asio/ssl/impl/context.ipp:140: undefined reference to `SSL_CTX_ctrl'
  28. G:/DOWNLO~1/TESTIN~1/SLEEPY~1/deps/asio/asio/include/asio/ssl/impl/context.ipp:141: undefined reference to `SSL_CTX_ctrl'
  29. G:/DOWNLO~1/TESTIN~1/SLEEPY~1/deps/asio/asio/include/asio/ssl/impl/context.ipp:145: undefined reference to `TLS_client_method'
  30. G:/DOWNLO~1/TESTIN~1/SLEEPY~1/deps/asio/asio/include/asio/ssl/impl/context.ipp:145: undefined reference to `SSL_CTX_new'
  31. G:/DOWNLO~1/TESTIN~1/SLEEPY~1/deps/asio/asio/include/asio/ssl/impl/context.ipp:148: undefined reference to `SSL_CTX_ctrl'
  32. G:/DOWNLO~1/TESTIN~1/SLEEPY~1/deps/asio/asio/include/asio/ssl/impl/context.ipp:149: undefined reference to `SSL_CTX_ctrl'
  33. G:/DOWNLO~1/TESTIN~1/SLEEPY~1/deps/asio/asio/include/asio/ssl/impl/context.ipp:153: undefined reference to `TLS_server_method'
  34. G:/DOWNLO~1/TESTIN~1/SLEEPY~1/deps/asio/asio/include/asio/ssl/impl/context.ipp:153: undefined reference to `SSL_CTX_new'
  35. G:/DOWNLO~1/TESTIN~1/SLEEPY~1/deps/asio/asio/include/asio/ssl/impl/context.ipp:156: undefined reference to `SSL_CTX_ctrl'
  36. G:/DOWNLO~1/TESTIN~1/SLEEPY~1/deps/asio/asio/include/asio/ssl/impl/context.ipp:157: undefined reference to `SSL_CTX_ctrl'
  37. G:/DOWNLO~1/TESTIN~1/SLEEPY~1/deps/asio/asio/include/asio/ssl/impl/context.ipp:182: undefined reference to `TLS_method'
  38. G:/DOWNLO~1/TESTIN~1/SLEEPY~1/deps/asio/asio/include/asio/ssl/impl/context.ipp:182: undefined reference to `SSL_CTX_new'
  39. G:/DOWNLO~1/TESTIN~1/SLEEPY~1/deps/asio/asio/include/asio/ssl/impl/context.ipp:185: undefined reference to `SSL_CTX_ctrl'
  40. G:/DOWNLO~1/TESTIN~1/SLEEPY~1/deps/asio/asio/include/asio/ssl/impl/context.ipp:186: undefined reference to `SSL_CTX_ctrl'
  41. G:/DOWNLO~1/TESTIN~1/SLEEPY~1/deps/asio/asio/include/asio/ssl/impl/context.ipp:190: undefined reference to `TLS_client_method'
  42. G:/DOWNLO~1/TESTIN~1/SLEEPY~1/deps/asio/asio/include/asio/ssl/impl/context.ipp:190: undefined reference to `SSL_CTX_new'
  43. G:/DOWNLO~1/TESTIN~1/SLEEPY~1/deps/asio/asio/include/asio/ssl/impl/context.ipp:193: undefined reference to `SSL_CTX_ctrl'
  44. G:/DOWNLO~1/TESTIN~1/SLEEPY~1/deps/asio/asio/include/asio/ssl/impl/context.ipp:194: undefined reference to `SSL_CTX_ctrl'
  45. G:/DOWNLO~1/TESTIN~1/SLEEPY~1/deps/asio/asio/include/asio/ssl/impl/context.ipp:198: undefined reference to `TLS_server_method'
  46. G:/DOWNLO~1/TESTIN~1/SLEEPY~1/deps/asio/asio/include/asio/ssl/impl/context.ipp:198: undefined reference to `SSL_CTX_new'
  47. G:/DOWNLO~1/TESTIN~1/SLEEPY~1/deps/asio/asio/include/asio/ssl/impl/context.ipp:201: undefined reference to `SSL_CTX_ctrl'
  48. G:/DOWNLO~1/TESTIN~1/SLEEPY~1/deps/asio/asio/include/asio/ssl/impl/context.ipp:202: undefined reference to `SSL_CTX_ctrl'
  49. G:/DOWNLO~1/TESTIN~1/SLEEPY~1/deps/asio/asio/include/asio/ssl/impl/context.ipp:227: undefined reference to `TLS_method'
  50. G:/DOWNLO~1/TESTIN~1/SLEEPY~1/deps/asio/asio/include/asio/ssl/impl/context.ipp:227: undefined reference to `SSL_CTX_new'
  51. G:/DOWNLO~1/TESTIN~1/SLEEPY~1/deps/asio/asio/include/asio/ssl/impl/context.ipp:230: undefined reference to `SSL_CTX_ctrl'
  52. G:/DOWNLO~1/TESTIN~1/SLEEPY~1/deps/asio/asio/include/asio/ssl/impl/context.ipp:231: undefined reference to `SSL_CTX_ctrl'
  53. G:/DOWNLO~1/TESTIN~1/SLEEPY~1/deps/asio/asio/include/asio/ssl/impl/context.ipp:235: undefined reference to `TLS_client_method'
  54. G:/DOWNLO~1/TESTIN~1/SLEEPY~1/deps/asio/asio/include/asio/ssl/impl/context.ipp:235: undefined reference to `SSL_CTX_new'
  55. G:/DOWNLO~1/TESTIN~1/SLEEPY~1/deps/asio/asio/include/asio/ssl/impl/context.ipp:238: undefined reference to `SSL_CTX_ctrl'
  56. G:/DOWNLO~1/TESTIN~1/SLEEPY~1/deps/asio/asio/include/asio/ssl/impl/context.ipp:239: undefined reference to `SSL_CTX_ctrl'
  57. G:/DOWNLO~1/TESTIN~1/SLEEPY~1/deps/asio/asio/include/asio/ssl/impl/context.ipp:243: undefined reference to `TLS_server_method'
  58. G:/DOWNLO~1/TESTIN~1/SLEEPY~1/deps/asio/asio/include/asio/ssl/impl/context.ipp:243: undefined reference to `SSL_CTX_new'
  59. G:/DOWNLO~1/TESTIN~1/SLEEPY~1/deps/asio/asio/include/asio/ssl/impl/context.ipp:246: undefined reference to `SSL_CTX_ctrl'
  60. G:/DOWNLO~1/TESTIN~1/SLEEPY~1/deps/asio/asio/include/asio/ssl/impl/context.ipp:247: undefined reference to `SSL_CTX_ctrl'
  61. G:/DOWNLO~1/TESTIN~1/SLEEPY~1/deps/asio/asio/include/asio/ssl/impl/context.ipp:273: undefined reference to `TLS_method'
  62. G:/DOWNLO~1/TESTIN~1/SLEEPY~1/deps/asio/asio/include/asio/ssl/impl/context.ipp:273: undefined reference to `SSL_CTX_new'
  63. G:/DOWNLO~1/TESTIN~1/SLEEPY~1/deps/asio/asio/include/asio/ssl/impl/context.ipp:276: undefined reference to `SSL_CTX_ctrl'
  64. G:/DOWNLO~1/TESTIN~1/SLEEPY~1/deps/asio/asio/include/asio/ssl/impl/context.ipp:277: undefined reference to `SSL_CTX_ctrl'
  65. G:/DOWNLO~1/TESTIN~1/SLEEPY~1/deps/asio/asio/include/asio/ssl/impl/context.ipp:281: undefined reference to `TLS_client_method'
  66. G:/DOWNLO~1/TESTIN~1/SLEEPY~1/deps/asio/asio/include/asio/ssl/impl/context.ipp:281: undefined reference to `SSL_CTX_new'
  67. G:/DOWNLO~1/TESTIN~1/SLEEPY~1/deps/asio/asio/include/asio/ssl/impl/context.ipp:284: undefined reference to `SSL_CTX_ctrl'
  68. G:/DOWNLO~1/TESTIN~1/SLEEPY~1/deps/asio/asio/include/asio/ssl/impl/context.ipp:285: undefined reference to `SSL_CTX_ctrl'
  69. G:/DOWNLO~1/TESTIN~1/SLEEPY~1/deps/asio/asio/include/asio/ssl/impl/context.ipp:289: undefined reference to `TLS_server_method'
  70. G:/DOWNLO~1/TESTIN~1/SLEEPY~1/deps/asio/asio/include/asio/ssl/impl/context.ipp:289: undefined reference to `SSL_CTX_new'
  71. G:/DOWNLO~1/TESTIN~1/SLEEPY~1/deps/asio/asio/include/asio/ssl/impl/context.ipp:292: undefined reference to `SSL_CTX_ctrl'
  72. G:/DOWNLO~1/TESTIN~1/SLEEPY~1/deps/asio/asio/include/asio/ssl/impl/context.ipp:293: undefined reference to `SSL_CTX_ctrl'
  73. G:/DOWNLO~1/TESTIN~1/SLEEPY~1/deps/asio/asio/include/asio/ssl/impl/context.ipp:309: undefined reference to `TLS_method'
  74. G:/DOWNLO~1/TESTIN~1/SLEEPY~1/deps/asio/asio/include/asio/ssl/impl/context.ipp:309: undefined reference to `SSL_CTX_new'
  75. G:/DOWNLO~1/TESTIN~1/SLEEPY~1/deps/asio/asio/include/asio/ssl/impl/context.ipp:312: undefined reference to `TLS_client_method'
  76. G:/DOWNLO~1/TESTIN~1/SLEEPY~1/deps/asio/asio/include/asio/ssl/impl/context.ipp:312: undefined reference to `SSL_CTX_new'
  77. G:/DOWNLO~1/TESTIN~1/SLEEPY~1/deps/asio/asio/include/asio/ssl/impl/context.ipp:315: undefined reference to `TLS_server_method'
  78. G:/DOWNLO~1/TESTIN~1/SLEEPY~1/deps/asio/asio/include/asio/ssl/impl/context.ipp:315: undefined reference to `SSL_CTX_new'
  79. G:/DOWNLO~1/TESTIN~1/SLEEPY~1/deps/asio/asio/include/asio/ssl/impl/context.ipp:321: undefined reference to `TLS_method'
  80. G:/DOWNLO~1/TESTIN~1/SLEEPY~1/deps/asio/asio/include/asio/ssl/impl/context.ipp:321: undefined reference to `SSL_CTX_new'
  81. G:/DOWNLO~1/TESTIN~1/SLEEPY~1/deps/asio/asio/include/asio/ssl/impl/context.ipp:323: undefined reference to `SSL_CTX_ctrl'
  82. G:/DOWNLO~1/TESTIN~1/SLEEPY~1/deps/asio/asio/include/asio/ssl/impl/context.ipp:326: undefined reference to `TLS_client_method'
  83. G:/DOWNLO~1/TESTIN~1/SLEEPY~1/deps/asio/asio/include/asio/ssl/impl/context.ipp:326: undefined reference to `SSL_CTX_new'
  84. G:/DOWNLO~1/TESTIN~1/SLEEPY~1/deps/asio/asio/include/asio/ssl/impl/context.ipp:328: undefined reference to `SSL_CTX_ctrl'
  85. G:/DOWNLO~1/TESTIN~1/SLEEPY~1/deps/asio/asio/include/asio/ssl/impl/context.ipp:331: undefined reference to `TLS_server_method'
  86. G:/DOWNLO~1/TESTIN~1/SLEEPY~1/deps/asio/asio/include/asio/ssl/impl/context.ipp:331: undefined reference to `SSL_CTX_new'
  87. G:/DOWNLO~1/TESTIN~1/SLEEPY~1/deps/asio/asio/include/asio/ssl/impl/context.ipp:333: undefined reference to `SSL_CTX_ctrl'
  88. G:/DOWNLO~1/TESTIN~1/SLEEPY~1/deps/asio/asio/include/asio/ssl/impl/context.ipp:354: undefined reference to `SSL_CTX_new'
  89. G:/DOWNLO~1/TESTIN~1/SLEEPY~1/deps/asio/asio/include/asio/ssl/impl/context.ipp:361: undefined reference to `ERR_get_error'
  90. sleepy-discord/sleepy_discord/libsleepy-discord-d.a(websocketpp_websocket.cpp.obj): In function `asio::ssl::context::~context()':
  91. G:/DOWNLO~1/TESTIN~1/SLEEPY~1/deps/asio/asio/include/asio/ssl/impl/context.ipp:390: undefined reference to `SSL_CTX_get_default_passwd_cb_userdata'
  92. G:/DOWNLO~1/TESTIN~1/SLEEPY~1/deps/asio/asio/include/asio/ssl/impl/context.ipp:401: undefined reference to `SSL_CTX_set_default_passwd_cb_userdata'
  93. G:/DOWNLO~1/TESTIN~1/SLEEPY~1/deps/asio/asio/include/asio/ssl/impl/context.ipp:407: undefined reference to `SSL_CTX_get_ex_data'
  94. G:/DOWNLO~1/TESTIN~1/SLEEPY~1/deps/asio/asio/include/asio/ssl/impl/context.ipp:411: undefined reference to `SSL_CTX_get_ex_data'
  95. G:/DOWNLO~1/TESTIN~1/SLEEPY~1/deps/asio/asio/include/asio/ssl/impl/context.ipp:413: undefined reference to `SSL_CTX_set_ex_data'
  96. G:/DOWNLO~1/TESTIN~1/SLEEPY~1/deps/asio/asio/include/asio/ssl/impl/context.ipp:416: undefined reference to `SSL_CTX_free'
  97. sleepy-discord/sleepy_discord/libsleepy-discord-d.a(websocketpp_websocket.cpp.obj): In function `asio::ssl::context::set_options(long, std::error_code&)':
  98. G:/DOWNLO~1/TESTIN~1/SLEEPY~1/deps/asio/asio/include/asio/ssl/impl/context.ipp:480: undefined reference to `SSL_CTX_set_options'
  99. sleepy-discord/sleepy_discord/libsleepy-discord-d.a(websocketpp_websocket.cpp.obj): In function `asio::ssl::detail::engine::engine(ssl_ctx_st*)':
  100. G:/DOWNLO~1/TESTIN~1/SLEEPY~1/deps/asio/asio/include/asio/ssl/detail/impl/engine.ipp:33: undefined reference to `SSL_new'
  101. G:/DOWNLO~1/TESTIN~1/SLEEPY~1/deps/asio/asio/include/asio/ssl/detail/impl/engine.ipp:38: undefined reference to `ERR_get_error'
  102. G:/DOWNLO~1/TESTIN~1/SLEEPY~1/deps/asio/asio/include/asio/ssl/detail/impl/engine.ipp:47: undefined reference to `SSL_ctrl'
  103. G:/DOWNLO~1/TESTIN~1/SLEEPY~1/deps/asio/asio/include/asio/ssl/detail/impl/engine.ipp:48: undefined reference to `SSL_ctrl'
  104. G:/DOWNLO~1/TESTIN~1/SLEEPY~1/deps/asio/asio/include/asio/ssl/detail/impl/engine.ipp:50: undefined reference to `SSL_ctrl'
  105. G:/DOWNLO~1/TESTIN~1/SLEEPY~1/deps/asio/asio/include/asio/ssl/detail/impl/engine.ipp:54: undefined reference to `BIO_new_bio_pair'
  106. G:/DOWNLO~1/TESTIN~1/SLEEPY~1/deps/asio/asio/include/asio/ssl/detail/impl/engine.ipp:55: undefined reference to `SSL_set_bio'
  107. sleepy-discord/sleepy_discord/libsleepy-discord-d.a(websocketpp_websocket.cpp.obj): In function `asio::ssl::detail::engine::~engine()':
  108. G:/DOWNLO~1/TESTIN~1/SLEEPY~1/deps/asio/asio/include/asio/ssl/detail/impl/engine.ipp:60: undefined reference to `SSL_get_ex_data'
  109. G:/DOWNLO~1/TESTIN~1/SLEEPY~1/deps/asio/asio/include/asio/ssl/detail/impl/engine.ipp:62: undefined reference to `SSL_get_ex_data'
  110. G:/DOWNLO~1/TESTIN~1/SLEEPY~1/deps/asio/asio/include/asio/ssl/detail/impl/engine.ipp:63: undefined reference to `SSL_set_ex_data'
  111. G:/DOWNLO~1/TESTIN~1/SLEEPY~1/deps/asio/asio/include/asio/ssl/detail/impl/engine.ipp:66: undefined reference to `BIO_free'
  112. G:/DOWNLO~1/TESTIN~1/SLEEPY~1/deps/asio/asio/include/asio/ssl/detail/impl/engine.ipp:67: undefined reference to `SSL_free'
  113. sleepy-discord/sleepy_discord/libsleepy-discord-d.a(websocketpp_websocket.cpp.obj): In function `asio::ssl::detail::engine::get_output(asio::mutable_buffer const&)':
  114. G:/DOWNLO~1/TESTIN~1/SLEEPY~1/deps/asio/asio/include/asio/ssl/detail/impl/engine.ipp:173: undefined reference to `BIO_read'
  115. sleepy-discord/sleepy_discord/libsleepy-discord-d.a(websocketpp_websocket.cpp.obj): In function `asio::ssl::detail::engine::put_input(asio::const_buffer const&)':
  116. G:/DOWNLO~1/TESTIN~1/SLEEPY~1/deps/asio/asio/include/asio/ssl/detail/impl/engine.ipp:183: undefined reference to `BIO_write'
  117. sleepy-discord/sleepy_discord/libsleepy-discord-d.a(websocketpp_websocket.cpp.obj): In function `asio::ssl::detail::engine::map_error_code(std::error_code&) const':
  118. G:/DOWNLO~1/TESTIN~1/SLEEPY~1/deps/asio/asio/include/asio/ssl/detail/impl/engine.ipp:198: undefined reference to `BIO_ctrl'
  119. G:/DOWNLO~1/TESTIN~1/SLEEPY~1/deps/asio/asio/include/asio/ssl/detail/impl/engine.ipp:212: undefined reference to `SSL_get_shutdown'
  120. sleepy-discord/sleepy_discord/libsleepy-discord-d.a(websocketpp_websocket.cpp.obj): In function `asio::ssl::detail::engine::perform(int (asio::ssl::detail::engine::*)(void*, unsigned long long), void*, unsigned long long, std::error_code&, unsigned long long*)':
  121. G:/DOWNLO~1/TESTIN~1/SLEEPY~1/deps/asio/asio/include/asio/ssl/detail/impl/engine.ipp:232: undefined reference to `BIO_ctrl_pending'
  122. G:/DOWNLO~1/TESTIN~1/SLEEPY~1/deps/asio/asio/include/asio/ssl/detail/impl/engine.ipp:233: undefined reference to `ERR_clear_error'
  123. G:/DOWNLO~1/TESTIN~1/SLEEPY~1/deps/asio/asio/include/asio/ssl/detail/impl/engine.ipp:235: undefined reference to `SSL_get_error'
  124. G:/DOWNLO~1/TESTIN~1/SLEEPY~1/deps/asio/asio/include/asio/ssl/detail/impl/engine.ipp:236: undefined reference to `ERR_get_error'
  125. G:/DOWNLO~1/TESTIN~1/SLEEPY~1/deps/asio/asio/include/asio/ssl/detail/impl/engine.ipp:237: undefined reference to `BIO_ctrl_pending'
  126. G:/DOWNLO~1/TESTIN~1/SLEEPY~1/deps/asio/asio/include/asio/ssl/detail/impl/engine.ipp:271: undefined reference to `SSL_get_shutdown'
  127. sleepy-discord/sleepy_discord/libsleepy-discord-d.a(websocketpp_websocket.cpp.obj): In function `asio::ssl::detail::engine::do_accept(void*, unsigned long long)':
  128. G:/DOWNLO~1/TESTIN~1/SLEEPY~1/deps/asio/asio/include/asio/ssl/detail/impl/engine.ipp:288: undefined reference to `SSL_accept'
  129. sleepy-discord/sleepy_discord/libsleepy-discord-d.a(websocketpp_websocket.cpp.obj): In function `asio::ssl::detail::engine::do_connect(void*, unsigned long long)':
  130. G:/DOWNLO~1/TESTIN~1/SLEEPY~1/deps/asio/asio/include/asio/ssl/detail/impl/engine.ipp:293: undefined reference to `SSL_connect'
  131. sleepy-discord/sleepy_discord/libsleepy-discord-d.a(websocketpp_websocket.cpp.obj): In function `asio::ssl::detail::engine::do_shutdown(void*, unsigned long long)':
  132. G:/DOWNLO~1/TESTIN~1/SLEEPY~1/deps/asio/asio/include/asio/ssl/detail/impl/engine.ipp:298: undefined reference to `SSL_shutdown'
  133. G:/DOWNLO~1/TESTIN~1/SLEEPY~1/deps/asio/asio/include/asio/ssl/detail/impl/engine.ipp:300: undefined reference to `SSL_shutdown'
  134. sleepy-discord/sleepy_discord/libsleepy-discord-d.a(websocketpp_websocket.cpp.obj): In function `asio::ssl::detail::engine::do_read(void*, unsigned long long)':
  135. G:/DOWNLO~1/TESTIN~1/SLEEPY~1/deps/asio/asio/include/asio/ssl/detail/impl/engine.ipp:306: undefined reference to `SSL_read'
  136. sleepy-discord/sleepy_discord/libsleepy-discord-d.a(websocketpp_websocket.cpp.obj): In function `asio::ssl::detail::engine::do_write(void*, unsigned long long)':
  137. G:/DOWNLO~1/TESTIN~1/SLEEPY~1/deps/asio/asio/include/asio/ssl/detail/impl/engine.ipp:312: undefined reference to `SSL_write'
  138. sleepy-discord/sleepy_discord/libsleepy-discord-d.a(websocketpp_websocket.cpp.obj): In function `websocketpp::transport::asio::tls_socket::connection::pre_init(std::function<void (std::error_code const&)>)':
  139. G:/DOWNLO~1/TESTIN~1/SLEEPY~1/deps/WEBSOC~1/websocketpp/transport/asio/security/tls.hpp:244: undefined reference to `SSL_ctrl'
  140. collect2.exe: error: ld returned 1 exit status
  141. mingw32-make.exe[2]: *** [CMakeFiles\Discordance.dir\build.make:91: Discordance.exe] Error 1
  142. mingw32-make.exe[1]: *** [CMakeFiles\Makefile2:74: CMakeFiles/Discordance.dir/all] Error 2
  143. mingw32-make.exe: *** [Makefile:129: all] Error 2
RAW Paste Data
We use cookies for various purposes including analytics. By continuing to use Pastebin, you agree to our use of cookies as described in the Cookies Policy. OK, I Understand
 
Top