Not a member of Pastebin yet?
Sign Up,
it unlocks many cool features!
- 1 Apache Maven 3.0.4 (r1232337; 2012-01-17 14:14:56+0530)
- 2 Maven home: /usr/local/apache-maven-3.0.4
- 3 Java version: 1.6.0_23, vendor: Sun Microsystems Inc.
- 4 Java home: /usr/lib/jvm/java-6-openjdk/jre
- 5 Default locale: en_IN, platform encoding: UTF-8
- 6 OS name: "linux", version: "3.0.0-17-generic", arch: "i386", family: "unix"
- 7 [INFO] Error stacktraces are turned on.
- 8 [DEBUG] Reading global settings from /usr/local/apache-maven-3.0.4/conf/settings.xml
- 9 [DEBUG] Reading user settings from /root/.m2/settings.xml
- 10 [DEBUG] Using local repository at /root/.m2/repository
- 11 [DEBUG] Using manager EnhancedLocalRepositoryManager with priority 10 for /root/.m2/repository
- 12 [INFO] Scanning for projects...
- 13 [DEBUG] Extension realms for project org.apache.cloudstack:cloudstack:pom:4.1.0-SNAPSHOT: (none)
- 14 [DEBUG] Looking up lifecyle mappings for packaging pom from ClassRealm[plexus.core, parent: null]
- 15 [DEBUG] Extension realms for project org.apache.cloudstack:cloud-api:jar:4.1.0-SNAPSHOT: (none)
- 16 [DEBUG] Looking up lifecyle mappings for packaging jar from ClassRealm[plexus.core, parent: null]
- 17 [DEBUG] Extension realms for project org.apache.cloudstack:cloud-agent:jar:4.1.0-SNAPSHOT: (none)
- 18 [DEBUG] Looking up lifecyle mappings for packaging jar from ClassRealm[plexus.core, parent: null]
- 19 [DEBUG] Extension realms for project org.apache.cloudstack:cloud-console-proxy:jar:4.1.0-SNAPSHOT: (none)
- 20 [DEBUG] Looking up lifecyle mappings for packaging jar from ClassRealm[plexus.core, parent: null]
- 21 [DEBUG] Extension realms for project org.apache.cloudstack:cloud-core:jar:4.1.0-SNAPSHOT: (none)
- 22 [DEBUG] Looking up lifecyle mappings for packaging jar from ClassRealm[plexus.core, parent: null]
- 23 [DEBUG] Extension realms for project org.apache.cloudstack:cloud-server:jar:4.1.0-SNAPSHOT: (none)
- 24 [DEBUG] Looking up lifecyle mappings for packaging jar from ClassRealm[plexus.core, parent: null]
- 25 [DEBUG] Extension realms for project org.apache.cloudstack:cloud-usage:jar:4.1.0-SNAPSHOT: (none)
- 26 [DEBUG] Looking up lifecyle mappings for packaging jar from ClassRealm[plexus.core, parent: null]
- 27 [DEBUG] Extension realms for project org.apache.cloudstack:cloud-utils:jar:4.1.0-SNAPSHOT: (none)
- 28 [DEBUG] Looking up lifecyle mappings for packaging jar from ClassRealm[plexus.core, parent: null]
- 29 [DEBUG] Extension realms for project org.apache.cloudstack:xapi:jar:5.6.100-1-SNAPSHOT: (none)
- 30 [DEBUG] Looking up lifecyle mappings for packaging jar from ClassRealm[plexus.core, parent: null]
- 31 [DEBUG] Extension realms for project org.apache.cloudstack:cloudstack-plugins:pom:4.1.0-SNAPSHOT: (none)
- 32 [DEBUG] Looking up lifecyle mappings for packaging pom from ClassRealm[plexus.core, parent: null]
- 33 [DEBUG] Extension realms for project org.apache.cloudstack:cloud-plugin-planner-user-concentrated-pod:jar:4.1.0-SNAPSHOT: (none)
- 34 [DEBUG] Looking up lifecyle mappings for packaging jar from ClassRealm[plexus.core, parent: null]
- 35 [DEBUG] Extension realms for project org.apache.cloudstack:cloud-plugin-planner-user-dispersing:jar:4.1.0-SNAPSHOT: (none)
- 36 [DEBUG] Looking up lifecyle mappings for packaging jar from ClassRealm[plexus.core, parent: null]
- 37 [DEBUG] Extension realms for project org.apache.cloudstack:cloud-plugin-host-allocator-random:jar:4.1.0-SNAPSHOT: (none)
- 38 [DEBUG] Looking up lifecyle mappings for packaging jar from ClassRealm[plexus.core, parent: null]
- 39 [DEBUG] Extension realms for project org.apache.cloudstack:cloud-plugin-hypervisor-ovm:jar:4.1.0-SNAPSHOT: (none)
- 40 [DEBUG] Looking up lifecyle mappings for packaging jar from ClassRealm[plexus.core, parent: null]
- 41 [DEBUG] Extension realms for project org.apache.cloudstack:cloud-plugin-hypervisor-xen:jar:4.1.0-SNAPSHOT: (none)
- 42 [DEBUG] Looking up lifecyle mappings for packaging jar from ClassRealm[plexus.core, parent: null]
- 43 [DEBUG] Extension realms for project org.apache.cloudstack:cloud-plugin-hypervisor-kvm:jar:4.1.0-SNAPSHOT: (none)
- 44 [DEBUG] Looking up lifecyle mappings for packaging jar from ClassRealm[plexus.core, parent: null]
- 45 [DEBUG] Extension realms for project org.apache.cloudstack:cloud-plugin-hypervisor-simulator:jar:4.1.0-SNAPSHOT: (none)
- 46 [DEBUG] Looking up lifecyle mappings for packaging jar from ClassRealm[plexus.core, parent: null]
- 47 [DEBUG] Extension realms for project org.apache.cloudstack:cloud-plugin-network-elb:jar:4.1.0-SNAPSHOT: (none)
- 48 [DEBUG] Looking up lifecyle mappings for packaging jar from ClassRealm[plexus.core, parent: null]
- 49 [DEBUG] Extension realms for project org.apache.cloudstack:cloud-plugin-network-ovs:jar:4.1.0-SNAPSHOT: (none)
- 50 [DEBUG] Looking up lifecyle mappings for packaging jar from ClassRealm[plexus.core, parent: null]
- 51 [DEBUG] Extension realms for project org.apache.cloudstack:cloud-plugin-network-nvp:jar:4.1.0-SNAPSHOT: (none)
- 52 [DEBUG] Looking up lifecyle mappings for packaging jar from ClassRealm[plexus.core, parent: null]
- 53 [DEBUG] Extension realms for project org.apache.cloudstack:cloud-plugin-storage-allocator-random:jar:4.1.0-SNAPSHOT: (none)
- 54 [DEBUG] Looking up lifecyle mappings for packaging jar from ClassRealm[plexus.core, parent: null]
- 55 [DEBUG] Extension realms for project org.apache.cloudstack:cloud-plugin-user-authenticator-ldap:jar:4.1.0-SNAPSHOT: (none)
- 56 [DEBUG] Looking up lifecyle mappings for packaging jar from ClassRealm[plexus.core, parent: null]
- 57 [DEBUG] Extension realms for project org.apache.cloudstack:cloud-plugin-user-authenticator-md5:jar:4.1.0-SNAPSHOT: (none)
- 58 [DEBUG] Looking up lifecyle mappings for packaging jar from ClassRealm[plexus.core, parent: null]
- 59 [DEBUG] Extension realms for project org.apache.cloudstack:cloud-plugin-user-authenticator-plaintext:jar:4.1.0-SNAPSHOT: (none)
- 60 [DEBUG] Looking up lifecyle mappings for packaging jar from ClassRealm[plexus.core, parent: null]
- 61 [DEBUG] Extension realms for project org.apache.cloudstack:cloud-plugin-user-authenticator-sha256salted:jar:4.1.0-SNAPSHOT: (none)
- 62 [DEBUG] Looking up lifecyle mappings for packaging jar from ClassRealm[plexus.core, parent: null]
- 63 [DEBUG] Extension realms for project org.apache.cloudstack:cloud-plugin-example-dns-notifier:jar:4.1.0-SNAPSHOT: (none)
- 64 [DEBUG] Looking up lifecyle mappings for packaging jar from ClassRealm[plexus.core, parent: null]
- 65 [DEBUG] Extension realms for project org.apache.cloudstack:cloud-awsapi:war:4.1.0-SNAPSHOT: (none)
- 66 [DEBUG] Looking up lifecyle mappings for packaging war from ClassRealm[plexus.core, parent: null]
- 67 [DEBUG] Extension realms for project org.apache.cloudstack:cloud-patches:pom:4.1.0-SNAPSHOT: (none)
- 68 [DEBUG] Looking up lifecyle mappings for packaging pom from ClassRealm[plexus.core, parent: null]
- 69 [DEBUG] Extension realms for project org.apache.cloudstack:cloud-client-ui:war:4.1.0-SNAPSHOT: (none)
- 70 [DEBUG] Looking up lifecyle mappings for packaging war from ClassRealm[plexus.core, parent: null]
- 71 [DEBUG] Extension realms for project org.apache.cloudstack:cloud-testclient:jar:4.1.0-SNAPSHOT: (none)
- 72 [DEBUG] Looking up lifecyle mappings for packaging jar from ClassRealm[plexus.core, parent: null]
- 73 [INFO] ------------------------------------------------------------------------
- 74 [INFO] Reactor Build Order:
- 75 [INFO]
- 76 [INFO] Apache CloudStack
- 77 [INFO] Apache CloudStack Utils
- 78 [INFO] Apache CloudStack API
- 79 [INFO] Apache CloudStack Core
- 80 [INFO] Apache CloudStack Agents
- 81 [INFO] Apache CloudStack SystemVM Patches
- 82 [INFO] Apache CloudStack Console Proxy
- 83 [INFO] Apache CloudStack Server
- 84 [INFO] Apache CloudStack Usage Server
- 85 [INFO] Apache XenSource XAPI
- 86 [INFO] Apache CloudStack Plugin POM
- 87 [INFO] Apache CloudStack Plugin - User Concentrated Pod Deployment Planner
- 88 [INFO] Apache CloudStack Plugin - User Dispersing Deployment Planner
- 89 [INFO] Apache CloudStack Plugin - Host Allocator Random
- 90 [INFO] Apache CloudStack Plugin - Hypervisor OracleVM
- 91 [INFO] Apache CloudStack Plugin - Open vSwitch
- 92 [INFO] Apache CloudStack Plugin - Hypervisor Xen
- 93 [INFO] Apache CloudStack Plugin - Hypervisor KVM
- 94 [INFO] Apache CloudStack Plugin - Hypervisor Simulator
- 95 [INFO] Apache CloudStack Plugin - Network Elastic Load Balancer
- 96 [INFO] Apache CloudStack Plugin - Network Nicira NVP
- 97 [INFO] Apache CloudStack Plugin - Storage Allocator Random
- 98 [INFO] Apache CloudStack Plugin - User Authenticator LDAP
- 99 [INFO] Apache CloudStack Plugin - User Authenticator MD5
- 100 [INFO] Apache CloudStack Plugin - User Authenticator Plain Text
- 101 [INFO] Apache CloudStack Plugin - User Authenticator SHA256 Salted
- 102 [INFO] CloudStack Dns Notifier Example
- 103 [INFO] Apache CloudStack AWS API Bridge
- 104 [INFO] Apache CloudStack Client UI
- 105 [INFO] Apache CloudStack Test
- 106 [DEBUG] === REACTOR BUILD PLAN ================================================
- 107 [DEBUG] Project: org.apache.cloudstack:cloudstack:pom:4.1.0-SNAPSHOT
- 108 [DEBUG] Tasks: [clean, install]
- 109 [DEBUG] Style: Regular
- 110 [DEBUG] -----------------------------------------------------------------------
- 111 [DEBUG] Project: org.apache.cloudstack:cloud-utils:jar:4.1.0-SNAPSHOT
- 112 [DEBUG] Tasks: [clean, install]
- 113 [DEBUG] Style: Regular
- 114 [DEBUG] -----------------------------------------------------------------------
- 115 [DEBUG] Project: org.apache.cloudstack:cloud-api:jar:4.1.0-SNAPSHOT
- 116 [DEBUG] Tasks: [clean, install]
- 117 [DEBUG] Style: Regular
- 118 [DEBUG] -----------------------------------------------------------------------
- 119 [DEBUG] Project: org.apache.cloudstack:cloud-core:jar:4.1.0-SNAPSHOT
- 120 [DEBUG] Tasks: [clean, install]
- 121 [DEBUG] Style: Regular
- 122 [DEBUG] -----------------------------------------------------------------------
- 123 [DEBUG] Project: org.apache.cloudstack:cloud-agent:jar:4.1.0-SNAPSHOT
- 124 [DEBUG] Tasks: [clean, install]
- 125 [DEBUG] Style: Regular
- 126 [DEBUG] -----------------------------------------------------------------------
- 127 [DEBUG] Project: org.apache.cloudstack:cloud-patches:pom:4.1.0-SNAPSHOT
- 128 [DEBUG] Tasks: [clean, install]
- 129 [DEBUG] Style: Regular
- 130 [DEBUG] -----------------------------------------------------------------------
- 131 [DEBUG] Project: org.apache.cloudstack:cloud-console-proxy:jar:4.1.0-SNAPSHOT
- 132 [DEBUG] Tasks: [clean, install]
- 133 [DEBUG] Style: Regular
- 134 [DEBUG] -----------------------------------------------------------------------
- 135 [DEBUG] Project: org.apache.cloudstack:cloud-server:jar:4.1.0-SNAPSHOT
- 136 [DEBUG] Tasks: [clean, install]
- 137 [DEBUG] Style: Regular
- 138 [DEBUG] -----------------------------------------------------------------------
- 139 [DEBUG] Project: org.apache.cloudstack:cloud-usage:jar:4.1.0-SNAPSHOT
- 140 [DEBUG] Tasks: [clean, install]
- 141 [DEBUG] Style: Regular
- 142 [DEBUG] -----------------------------------------------------------------------
- 143 [DEBUG] Project: org.apache.cloudstack:xapi:jar:5.6.100-1-SNAPSHOT
- 144 [DEBUG] Tasks: [clean, install]
- 145 [DEBUG] Style: Regular
- 146 [DEBUG] -----------------------------------------------------------------------
- 147 [DEBUG] Project: org.apache.cloudstack:cloudstack-plugins:pom:4.1.0-SNAPSHOT
- 148 [DEBUG] Tasks: [clean, install]
- 149 [DEBUG] Style: Regular
- 150 [DEBUG] -----------------------------------------------------------------------
- 151 [DEBUG] Project: org.apache.cloudstack:cloud-plugin-planner-user-concentrated-pod:jar:4.1.0-SNAPSHOT
- 152 [DEBUG] Tasks: [clean, install]
- 153 [DEBUG] Style: Regular
- 154 [DEBUG] -----------------------------------------------------------------------
- 155 [DEBUG] Project: org.apache.cloudstack:cloud-plugin-planner-user-dispersing:jar:4.1.0-SNAPSHOT
- 156 [DEBUG] Tasks: [clean, install]
- 157 [DEBUG] Style: Regular
- 158 [DEBUG] -----------------------------------------------------------------------
- 159 [DEBUG] Project: org.apache.cloudstack:cloud-plugin-host-allocator-random:jar:4.1.0-SNAPSHOT
- 160 [DEBUG] Tasks: [clean, install]
- 161 [DEBUG] Style: Regular
- 162 [DEBUG] -----------------------------------------------------------------------
- 163 [DEBUG] Project: org.apache.cloudstack:cloud-plugin-hypervisor-ovm:jar:4.1.0-SNAPSHOT
- 164 [DEBUG] Tasks: [clean, install]
- 165 [DEBUG] Style: Regular
- 166 [DEBUG] -----------------------------------------------------------------------
- 167 [DEBUG] Project: org.apache.cloudstack:cloud-plugin-network-ovs:jar:4.1.0-SNAPSHOT
- 168 [DEBUG] Tasks: [clean, install]
- 169 [DEBUG] Style: Regular
- 170 [DEBUG] -----------------------------------------------------------------------
- 171 [DEBUG] Project: org.apache.cloudstack:cloud-plugin-hypervisor-xen:jar:4.1.0-SNAPSHOT
- 172 [DEBUG] Tasks: [clean, install]
- 173 [DEBUG] Style: Regular
- 174 [DEBUG] -----------------------------------------------------------------------
- 175 [DEBUG] Project: org.apache.cloudstack:cloud-plugin-hypervisor-kvm:jar:4.1.0-SNAPSHOT
- 176 [DEBUG] Tasks: [clean, install]
- 177 [DEBUG] Style: Regular
- 178 [DEBUG] -----------------------------------------------------------------------
- 179 [DEBUG] Project: org.apache.cloudstack:cloud-plugin-hypervisor-simulator:jar:4.1.0-SNAPSHOT
- 180 [DEBUG] Tasks: [clean, install]
- 181 [DEBUG] Style: Regular
- 182 [DEBUG] -----------------------------------------------------------------------
- 183 [DEBUG] Project: org.apache.cloudstack:cloud-plugin-network-elb:jar:4.1.0-SNAPSHOT
- 184 [DEBUG] Tasks: [clean, install]
- 185 [DEBUG] Style: Regular
- 186 [DEBUG] -----------------------------------------------------------------------
- 187 [DEBUG] Project: org.apache.cloudstack:cloud-plugin-network-nvp:jar:4.1.0-SNAPSHOT
- 188 [DEBUG] Tasks: [clean, install]
- 189 [DEBUG] Style: Regular
- 190 [DEBUG] -----------------------------------------------------------------------
- 191 [DEBUG] Project: org.apache.cloudstack:cloud-plugin-storage-allocator-random:jar:4.1.0-SNAPSHOT
- 192 [DEBUG] Tasks: [clean, install]
- 193 [DEBUG] Style: Regular
- 194 [DEBUG] -----------------------------------------------------------------------
- 195 [DEBUG] Project: org.apache.cloudstack:cloud-plugin-user-authenticator-ldap:jar:4.1.0-SNAPSHOT
- 196 [DEBUG] Tasks: [clean, install]
- 197 [DEBUG] Style: Regular
- 198 [DEBUG] -----------------------------------------------------------------------
- 199 [DEBUG] Project: org.apache.cloudstack:cloud-plugin-user-authenticator-md5:jar:4.1.0-SNAPSHOT
- 200 [DEBUG] Tasks: [clean, install]
- 201 [DEBUG] Style: Regular
- 202 [DEBUG] -----------------------------------------------------------------------
- 203 [DEBUG] Project: org.apache.cloudstack:cloud-plugin-user-authenticator-plaintext:jar:4.1.0-SNAPSHOT
- 204 [DEBUG] Tasks: [clean, install]
- 205 [DEBUG] Style: Regular
- 206 [DEBUG] -----------------------------------------------------------------------
- 207 [DEBUG] Project: org.apache.cloudstack:cloud-plugin-user-authenticator-sha256salted:jar:4.1.0-SNAPSHOT
- 208 [DEBUG] Tasks: [clean, install]
- 209 [DEBUG] Style: Regular
- 210 [DEBUG] -----------------------------------------------------------------------
- 211 [DEBUG] Project: org.apache.cloudstack:cloud-plugin-example-dns-notifier:jar:4.1.0-SNAPSHOT
- 212 [DEBUG] Tasks: [clean, install]
- 213 [DEBUG] Style: Regular
- 214 [DEBUG] -----------------------------------------------------------------------
- 215 [DEBUG] Project: org.apache.cloudstack:cloud-awsapi:war:4.1.0-SNAPSHOT
- 216 [DEBUG] Tasks: [clean, install]
- 217 [DEBUG] Style: Regular
- 218 [DEBUG] -----------------------------------------------------------------------
- 219 [DEBUG] Project: org.apache.cloudstack:cloud-client-ui:war:4.1.0-SNAPSHOT
- 220 [DEBUG] Tasks: [clean, install]
- 221 [DEBUG] Style: Regular
- 222 [DEBUG] -----------------------------------------------------------------------
- 223 [DEBUG] Project: org.apache.cloudstack:cloud-testclient:jar:4.1.0-SNAPSHOT
- 224 [DEBUG] Tasks: [clean, install]
- 225 [DEBUG] Style: Regular
- 226 [DEBUG] =======================================================================
- 227 [INFO]
- 228 [INFO] ------------------------------------------------------------------------
- 229 [INFO] Building Apache CloudStack 4.1.0-SNAPSHOT
- 230 [INFO] ------------------------------------------------------------------------
- 231 [DEBUG] Resolving plugin version for org.codehaus.mojo:cobertura-maven-plugin
- 232 [DEBUG] Could not find metadata org.codehaus.mojo:cobertura-maven-plugin/maven-metadata.xml in local (/root/.m2/repository)
- 233 [DEBUG] Skipped remote update check for org.codehaus.mojo:cobertura-maven-plugin/maven-metadata.xml, locally cached metadata up-to-date.
- 234 [DEBUG] Resolved plugin version for org.codehaus.mojo:cobertura-maven-plugin to 2.5.2 from repository central (http://repo.maven.apache.org/maven2, releases)
- 235 [DEBUG] Lifecycle default -> [validate, initialize, generate-sources, process-sources, generate-resources, process-resources, compile, process-classes, generate-test-sources, process-test-sourc es, generate-test-resources, process-test-resources, test-compile, process-test-classes, test, prepare-package, package, pre-integration-test, integration-test, post-integration-test, verify, i nstall, deploy]
- 236 [DEBUG] Lifecycle clean -> [pre-clean, clean, post-clean]
- 237 [DEBUG] Lifecycle site -> [pre-site, site, post-site, site-deploy]
- 238 [DEBUG] Lifecycle default -> [validate, initialize, generate-sources, process-sources, generate-resources, process-resources, compile, process-classes, generate-test-sources, process-test-sourc es, generate-test-resources, process-test-resources, test-compile, process-test-classes, test, prepare-package, package, pre-integration-test, integration-test, post-integration-test, verify, i nstall, deploy]
- 239 [DEBUG] Lifecycle clean -> [pre-clean, clean, post-clean]
- 240 [DEBUG] Lifecycle site -> [pre-site, site, post-site, site-deploy]
- 241 [DEBUG] Lifecycle default -> [validate, initialize, generate-sources, process-sources, generate-resources, process-resources, compile, process-classes, generate-test-sources, process-test-sourc es, generate-test-resources, process-test-resources, test-compile, process-test-classes, test, prepare-package, package, pre-integration-test, integration-test, post-integration-test, verify, i nstall, deploy]
- 242 [DEBUG] Lifecycle clean -> [pre-clean, clean, post-clean]
- 243 [DEBUG] Lifecycle site -> [pre-site, site, post-site, site-deploy]
- 244 [DEBUG] Lifecycle default -> [validate, initialize, generate-sources, process-sources, generate-resources, process-resources, compile, process-classes, generate-test-sources, process-test-sourc es, generate-test-resources, process-test-resources, test-compile, process-test-classes, test, prepare-package, package, pre-integration-test, integration-test, post-integration-test, verify, i nstall, deploy]
- 245 [DEBUG] Lifecycle clean -> [pre-clean, clean, post-clean]
- 246 [DEBUG] Lifecycle site -> [pre-site, site, post-site, site-deploy]
- 247 [DEBUG] Lifecycle default -> [validate, initialize, generate-sources, process-sources, generate-resources, process-resources, compile, process-classes, generate-test-sources, process-test-sourc es, generate-test-resources, process-test-resources, test-compile, process-test-classes, test, prepare-package, package, pre-integration-test, integration-test, post-integration-test, verify, i nstall, deploy]
- 248 [DEBUG] Lifecycle clean -> [pre-clean, clean, post-clean]
- 249 [DEBUG] Lifecycle site -> [pre-site, site, post-site, site-deploy]
- 250 [DEBUG] Lifecycle default -> [validate, initialize, generate-sources, process-sources, generate-resources, process-resources, compile, process-classes, generate-test-sources, process-test-sourc es, generate-test-resources, process-test-resources, test-compile, process-test-classes, test, prepare-package, package, pre-integration-test, integration-test, post-integration-test, verify, i nstall, deploy]
- 251 [DEBUG] Lifecycle clean -> [pre-clean, clean, post-clean]
- 252 [DEBUG] Lifecycle site -> [pre-site, site, post-site, site-deploy]
- 253 [DEBUG] === PROJECT BUILD PLAN ================================================
- 254 [DEBUG] Project: org.apache.cloudstack:cloudstack:4.1.0-SNAPSHOT
- 255 [DEBUG] Dependencies (collect): []
- 256 [DEBUG] Dependencies (resolve): []
- 257 [DEBUG] Repositories (dependencies): [apache.snapshots (http://repository.apache.org/snapshots, snapshots), central (http://repo.maven.apache.org/maven2, releases)]
- 258 [DEBUG] Repositories (plugins) : [central (http://repo.maven.apache.org/maven2, releases)]
- 259 [DEBUG] -----------------------------------------------------------------------
- 260 [DEBUG] Goal: org.apache.maven.plugins:maven-clean-plugin:2.5:clean (default-clean)
- 261 [DEBUG] Style: Regular
- 262 [DEBUG] Configuration: <?xml version="1.0" encoding="UTF-8"?>
- 263 <configuration>
- 264 <directory default-value="${project.build.directory}"/>
- 265 <excludeDefaultDirectories default-value="false">${clean.excludeDefaultDirectories}</excludeDefaultDirectories>
- 266 <failOnError default-value="true">${maven.clean.failOnError}</failOnError>
- 267 <followSymLinks default-value="false">${clean.followSymLinks}</followSymLinks>
- 268 <outputDirectory default-value="${project.build.outputDirectory}"/>
- 269 <reportDirectory default-value="${project.reporting.outputDirectory}"/>
- 270 <retryOnError default-value="true">${maven.clean.retryOnError}</retryOnError>
- 271 <skip default-value="false">${clean.skip}</skip>
- 272 <testOutputDirectory default-value="${project.build.testOutputDirectory}"/>
- 273 <verbose>${clean.verbose}</verbose>
- 274 </configuration>
- 275 [DEBUG] -----------------------------------------------------------------------
- 276 [DEBUG] Goal: org.apache.maven.plugins:maven-remote-resources-plugin:1.3:process (default)
- 277 [DEBUG] Style: Regular
- 278 [DEBUG] Configuration: <?xml version="1.0" encoding="UTF-8"?>
- 279 <configuration>
- 280 <appendedResourcesDirectory default-value="${basedir}/src/main/appended-resources"/>
- 281 <attached default-value="true"/>
- 282 <basedir default-value="${basedir}"/>
- 283 <encoding default-value="${project.build.sourceEncoding}">${encoding}</encoding>
- 284 <excludeArtifactIds default-value="">${excludeArtifactIds}</excludeArtifactIds>
- 285 <excludeGroupIds default-value="">${excludeGroupIds}</excludeGroupIds>
- 286 <excludeScope default-value="">${excludeScope}</excludeScope>
- 287 <excludeTransitive default-value="false">${excludeTransitive}</excludeTransitive>
- 288 <includeArtifactIds default-value="">${includeArtifactIds}</includeArtifactIds>
- 289 <includeGroupIds default-value="">${includeGroupIds}</includeGroupIds>
- 290 <includeProjectProperties default-value="false"/>
- 291 <includeScope default-value="runtime">${includeScope}</includeScope>
- 292 <localRepository default-value="${localRepository}"/>
- 293 <mavenSession default-value="${session}"/>
- 294 <outputDirectory default-value="${project.build.directory}/maven-shared-archive-resources"/>
- 295 <project default-value="${project}"/>
- 296 <remoteArtifactRepositories default-value="${project.remoteArtifactRepositories}"/>
- 297 <resourceBundles>
- 298 <resourceBundle>org.apache:apache-jar-resource-bundle:1.4</resourceBundle>
- 299 </resourceBundles>
- 300 <resources default-value="${project.build.resources}"/>
- 301 <runOnlyAtExecutionRoot default-value="false"/>
- 302 <skip default-value="false">${remoteresources.skip}</skip>
- 303 <useDefaultFilterDelimiters default-value="true"/>
- 304 </configuration>
- 305 [DEBUG] -----------------------------------------------------------------------
- 306 [DEBUG] Goal: org.apache.maven.plugins:maven-site-plugin:3.1:attach-descriptor (attach-descriptor)
- 307 [DEBUG] Style: Regular
- 308 [DEBUG] Configuration: <?xml version="1.0" encoding="UTF-8"?>
- 309 <configuration>
- 310 <basedir>${basedir}</basedir>
- 311 <inputEncoding default-value="${project.build.sourceEncoding}">${encoding}</inputEncoding>
- 312 <localRepository default-value="${localRepository}"/>
- 313 <locales>${locales}</locales>
- 314 <outputEncoding default-value="${project.reporting.outputEncoding}">${outputEncoding}</outputEncoding>
- 315 <pomPackagingOnly default-value="true"/>
- 316 <project default-value="${project}"/>
- 317 <reactorProjects default-value="${reactorProjects}"/>
- 318 <siteDirectory default-value="${basedir}/src/site"/>
- 319 </configuration>
- 320 [DEBUG] -----------------------------------------------------------------------
- 321 [DEBUG] Goal: org.apache.maven.plugins:maven-install-plugin:2.3.1:install (default-install)
- 322 [DEBUG] Style: Regular
- 323 [DEBUG] Configuration: <?xml version="1.0" encoding="UTF-8"?>
- 324 <configuration>
- 325 <artifact default-value="${project.artifact}"/>
- 326 <attachedArtifacts default-value="${project.attachedArtifacts}"/>
- 327 <createChecksum default-value="false">${createChecksum}</createChecksum>
- 328 <localRepository>${localRepository}</localRepository>
- 329 <packaging default-value="${project.packaging}"/>
- 330 <pomFile default-value="${project.file}"/>
- 331 <updateReleaseInfo default-value="false">${updateReleaseInfo}</updateReleaseInfo>
- 332 </configuration>
- 333 [DEBUG] =======================================================================
- 334 [INFO]
- 335 [INFO] --- maven-clean-plugin:2.5:clean (default-clean) @ cloudstack ---
- 336 [DEBUG] Created new class realm maven.api
- 337 [DEBUG] Importing foreign packages into class realm maven.api
- 338 [DEBUG] Imported: org.apache.maven.wagon.events < plexus.core
- 339 [DEBUG] Imported: org.sonatype.aether.transfer < plexus.core
- 340 [DEBUG] Imported: org.apache.maven.exception < plexus.core
- 341 [DEBUG] Imported: org.sonatype.aether.metadata < plexus.core
- 342 [DEBUG] Imported: org.codehaus.plexus.util.xml.Xpp3Dom < plexus.core
- 343 [DEBUG] Imported: org.sonatype.aether.collection < plexus.core
- 344 [DEBUG] Imported: org.sonatype.aether.version < plexus.core
- 345 [DEBUG] Imported: org.apache.maven.monitor < plexus.core
- 346 [DEBUG] Imported: org.apache.maven.wagon.repository < plexus.core
- 347 [DEBUG] Imported: org.apache.maven.repository < plexus.core
- 348 [DEBUG] Imported: org.apache.maven.wagon.resource < plexus.core
- 349 [DEBUG] Imported: org.codehaus.plexus.logging < plexus.core
- 350 [DEBUG] Imported: org.apache.maven.profiles < plexus.core
- 351 [DEBUG] Imported: org.sonatype.aether.repository < plexus.core
- 352 [DEBUG] Imported: org.apache.maven.classrealm < plexus.core
- 353 [DEBUG] Imported: org.apache.maven.execution < plexus.core
- 354 [DEBUG] Imported: org.sonatype.aether.artifact < plexus.core
- 355 [DEBUG] Imported: org.sonatype.aether.spi < plexus.core
- 356 [DEBUG] Imported: org.apache.maven.reporting < plexus.core
- 357 [DEBUG] Imported: org.apache.maven.usability < plexus.core
- 358 [DEBUG] Imported: org.codehaus.plexus.container < plexus.core
- 359 [DEBUG] Imported: org.codehaus.plexus.component < plexus.core
- 360 [DEBUG] Imported: org.codehaus.plexus.util.xml.pull.XmlSerializer < plexus.core
- 361 [DEBUG] Imported: org.apache.maven.wagon.authentication < plexus.core
- 362 [DEBUG] Imported: org.apache.maven.lifecycle < plexus.core
- 363 [DEBUG] Imported: org.codehaus.plexus.classworlds < plexus.core
- 364 [DEBUG] Imported: org.sonatype.aether.graph < plexus.core
- 365 [DEBUG] Imported: org.sonatype.aether.* < plexus.core
- 366 [DEBUG] Imported: org.apache.maven.settings < plexus.core
- 367 [DEBUG] Imported: org.codehaus.classworlds < plexus.core
- 368 [DEBUG] Imported: org.sonatype.aether.impl < plexus.core
- 369 [DEBUG] Imported: org.apache.maven.wagon.* < plexus.core
- 370 [DEBUG] Imported: org.apache.maven.toolchain < plexus.core
- 371 [DEBUG] Imported: org.sonatype.aether.deployment < plexus.core
- 372 [DEBUG] Imported: org.apache.maven.wagon.observers < plexus.core
- 373 [DEBUG] Imported: org.codehaus.plexus.util.xml.pull.XmlPullParserException < plexus.core
- 374 [DEBUG] Imported: org.codehaus.plexus.util.xml.pull.XmlPullParser < plexus.core
- 375 [DEBUG] Imported: org.apache.maven.configuration < plexus.core
- 376 [DEBUG] Imported: org.apache.maven.cli < plexus.core
- 377 [DEBUG] Imported: org.sonatype.aether.installation < plexus.core
- 378 [DEBUG] Imported: org.codehaus.plexus.context < plexus.core
- 379 [DEBUG] Imported: org.apache.maven.wagon.authorization < plexus.core
- 380 [DEBUG] Imported: org.apache.maven.project < plexus.core
- 381 [DEBUG] Imported: org.apache.maven.rtinfo < plexus.core
- 382 [DEBUG] Imported: org.codehaus.plexus.lifecycle < plexus.core
- 383 [DEBUG] Imported: org.codehaus.plexus.configuration < plexus.core
- 384 [DEBUG] Imported: org.apache.maven.artifact < plexus.core
- 385 [DEBUG] Imported: org.apache.maven.model < plexus.core
- 386 [DEBUG] Imported: org.apache.maven.* < plexus.core
- 387 [DEBUG] Imported: org.apache.maven.wagon.proxy < plexus.core
- 388 [DEBUG] Imported: org.sonatype.aether.resolution < plexus.core
- 389 [DEBUG] Imported: org.apache.maven.plugin < plexus.core
- 390 [DEBUG] Imported: org.codehaus.plexus.* < plexus.core
- 391 [DEBUG] Imported: org.codehaus.plexus.personality < plexus.core
- 392 [DEBUG] Populating class realm maven.api
- 393 [DEBUG] org.apache.maven.plugins:maven-clean-plugin:jar:2.5:
- 394 [DEBUG] org.apache.maven:maven-plugin-api:jar:2.0.6:compile
- 395 [DEBUG] org.codehaus.plexus:plexus-utils:jar:3.0:compile
- 396 [DEBUG] Created new class realm plugin>org.apache.maven.plugins:maven-clean-plugin:2.5
- 397 [DEBUG] Importing foreign packages into class realm plugin>org.apache.maven.plugins:maven-clean-plugin:2.5
- 398 [DEBUG] Imported: < maven.api
- 399 [DEBUG] Populating class realm plugin>org.apache.maven.plugins:maven-clean-plugin:2.5
- 400 [DEBUG] Included: org.apache.maven.plugins:maven-clean-plugin:jar:2.5
- 401 [DEBUG] Included: org.codehaus.plexus:plexus-utils:jar:3.0
- 402 [DEBUG] Excluded: org.apache.maven:maven-plugin-api:jar:2.0.6
- 403 [DEBUG] Configuring mojo org.apache.maven.plugins:maven-clean-plugin:2.5:clean from plugin realm ClassRealm[plugin>org.apache.maven.plugins:maven-clean-plugin:2.5, parent: sun.misc.Launcher$App ClassLoader@d9f9c3]
- 404 [DEBUG] Configuring mojo 'org.apache.maven.plugins:maven-clean-plugin:2.5:clean' with basic configurator -->
- 405 [DEBUG] (f) directory = /home/vswamy/incubator-cloudstack/target
- 406 [DEBUG] (f) excludeDefaultDirectories = false
- 407 [DEBUG] (f) failOnError = true
- 408 [DEBUG] (f) followSymLinks = false
- 409 [DEBUG] (f) outputDirectory = /home/vswamy/incubator-cloudstack/target/classes
- 410 [DEBUG] (f) reportDirectory = /home/vswamy/incubator-cloudstack/target/site
- 411 [DEBUG] (f) retryOnError = true
- 412 [DEBUG] (f) skip = false
- 413 [DEBUG] (f) testOutputDirectory = /home/vswamy/incubator-cloudstack/target/test-classes
- 414 [DEBUG] -- end configuration --
- 415 [DEBUG] Skipping non-existing directory /home/vswamy/incubator-cloudstack/target
- 416 [DEBUG] Skipping non-existing directory /home/vswamy/incubator-cloudstack/target/classes
- 417 [DEBUG] Skipping non-existing directory /home/vswamy/incubator-cloudstack/target/test-classes
- 418 [DEBUG] Skipping non-existing directory /home/vswamy/incubator-cloudstack/target/site
- 419 [INFO]
- 420 [INFO] --- maven-remote-resources-plugin:1.3:process (default) @ cloudstack ---
- 421 [DEBUG] Using connector WagonRepositoryConnector with priority 0 for http://repo.maven.apache.org/maven2
- 422 Downloading: http://repo.maven.apache.org/maven2/classworlds/classworlds/1.1-alpha-2/classworlds-1.1-alpha-2.pom
- 423 ^M[DEBUG] Writing resolution tracking file /root/.m2/repository/classworlds/classworlds/1.1-alpha-2/classworlds-1.1-alpha-2.pom.lastUpdated
- 424 [DEBUG] Using connector WagonRepositoryConnector with priority 0 for http://repo.maven.apache.org/maven2
- 425 Downloading: http://repo.maven.apache.org/maven2/classworlds/classworlds/1.1/classworlds-1.1.pom
- 426 ^M[DEBUG] Writing resolution tracking file /root/.m2/repository/classworlds/classworlds/1.1/classworlds-1.1.pom.lastUpdated
- 427 [INFO] ------------------------------------------------------------------------
- 428 [INFO] Reactor Summary:
- 429 [INFO]
- 430 [INFO] Apache CloudStack ................................. FAILURE [2.623s]
- 431 [INFO] Apache CloudStack Utils ........................... SKIPPED
- 432 [INFO] Apache CloudStack API ............................. SKIPPED
- 433 [INFO] Apache CloudStack Core ............................ SKIPPED
- 434 [INFO] Apache CloudStack Agents .......................... SKIPPED
- 435 [INFO] Apache CloudStack SystemVM Patches ................ SKIPPED
- 436 [INFO] Apache CloudStack Console Proxy ................... SKIPPED
- 437 [INFO] Apache CloudStack Server .......................... SKIPPED
- 438 [INFO] Apache CloudStack Usage Server .................... SKIPPED
- 439 [INFO] Apache XenSource XAPI ............................. SKIPPED
- 440 [INFO] Apache CloudStack Plugin POM ...................... SKIPPED
- 441 [INFO] Apache CloudStack Plugin - User Concentrated Pod Deployment Planner SKIPPED
- 442 [INFO] Apache CloudStack Plugin - User Dispersing Deployment Planner SKIPPED
- 443 [INFO] Apache CloudStack Plugin - Host Allocator Random .. SKIPPED
- 444 [INFO] Apache CloudStack Plugin - Hypervisor OracleVM .... SKIPPED
- 445 [INFO] Apache CloudStack Plugin - Open vSwitch ........... SKIPPED
- 446 [INFO] Apache CloudStack Plugin - Hypervisor Xen ......... SKIPPED
- 447 [INFO] Apache CloudStack Plugin - Hypervisor KVM ......... SKIPPED
- 448 [INFO] Apache CloudStack Plugin - Hypervisor Simulator ... SKIPPED
- 449 [INFO] Apache CloudStack Plugin - Network Elastic Load Balancer SKIPPED
- 450 [INFO] Apache CloudStack Plugin - Network Nicira NVP ..... SKIPPED
- 451 [INFO] Apache CloudStack Plugin - Storage Allocator Random SKIPPED
- 452 [INFO] Apache CloudStack Plugin - User Authenticator LDAP SKIPPED
- 453 [INFO] Apache CloudStack Plugin - User Authenticator MD5 . SKIPPED
- 454 [INFO] Apache CloudStack Plugin - User Authenticator Plain Text SKIPPED
- 455 [INFO] Apache CloudStack Plugin - User Authenticator SHA256 Salted SKIPPED
- 456 [INFO] CloudStack Dns Notifier Example ................... SKIPPED
- 457 [INFO] Apache CloudStack AWS API Bridge .................. SKIPPED
- 458 [INFO] Apache CloudStack Client UI ....................... SKIPPED
- 459 [INFO] Apache CloudStack Test ............................ SKIPPED
- 460 [INFO] ------------------------------------------------------------------------
- 461 [INFO] BUILD FAILURE
- 462 [INFO] ------------------------------------------------------------------------
- 463 [INFO] Total time: 3.596s
- 464 [INFO] Finished at: Thu Dec 27 21:36:31 IST 2012
- 465 [INFO] Final Memory: 8M/19M
- 466 [INFO] ------------------------------------------------------------------------
- 467 [ERROR] Failed to execute goal org.apache.maven.plugins:maven-remote-resources-plugin:1.3:process (default) on project cloudstack: Execution default of goal org.apache.maven.plugins:maven-remot e-resources-plugin:1.3:process failed: Plugin org.apache.maven.plugins:maven-remote-resources-plugin:1.3 or one of its dependencies could not be resolved: Failed to collect dependencies for org .apache.maven.plugins:maven-remote-resources-plugin:jar:1.3 (): Failed to read artifact descriptor for classworlds:classworlds:jar:1.1-alpha-2: Could not transfer artifact classworlds:classworl ds:pom:1.1-alpha-2 from/to central (http://repo.maven.apache.org/maven2): Failed to transfer file: http://repo.maven.apache.org/maven2/classworlds/classworlds/1.1-alpha-2/classworlds-1.1-alpha- 2.pom. Return code is: 503, ReasonPhrase:Service Unavailable. -> [Help 1]
- 468 org.apache.maven.lifecycle.LifecycleExecutionException: Failed to execute goal org.apache.maven.plugins:maven-remote-resources-plugin:1.3:process (default) on project cloudstack: Execution defa ult of goal org.apache.maven.plugins:maven-remote-resources-plugin:1.3:process failed: Plugin org.apache.maven.plugins:maven-remote-resources-plugin:1.3 or one of its dependencies could not be resolved: Failed to collect dependencies for org.apache.maven.plugins:maven-remote-resources-plugin:jar:1.3 ()
- 469 at org.apache.maven.lifecycle.internal.MojoExecutor.execute(MojoExecutor.java:225)
- 470 at org.apache.maven.lifecycle.internal.MojoExecutor.execute(MojoExecutor.java:153)
- 471 at org.apache.maven.lifecycle.internal.MojoExecutor.execute(MojoExecutor.java:145)
- 472 at org.apache.maven.lifecycle.internal.LifecycleModuleBuilder.buildProject(LifecycleModuleBuilder.java:84)
- 473 at org.apache.maven.lifecycle.internal.LifecycleModuleBuilder.buildProject(LifecycleModuleBuilder.java:59)
- 474 at org.apache.maven.lifecycle.internal.LifecycleStarter.singleThreadedBuild(LifecycleStarter.java:183)
- 475 at org.apache.maven.lifecycle.internal.LifecycleStarter.execute(LifecycleStarter.java:161)
- 476 at org.apache.maven.DefaultMaven.doExecute(DefaultMaven.java:320)
- 477 at org.apache.maven.DefaultMaven.execute(DefaultMaven.java:156)
- 478 at org.apache.maven.cli.MavenCli.execute(MavenCli.java:537)
- 479 at org.apache.maven.cli.MavenCli.doMain(MavenCli.java:196)
- 480 at org.apache.maven.cli.MavenCli.main(MavenCli.java:141)
- 481 at sun.reflect.NativeMethodAccessorImpl.invoke0(Native Method)
- 482 at sun.reflect.NativeMethodAccessorImpl.invoke(NativeMethodAccessorImpl.java:57)
- 483 at sun.reflect.DelegatingMethodAccessorImpl.invoke(DelegatingMethodAccessorImpl.java:43)
- 484 at java.lang.reflect.Method.invoke(Method.java:616)
- 485 at org.codehaus.plexus.classworlds.launcher.Launcher.launchEnhanced(Launcher.java:290)
- 486 at org.codehaus.plexus.classworlds.launcher.Launcher.launch(Launcher.java:230)
- 487 at org.codehaus.plexus.classworlds.launcher.Launcher.mainWithExitCode(Launcher.java:409)
- 488 at org.codehaus.plexus.classworlds.launcher.Launcher.main(Launcher.java:352)
- 489 Caused by: org.apache.maven.plugin.PluginExecutionException: Execution default of goal org.apache.maven.plugins:maven-remote-resources-plugin:1.3:process failed: Plugin org.apache.maven.plugins :maven-remote-resources-plugin:1.3 or one of its dependencies could not be resolved: Failed to collect dependencies for org.apache.maven.plugins:maven-remote-resources-plugin:jar:1.3 ()
- 490 at org.apache.maven.plugin.DefaultBuildPluginManager.executeMojo(DefaultBuildPluginManager.java:82)
- 491 at org.apache.maven.lifecycle.internal.MojoExecutor.execute(MojoExecutor.java:209)
- 492 ... 19 more
- 493 Caused by: org.apache.maven.plugin.PluginResolutionException: Plugin org.apache.maven.plugins:maven-remote-resources-plugin:1.3 or one of its dependencies could not be resolved: Failed to colle ct dependencies for org.apache.maven.plugins:maven-remote-resources-plugin:jar:1.3 ()
- 494 at org.apache.maven.plugin.internal.DefaultPluginDependenciesResolver.resolve(DefaultPluginDependenciesResolver.java:211)
- 495 at org.apache.maven.plugin.internal.DefaultMavenPluginManager.createPluginRealm(DefaultMavenPluginManager.java:353)
- 496 at org.apache.maven.plugin.internal.DefaultMavenPluginManager.setupPluginRealm(DefaultMavenPluginManager.java:321)
- 497 at org.apache.maven.plugin.DefaultBuildPluginManager.getPluginRealm(DefaultBuildPluginManager.java:175)
- 498 at org.apache.maven.plugin.DefaultBuildPluginManager.executeMojo(DefaultBuildPluginManager.java:78)
- 499 ... 20 more
- 500 Caused by: org.sonatype.aether.collection.DependencyCollectionException: Failed to collect dependencies for org.apache.maven.plugins:maven-remote-resources-plugin:jar:1.3 ()
- 501 at org.sonatype.aether.impl.internal.DefaultDependencyCollector.collectDependencies(DefaultDependencyCollector.java:258)
- 502 at org.sonatype.aether.impl.internal.DefaultRepositorySystem.collectDependencies(DefaultRepositorySystem.java:308)
- 503 at org.apache.maven.plugin.internal.DefaultPluginDependenciesResolver.resolve(DefaultPluginDependenciesResolver.java:199)
- 504 ... 24 more
- 505 Caused by: org.sonatype.aether.resolution.ArtifactDescriptorException: Failed to read artifact descriptor for classworlds:classworlds:jar:1.1-alpha-2
- 506 at org.apache.maven.repository.internal.DefaultArtifactDescriptorReader.loadPom(DefaultArtifactDescriptorReader.java:296)
- 507 at org.apache.maven.repository.internal.DefaultArtifactDescriptorReader.readArtifactDescriptor(DefaultArtifactDescriptorReader.java:186)
- 508 at org.sonatype.aether.impl.internal.DefaultDependencyCollector.process(DefaultDependencyCollector.java:412)
- 509 at org.sonatype.aether.impl.internal.DefaultDependencyCollector.process(DefaultDependencyCollector.java:544)
- 510 at org.sonatype.aether.impl.internal.DefaultDependencyCollector.process(DefaultDependencyCollector.java:544)
- 511 at org.sonatype.aether.impl.internal.DefaultDependencyCollector.process(DefaultDependencyCollector.java:544)
- 512 at org.sonatype.aether.impl.internal.DefaultDependencyCollector.collectDependencies(DefaultDependencyCollector.java:240)
- 513 ... 26 more
- 514 Caused by: org.sonatype.aether.resolution.ArtifactResolutionException: Could not transfer artifact classworlds:classworlds:pom:1.1-alpha-2 from/to central (http://repo.maven.apache.org/maven2): Failed to transfer file: http://repo.maven.apache.org/maven2/classworlds/classworlds/1.1-alpha-2/classworlds-1.1-alpha-2.pom. Return code is: 503, ReasonPhrase:Service Unavailable.
- 515 at org.sonatype.aether.impl.internal.DefaultArtifactResolver.resolve(DefaultArtifactResolver.java:538)
- 516 at org.sonatype.aether.impl.internal.DefaultArtifactResolver.resolveArtifacts(DefaultArtifactResolver.java:216)
- 517 at org.sonatype.aether.impl.internal.DefaultArtifactResolver.resolveArtifact(DefaultArtifactResolver.java:193)
- 518 at org.apache.maven.repository.internal.DefaultArtifactDescriptorReader.loadPom(DefaultArtifactDescriptorReader.java:281)
- 519 ... 32 more
- 520 Caused by: org.sonatype.aether.transfer.ArtifactTransferException: Could not transfer artifact classworlds:classworlds:pom:1.1-alpha-2 from/to central (http://repo.maven.apache.org/maven2): Fai led to transfer file: http://repo.maven.apache.org/maven2/classworlds/classworlds/1.1-alpha-2/classworlds-1.1-alpha-2.pom. Return code is: 503, ReasonPhrase:Service Unavailable.
- led to transfer file: http://repo.maven.apache.org/maven2/classworlds/classworlds/1.1-alpha-2/classworlds-1.1-alpha-2.pom. Return code is: 503, ReasonPhrase:Service Unavailable.
- 521 at org.sonatype.aether.connector.wagon.WagonRepositoryConnector$4.wrap(WagonRepositoryConnector.java:951)
- 522 at org.sonatype.aether.connector.wagon.WagonRepositoryConnector$4.wrap(WagonRepositoryConnector.java:941)
- 523 at org.sonatype.aether.connector.wagon.WagonRepositoryConnector$GetTask.run(WagonRepositoryConnector.java:669)
- 524 at org.sonatype.aether.util.concurrency.RunnableErrorForwarder$1.run(RunnableErrorForwarder.java:60)
- 525 at java.util.concurrent.ThreadPoolExecutor.runWorker(ThreadPoolExecutor.java:1110)
- 526 at java.util.concurrent.ThreadPoolExecutor$Worker.run(ThreadPoolExecutor.java:603)
- 527 at java.lang.Thread.run(Thread.java:679)
- 528 Caused by: org.apache.maven.wagon.TransferFailedException: Failed to transfer file: http://repo.maven.apache.org/maven2/classworlds/classworlds/1.1-alpha-2/classworlds-1.1-alpha-2.pom. Return c ode is: 503, ReasonPhrase:Service Unavailable.
- 529 at org.apache.maven.wagon.shared.http4.AbstractHttpClientWagon.fillInputData(AbstractHttpClientWagon.java:852)
- 530 at org.apache.maven.wagon.StreamWagon.getInputStream(StreamWagon.java:116)
- 531 at org.apache.maven.wagon.StreamWagon.getIfNewer(StreamWagon.java:88)
- 532 at org.apache.maven.wagon.StreamWagon.get(StreamWagon.java:61)
- 533 at org.sonatype.aether.connector.wagon.WagonRepositoryConnector$GetTask.run(WagonRepositoryConnector.java:601)
- 534 ... 4 more
- 535 [ERROR]
- 536 [ERROR]
- 537 [ERROR] For more information about the errors and possible solutions, please read the following articles:
- 538 [ERROR] [Help 1] http://cwiki.apache.org/confluence/display/MAVEN/PluginResolutionException
Advertisement
Add Comment
Please, Sign In to add comment