Pastebin launched a little side project called HostCabi.net, check it out ;-)Don't like ads? PRO users don't see any ads ;-)
Guest

Untitled

By: a guest on Mar 28th, 2011  |  syntax: None  |  size: 19.53 KB  |  hits: 70  |  expires: Never
download  |  raw  |  embed  |  report abuse  |  print
Text below is selected. Please press Ctrl+C to copy to your clipboard. (⌘+C on Mac)
  1. /home/doriad/bin/CMake/bin/cmake -H/media/portable/Projects/src/lafarren-image-completer -B/media/portable/Projects/bin/lafarren-image-completer --check-build-system CMakeFiles/Makefile.cmake 0
  2. /home/doriad/bin/CMake/bin/cmake -E cmake_progress_start /media/portable/Projects/bin/lafarren-image-completer/CMakeFiles /media/portable/Projects/bin/lafarren-image-completer/CMakeFiles/progress.marks
  3. make -f CMakeFiles/Makefile2 all
  4. make[1]: Entering directory `/media/portable/Projects/bin/lafarren-image-completer'
  5. make -f CMakeFiles/Tech.dir/build.make CMakeFiles/Tech.dir/depend
  6. make[2]: Entering directory `/media/portable/Projects/bin/lafarren-image-completer'
  7. cd /media/portable/Projects/bin/lafarren-image-completer && /home/doriad/bin/CMake/bin/cmake -E cmake_depends "Unix Makefiles" /media/portable/Projects/src/lafarren-image-completer /media/portable/Projects/src/lafarren-image-completer /media/portable/Projects/bin/lafarren-image-completer /media/portable/Projects/bin/lafarren-image-completer /media/portable/Projects/bin/lafarren-image-completer/CMakeFiles/Tech.dir/DependInfo.cmake --color=
  8. make[2]: Leaving directory `/media/portable/Projects/bin/lafarren-image-completer'
  9. make -f CMakeFiles/Tech.dir/build.make CMakeFiles/Tech.dir/build
  10. make[2]: Entering directory `/media/portable/Projects/bin/lafarren-image-completer'
  11. /home/doriad/bin/CMake/bin/cmake -E cmake_progress_report /media/portable/Projects/bin/lafarren-image-completer/CMakeFiles 37
  12. [  2%] Building CXX object CMakeFiles/Tech.dir/src/tech/Pch.cpp.o
  13. /usr/lib/ccache/c++   -D_FILE_OFFSET_BITS=64 -DWXUSINGDLL -D__WXGTK__ -DITK_IO_FACTORY_REGISTER_MANAGER -pthread  -ftemplate-depth-50 -Wall -Wno-deprecated -I/home/doriad/src/ITK/ITK/Core/TestKernel/include -I/home/doriad/src/ITK/ITK/Filtering/SpatialFunction/include -I/home/doriad/src/ITK/ITK/Filtering/QuadEdgeMeshFiltering/include -I/home/doriad/src/ITK/ITK/Core/QuadEdgeMesh/include -I/home/doriad/src/ITK/ITK/Segmentation/LabelVoting/include -I/home/doriad/src/ITK/ITK/Filtering/ImageLabel/include -I/home/doriad/src/ITK/ITK/Filtering/ImageCompose/include -I/home/doriad/src/ITK/ITK/IO/VTK/include -I/home/doriad/src/ITK/ITK/IO/Stimulate/include -I/home/doriad/src/ITK/ITK/IO/Spatialobjects/include -I/home/doriad/src/ITK/ITK/IO/XML/include -I/home/doriad/src/ITK/ITK/IO/Siemens/include -I/home/doriad/src/ITK/ITK/IO/RAW/include -I/home/doriad/src/ITK/ITK/IO/NRRD/include -I/home/doriad/src/ITK/ITK/Utilities/NrrdIO/src -I/home/doriad/bin/ITK/ITK/Utilities/NrrdIO/src/NrrdIO -I/home/doriad/src/ITK/ITK/IO/NIFTI/include -I/home/doriad/src/ITK/ITK/Utilities/NIFTI/src/nifti/znzlib -I/home/doriad/src/ITK/ITK/Utilities/NIFTI/src/nifti/niftilib -I/home/doriad/src/ITK/ITK/IO/Meta/include -I/home/doriad/src/ITK/ITK/Utilities/MetaIO/src/MetaIO -I/home/doriad/src/ITK/ITK/IO/LSM/include -I/home/doriad/src/ITK/ITK/IO/TIFF/include -I/home/doriad/src/ITK/ITK/Utilities/TIFF/src -I/home/doriad/bin/ITK/ITK/Utilities/TIFF/src -I/home/doriad/src/ITK/ITK/IO/JPEG/include -I/home/doriad/src/ITK/ITK/Utilities/JPEG/src -I/home/doriad/bin/ITK/ITK/Utilities/JPEG/src -I/home/doriad/src/ITK/ITK/IO/GIPL/include -I/home/doriad/src/ITK/ITK/IO/GE/include -I/home/doriad/src/ITK/ITK/IO/IPL/include -I/home/doriad/src/ITK/ITK/IO/GDCM/include -I/home/doriad/src/ITK/ITK/IO/BioRad/include -I/home/doriad/src/ITK/ITK/IO/BMP/include -I/home/doriad/src/ITK/ITK/Utilities/GDCM/src/gdcm/Source/DataStructureAndEncodingDefinition -I/home/doriad/src/ITK/ITK/Utilities/GDCM/src/gdcm/Source/MessageExchangeDefinition -I/home/doriad/src/ITK/ITK/Utilities/GDCM/src/gdcm/Source/InformationObjectDefinition -I/home/doriad/src/ITK/ITK/Utilities/GDCM/src/gdcm/Source/Common -I/home/doriad/src/ITK/ITK/Utilities/GDCM/src/gdcm/Source/DataDictionary -I/home/doriad/src/ITK/ITK/Utilities/GDCM/src/gdcm/Source/MediaStorageAndFileFormat -I/home/doriad/bin/ITK/ITK/Utilities/GDCM/src/gdcm/Source/Common -I/home/doriad/bin/ITK/ITK/Utilities/GDCM -I/home/doriad/src/ITK/ITK/Utilities/OpenJPEG/src/openjpeg -I/home/doriad/bin/ITK/ITK/Utilities/OpenJPEG/src/openjpeg -I/home/doriad/src/ITK/ITK/Filtering/FFT/include -I/home/doriad/src/ITK/ITK/Utilities/Expat/src/expat -I/home/doriad/bin/ITK/ITK/Utilities/Expat/src/expat -I/home/doriad/src/ITK/ITK/Filtering/DiffusionTensorImage/include -I/home/doriad/src/ITK/ITK/Filtering/DeformationField/include -I/home/doriad/src/ITK/ITK/Filtering/BiasCorrection/include -I/home/doriad/src/ITK/ITK/Numerics/Polynomials/include -I/home/doriad/src/ITK/ITK/Filtering/AntiAlias/include -I/home/doriad/src/ITK/ITK/Segmentation/LevelSets/include -I/home/doriad/src/ITK/ITK/Segmentation/SignedDistanceFunction/include -I/home/doriad/src/ITK/ITK/Numerics/Optimizers/include -I/home/doriad/src/ITK/ITK/Filtering/ImageFeature/include -I/home/doriad/src/ITK/ITK/Core/SpatialObjects/include -I/home/doriad/src/ITK/ITK/Core/Mesh/include -I/home/doriad/src/ITK/ITK/Filtering/ImageGradient/include -I/home/doriad/src/ITK/ITK/Filtering/Smoothing/include -I/home/doriad/src/ITK/ITK/Filtering/ImageCompare/include -I/home/doriad/src/ITK/ITK/Filtering/DistanceMap/include -I/home/doriad/src/ITK/ITK/Numerics/NarrowBand/include -I/home/doriad/src/ITK/ITK/Filtering/MathematicalMorphology/include -I/home/doriad/src/ITK/ITK/IO/PNG/include -I/home/doriad/src/ITK/ITK/Utilities/PNG/src -I/home/doriad/bin/ITK/ITK/Utilities/PNG/src -I/home/doriad/src/ITK/ITK/Utilities/ZLIB/src -I/home/doriad/bin/ITK/ITK/Utilities/ZLIB/src -I/home/doriad/src/ITK/ITK/IO/Base/include -I/home/doriad/src/ITK/ITK/Segmentation/ConnectedComponents/include -I/home/doriad/src/ITK/ITK/Filtering/Thresholding/include -I/home/doriad/src/ITK/ITK/Filtering/ImageIntensity/include -I/home/doriad/src/ITK/ITK/Filtering/Path/include -I/home/doriad/src/ITK/ITK/Filtering/AnisotropicSmoothing/include -I/home/doriad/src/ITK/ITK/Filtering/ImageGrid/include -I/home/doriad/src/ITK/ITK/Core/ImageFunction/include -I/home/doriad/src/ITK/ITK/Core/Transform/include -I/home/doriad/src/ITK/ITK/Filtering/ImageStatistics/include -I/home/doriad/src/ITK/ITK/Numerics/Statistics/include -I/home/doriad/bin/ITK/ITK/Utilities/Netlib -I/home/doriad/src/ITK/ITK/Core/ImageAdaptors/include -I/home/doriad/src/ITK/ITK/Filtering/CurvatureFlow/include -I/home/doriad/src/ITK/ITK/Filtering/ImageFilterBase/include -I/home/doriad/src/ITK/ITK/Core/FiniteDifference/include -I/home/doriad/src/ITK/ITK/Core/Common/include -I/home/doriad/bin/ITK/ITK/Core/Common -I/home/doriad/src/ITK/ITK/Utilities/VNLInstantiation/include -I/home/doriad/bin/ITK/ITK/Utilities/VNL/src/vxl/core -I/home/doriad/bin/ITK/ITK/Utilities/VNL/src/vxl/vcl -I/home/doriad/bin/ITK/ITK/Utilities/VNL/src/vxl/v3p/netlib -I/home/doriad/src/ITK/ITK/Utilities/VNL/src/vxl/core -I/home/doriad/src/ITK/ITK/Utilities/VNL/src/vxl/vcl -I/home/doriad/src/ITK/ITK/Utilities/VNL/src/vxl/v3p/netlib -I/home/doriad/bin/ITK/ITK/Utilities/KWSys/src -I/media/portable/Projects/bin/lafarren-image-completer/ITKIOFactoryRegistration -I/media/portable/src/Eigen -I/media/portable/src/Eigen/unsupported -I/usr/include/suitesparse -isystem /home/doriad/bin/wxWidgets2.9/lib/wx/include/gtk2-unicode-2.9 -isystem /home/doriad/src/wxWidgets-2.9.1/include -I/media/portable/Projects/src/lafarren-image-completer/src/image-completer-cmd -I/media/portable/Projects/src/lafarren-image-completer/src/image-completer-lib -I/media/portable/Projects/src/lafarren-image-completer/src/image-completer-lib/api -I/media/portable/Projects/src/lafarren-image-completer/src/image-completer-lib/impl -I/media/portable/Projects/src/lafarren-image-completer/src/image-completer-lib/impl/compositors -I/media/portable/Projects/src/lafarren-image-completer/src/image-completer-lib/impl/energy-calculators -I/media/portable/Projects/src/lafarren-image-completer/src/tech/tech -I/media/portable/Projects/src/lafarren-image-completer/src/tech   -o CMakeFiles/Tech.dir/src/tech/Pch.cpp.o -c /media/portable/Projects/src/lafarren-image-completer/src/tech/Pch.cpp
  14. /home/doriad/bin/CMake/bin/cmake -E cmake_progress_report /media/portable/Projects/bin/lafarren-image-completer/CMakeFiles 38
  15. [  4%] Building CXX object CMakeFiles/Tech.dir/src/tech/tech/Atomic.cpp.o
  16. /usr/lib/ccache/c++   -D_FILE_OFFSET_BITS=64 -DWXUSINGDLL -D__WXGTK__ -DITK_IO_FACTORY_REGISTER_MANAGER -pthread  -ftemplate-depth-50 -Wall -Wno-deprecated -I/home/doriad/src/ITK/ITK/Core/TestKernel/include -I/home/doriad/src/ITK/ITK/Filtering/SpatialFunction/include -I/home/doriad/src/ITK/ITK/Filtering/QuadEdgeMeshFiltering/include -I/home/doriad/src/ITK/ITK/Core/QuadEdgeMesh/include -I/home/doriad/src/ITK/ITK/Segmentation/LabelVoting/include -I/home/doriad/src/ITK/ITK/Filtering/ImageLabel/include -I/home/doriad/src/ITK/ITK/Filtering/ImageCompose/include -I/home/doriad/src/ITK/ITK/IO/VTK/include -I/home/doriad/src/ITK/ITK/IO/Stimulate/include -I/home/doriad/src/ITK/ITK/IO/Spatialobjects/include -I/home/doriad/src/ITK/ITK/IO/XML/include -I/home/doriad/src/ITK/ITK/IO/Siemens/include -I/home/doriad/src/ITK/ITK/IO/RAW/include -I/home/doriad/src/ITK/ITK/IO/NRRD/include -I/home/doriad/src/ITK/ITK/Utilities/NrrdIO/src -I/home/doriad/bin/ITK/ITK/Utilities/NrrdIO/src/NrrdIO -I/home/doriad/src/ITK/ITK/IO/NIFTI/include -I/home/doriad/src/ITK/ITK/Utilities/NIFTI/src/nifti/znzlib -I/home/doriad/src/ITK/ITK/Utilities/NIFTI/src/nifti/niftilib -I/home/doriad/src/ITK/ITK/IO/Meta/include -I/home/doriad/src/ITK/ITK/Utilities/MetaIO/src/MetaIO -I/home/doriad/src/ITK/ITK/IO/LSM/include -I/home/doriad/src/ITK/ITK/IO/TIFF/include -I/home/doriad/src/ITK/ITK/Utilities/TIFF/src -I/home/doriad/bin/ITK/ITK/Utilities/TIFF/src -I/home/doriad/src/ITK/ITK/IO/JPEG/include -I/home/doriad/src/ITK/ITK/Utilities/JPEG/src -I/home/doriad/bin/ITK/ITK/Utilities/JPEG/src -I/home/doriad/src/ITK/ITK/IO/GIPL/include -I/home/doriad/src/ITK/ITK/IO/GE/include -I/home/doriad/src/ITK/ITK/IO/IPL/include -I/home/doriad/src/ITK/ITK/IO/GDCM/include -I/home/doriad/src/ITK/ITK/IO/BioRad/include -I/home/doriad/src/ITK/ITK/IO/BMP/include -I/home/doriad/src/ITK/ITK/Utilities/GDCM/src/gdcm/Source/DataStructureAndEncodingDefinition -I/home/doriad/src/ITK/ITK/Utilities/GDCM/src/gdcm/Source/MessageExchangeDefinition -I/home/doriad/src/ITK/ITK/Utilities/GDCM/src/gdcm/Source/InformationObjectDefinition -I/home/doriad/src/ITK/ITK/Utilities/GDCM/src/gdcm/Source/Common -I/home/doriad/src/ITK/ITK/Utilities/GDCM/src/gdcm/Source/DataDictionary -I/home/doriad/src/ITK/ITK/Utilities/GDCM/src/gdcm/Source/MediaStorageAndFileFormat -I/home/doriad/bin/ITK/ITK/Utilities/GDCM/src/gdcm/Source/Common -I/home/doriad/bin/ITK/ITK/Utilities/GDCM -I/home/doriad/src/ITK/ITK/Utilities/OpenJPEG/src/openjpeg -I/home/doriad/bin/ITK/ITK/Utilities/OpenJPEG/src/openjpeg -I/home/doriad/src/ITK/ITK/Filtering/FFT/include -I/home/doriad/src/ITK/ITK/Utilities/Expat/src/expat -I/home/doriad/bin/ITK/ITK/Utilities/Expat/src/expat -I/home/doriad/src/ITK/ITK/Filtering/DiffusionTensorImage/include -I/home/doriad/src/ITK/ITK/Filtering/DeformationField/include -I/home/doriad/src/ITK/ITK/Filtering/BiasCorrection/include -I/home/doriad/src/ITK/ITK/Numerics/Polynomials/include -I/home/doriad/src/ITK/ITK/Filtering/AntiAlias/include -I/home/doriad/src/ITK/ITK/Segmentation/LevelSets/include -I/home/doriad/src/ITK/ITK/Segmentation/SignedDistanceFunction/include -I/home/doriad/src/ITK/ITK/Numerics/Optimizers/include -I/home/doriad/src/ITK/ITK/Filtering/ImageFeature/include -I/home/doriad/src/ITK/ITK/Core/SpatialObjects/include -I/home/doriad/src/ITK/ITK/Core/Mesh/include -I/home/doriad/src/ITK/ITK/Filtering/ImageGradient/include -I/home/doriad/src/ITK/ITK/Filtering/Smoothing/include -I/home/doriad/src/ITK/ITK/Filtering/ImageCompare/include -I/home/doriad/src/ITK/ITK/Filtering/DistanceMap/include -I/home/doriad/src/ITK/ITK/Numerics/NarrowBand/include -I/home/doriad/src/ITK/ITK/Filtering/MathematicalMorphology/include -I/home/doriad/src/ITK/ITK/IO/PNG/include -I/home/doriad/src/ITK/ITK/Utilities/PNG/src -I/home/doriad/bin/ITK/ITK/Utilities/PNG/src -I/home/doriad/src/ITK/ITK/Utilities/ZLIB/src -I/home/doriad/bin/ITK/ITK/Utilities/ZLIB/src -I/home/doriad/src/ITK/ITK/IO/Base/include -I/home/doriad/src/ITK/ITK/Segmentation/ConnectedComponents/include -I/home/doriad/src/ITK/ITK/Filtering/Thresholding/include -I/home/doriad/src/ITK/ITK/Filtering/ImageIntensity/include -I/home/doriad/src/ITK/ITK/Filtering/Path/include -I/home/doriad/src/ITK/ITK/Filtering/AnisotropicSmoothing/include -I/home/doriad/src/ITK/ITK/Filtering/ImageGrid/include -I/home/doriad/src/ITK/ITK/Core/ImageFunction/include -I/home/doriad/src/ITK/ITK/Core/Transform/include -I/home/doriad/src/ITK/ITK/Filtering/ImageStatistics/include -I/home/doriad/src/ITK/ITK/Numerics/Statistics/include -I/home/doriad/bin/ITK/ITK/Utilities/Netlib -I/home/doriad/src/ITK/ITK/Core/ImageAdaptors/include -I/home/doriad/src/ITK/ITK/Filtering/CurvatureFlow/include -I/home/doriad/src/ITK/ITK/Filtering/ImageFilterBase/include -I/home/doriad/src/ITK/ITK/Core/FiniteDifference/include -I/home/doriad/src/ITK/ITK/Core/Common/include -I/home/doriad/bin/ITK/ITK/Core/Common -I/home/doriad/src/ITK/ITK/Utilities/VNLInstantiation/include -I/home/doriad/bin/ITK/ITK/Utilities/VNL/src/vxl/core -I/home/doriad/bin/ITK/ITK/Utilities/VNL/src/vxl/vcl -I/home/doriad/bin/ITK/ITK/Utilities/VNL/src/vxl/v3p/netlib -I/home/doriad/src/ITK/ITK/Utilities/VNL/src/vxl/core -I/home/doriad/src/ITK/ITK/Utilities/VNL/src/vxl/vcl -I/home/doriad/src/ITK/ITK/Utilities/VNL/src/vxl/v3p/netlib -I/home/doriad/bin/ITK/ITK/Utilities/KWSys/src -I/media/portable/Projects/bin/lafarren-image-completer/ITKIOFactoryRegistration -I/media/portable/src/Eigen -I/media/portable/src/Eigen/unsupported -I/usr/include/suitesparse -isystem /home/doriad/bin/wxWidgets2.9/lib/wx/include/gtk2-unicode-2.9 -isystem /home/doriad/src/wxWidgets-2.9.1/include -I/media/portable/Projects/src/lafarren-image-completer/src/image-completer-cmd -I/media/portable/Projects/src/lafarren-image-completer/src/image-completer-lib -I/media/portable/Projects/src/lafarren-image-completer/src/image-completer-lib/api -I/media/portable/Projects/src/lafarren-image-completer/src/image-completer-lib/impl -I/media/portable/Projects/src/lafarren-image-completer/src/image-completer-lib/impl/compositors -I/media/portable/Projects/src/lafarren-image-completer/src/image-completer-lib/impl/energy-calculators -I/media/portable/Projects/src/lafarren-image-completer/src/tech/tech -I/media/portable/Projects/src/lafarren-image-completer/src/tech   -o CMakeFiles/Tech.dir/src/tech/tech/Atomic.cpp.o -c /media/portable/Projects/src/lafarren-image-completer/src/tech/tech/Atomic.cpp
  17. In file included from /media/portable/Projects/src/lafarren-image-completer/src/tech/tech/Atomic.cpp:23:
  18. /media/portable/Projects/src/lafarren-image-completer/src/tech/tech/Atomic.h:37:2: error: #error "Implement tech/Atomic.h for this platform!"
  19. In file included from /media/portable/Projects/src/lafarren-image-completer/src/tech/tech/Atomic.h:59,
  20.                  from /media/portable/Projects/src/lafarren-image-completer/src/tech/tech/Atomic.cpp:23:
  21. /media/portable/Projects/src/lafarren-image-completer/src/tech/tech/Atomic.inl:127:2: error: #error "Implement tech/Atomic.inl for this platform!"
  22. In file included from /media/portable/Projects/src/lafarren-image-completer/src/tech/tech/Atomic.cpp:23:
  23. /media/portable/Projects/src/lafarren-image-completer/src/tech/tech/Atomic.h:43: error: expected type-specifier before ‘AtomicNativeType’
  24. /media/portable/Projects/src/lafarren-image-completer/src/tech/tech/Atomic.h:43: error: expected ‘>’ before ‘AtomicNativeType’
  25. /media/portable/Projects/src/lafarren-image-completer/src/tech/tech/Atomic.cpp: In constructor ‘LfnTech::AtomicValidationTests::AtomicValidationTests()’:
  26. /media/portable/Projects/src/lafarren-image-completer/src/tech/tech/Atomic.cpp:36: error: ‘AtomicNativeType’ was not declared in this scope
  27. /media/portable/Projects/src/lafarren-image-completer/src/tech/tech/Atomic.cpp:36: error: expected ‘;’ before ‘x’
  28. /media/portable/Projects/src/lafarren-image-completer/src/tech/tech/Atomic.cpp:37: error: ‘AtomicNativeType’ does not name a type
  29. /media/portable/Projects/src/lafarren-image-completer/src/tech/tech/Atomic.cpp:38: error: ‘x’ was not declared in this scope
  30. /media/portable/Projects/src/lafarren-image-completer/src/tech/tech/Atomic.cpp:38: error: ‘y’ was not declared in this scope
  31. /media/portable/Projects/src/lafarren-image-completer/src/tech/tech/Atomic.cpp:43: error: ‘AtomicNativeType’ was not declared in this scope
  32. /media/portable/Projects/src/lafarren-image-completer/src/tech/tech/Atomic.cpp:43: error: expected ‘;’ before ‘x’
  33. /media/portable/Projects/src/lafarren-image-completer/src/tech/tech/Atomic.cpp:44: error: ‘AtomicNativeType’ does not name a type
  34. /media/portable/Projects/src/lafarren-image-completer/src/tech/tech/Atomic.cpp:45: error: ‘x’ was not declared in this scope
  35. /media/portable/Projects/src/lafarren-image-completer/src/tech/tech/Atomic.cpp:45: error: ‘y’ was not declared in this scope
  36. /media/portable/Projects/src/lafarren-image-completer/src/tech/tech/Atomic.cpp:51: error: ‘AtomicNativeType’ was not declared in this scope
  37. /media/portable/Projects/src/lafarren-image-completer/src/tech/tech/Atomic.cpp:51: error: expected ‘;’ before ‘x’
  38. /media/portable/Projects/src/lafarren-image-completer/src/tech/tech/Atomic.cpp:52: error: ‘AtomicNativeType’ does not name a type
  39. /media/portable/Projects/src/lafarren-image-completer/src/tech/tech/Atomic.cpp:53: error: ‘x’ was not declared in this scope
  40. /media/portable/Projects/src/lafarren-image-completer/src/tech/tech/Atomic.cpp:53: error: ‘y’ was not declared in this scope
  41. /media/portable/Projects/src/lafarren-image-completer/src/tech/tech/Atomic.cpp:57: error: ‘AtomicNativeType’ was not declared in this scope
  42. /media/portable/Projects/src/lafarren-image-completer/src/tech/tech/Atomic.cpp:57: error: expected ‘;’ before ‘x’
  43. /media/portable/Projects/src/lafarren-image-completer/src/tech/tech/Atomic.cpp:58: error: ‘AtomicNativeType’ does not name a type
  44. /media/portable/Projects/src/lafarren-image-completer/src/tech/tech/Atomic.cpp:59: error: ‘x’ was not declared in this scope
  45. /media/portable/Projects/src/lafarren-image-completer/src/tech/tech/Atomic.cpp:59: error: ‘y’ was not declared in this scope
  46. /media/portable/Projects/src/lafarren-image-completer/src/tech/tech/Atomic.cpp:66: error: ‘AtomicNativeType’ was not declared in this scope
  47. /media/portable/Projects/src/lafarren-image-completer/src/tech/tech/Atomic.cpp:66: error: expected ‘;’ before ‘x’
  48. /media/portable/Projects/src/lafarren-image-completer/src/tech/tech/Atomic.cpp:67: error: ‘AtomicNativeType’ does not name a type
  49. /media/portable/Projects/src/lafarren-image-completer/src/tech/tech/Atomic.cpp:68: error: ‘x’ was not declared in this scope
  50. /media/portable/Projects/src/lafarren-image-completer/src/tech/tech/Atomic.cpp:68: error: ‘y’ was not declared in this scope
  51. /media/portable/Projects/src/lafarren-image-completer/src/tech/tech/Atomic.cpp:72: error: ‘AtomicNativeType’ was not declared in this scope
  52. /media/portable/Projects/src/lafarren-image-completer/src/tech/tech/Atomic.cpp:72: error: expected ‘;’ before ‘x’
  53. /media/portable/Projects/src/lafarren-image-completer/src/tech/tech/Atomic.cpp:73: error: ‘AtomicNativeType’ does not name a type
  54. /media/portable/Projects/src/lafarren-image-completer/src/tech/tech/Atomic.cpp:74: error: ‘x’ was not declared in this scope
  55. /media/portable/Projects/src/lafarren-image-completer/src/tech/tech/Atomic.cpp:74: error: ‘y’ was not declared in this scope
  56. make[2]: *** [CMakeFiles/Tech.dir/src/tech/tech/Atomic.cpp.o] Error 1
  57. make[2]: Leaving directory `/media/portable/Projects/bin/lafarren-image-completer'
  58. make[1]: *** [CMakeFiles/Tech.dir/all] Error 2
  59. make[1]: Leaving directory `/media/portable/Projects/bin/lafarren-image-completer'
  60. make: *** [all] Error 2