This week only. Pastebin PRO Accounts Christmas Special! Don't miss out!Want more features on Pastebin? Sign Up, it's FREE!
Guest

Untitled

By: a guest on Feb 1st, 2012  |  syntax: None  |  size: 52.38 KB  |  views: 54  |  expires: Never
download  |  raw  |  embed  |  report abuse  |  print
Text below is selected. Please press Ctrl+C to copy to your clipboard. (⌘+C on Mac)
  1. cd /home/rcbandit/Desktop/NetBeans/Prototype_3/SH_27/SH_27-impl; JAVA_HOME=/opt/jdk1.7.0_02 /home/rcbandit/netbeans-7.1/java/maven/bin/mvn clean install -X
  2. Apache Maven 3.0.3 (r1075438; 2011-02-28 19:31:09+0200)
  3. Maven home: /home/rcbandit/netbeans-7.1/java/maven
  4. Java version: 1.7.0_02, vendor: Oracle Corporation
  5. Java home: /opt/jdk1.7.0_02/jre
  6. Default locale: en_US, platform encoding: UTF-8
  7. OS name: "linux", version: "2.6.32-220.4.1.el6.x86_64", arch: "amd64", family: "unix"
  8. Error stacktraces are turned on.
  9. Reading global settings from /home/rcbandit/netbeans-7.1/java/maven/conf/settings.xml
  10. Reading user settings from /home/rcbandit/.m2/settings.xml
  11. Using local repository at /home/rcbandit/.m2/repository
  12. Using manager EnhancedLocalRepositoryManager with priority 10 for /home/rcbandit/.m2/repository
  13. Scanning for projects...
  14. Resolving plugin version for org.apache.felix:maven-bundle-plugin
  15. Could not find metadata org.apache.felix:maven-bundle-plugin/maven-metadata.xml in local (/home/rcbandit/.m2/repository)
  16. Skipped remote update check for org.apache.felix:maven-bundle-plugin/maven-metadata.xml, locally cached metadata up-to-date.
  17. Resolved plugin version for org.apache.felix:maven-bundle-plugin to 2.3.6 from repository central (http://repo1.maven.org/maven2, releases)
  18. org.apache.felix:maven-bundle-plugin:jar:2.3.6:
  19.    biz.aQute:bndlib:jar:1.50.0:compile
  20.    org.apache.felix:org.apache.felix.bundlerepository:jar:1.6.6:compile
  21.       org.osgi:org.osgi.core:jar:4.1.0:compile
  22.       org.easymock:easymock:jar:2.4:compile
  23.    org.apache.maven:maven-core:jar:2.0.7:compile
  24.       org.apache.maven:maven-settings:jar:2.0.7:compile
  25.       org.apache.maven:maven-plugin-parameter-documenter:jar:2.0.7:compile
  26.       org.apache.maven.reporting:maven-reporting-api:jar:2.0.7:compile
  27.          org.apache.maven.doxia:doxia-sink-api:jar:1.0-alpha-7:compile
  28.       org.apache.maven:maven-profile:jar:2.0.7:compile
  29.       org.apache.maven:maven-model:jar:2.0.7:compile
  30.       org.apache.maven:maven-artifact:jar:2.0.7:compile
  31.       org.codehaus.plexus:plexus-container-default:jar:1.0-alpha-9-stable-1:compile
  32.          junit:junit:jar:3.8.1:compile
  33.       org.apache.maven:maven-repository-metadata:jar:2.0.7:compile
  34.       org.apache.maven:maven-error-diagnostics:jar:2.0.7:compile
  35.       org.apache.maven:maven-project:jar:2.0.7:compile
  36.          org.apache.maven:maven-plugin-registry:jar:2.0.7:compile
  37.       commons-cli:commons-cli:jar:1.0:compile
  38.       org.apache.maven:maven-plugin-api:jar:2.0.7:compile
  39.       org.apache.maven:maven-plugin-descriptor:jar:2.0.7:compile
  40.       org.codehaus.plexus:plexus-interactivity-api:jar:1.0-alpha-4:compile
  41.       org.apache.maven:maven-artifact-manager:jar:2.0.7:compile
  42.       org.apache.maven:maven-monitor:jar:2.0.7:compile
  43.       classworlds:classworlds:jar:1.1:compile
  44.    org.apache.maven:maven-archiver:jar:2.4.1:compile
  45.       org.codehaus.plexus:plexus-archiver:jar:1.0:compile
  46.          org.codehaus.plexus:plexus-io:jar:1.0:compile
  47.       org.codehaus.plexus:plexus-interpolation:jar:1.13:compile
  48.    org.apache.maven.shared:maven-dependency-tree:jar:1.2:compile
  49.    org.codehaus.plexus:plexus-utils:jar:2.1:compile
  50. Created new class realm maven.api
  51. Importing foreign packages into class realm maven.api
  52.   Imported: org.apache.maven.wagon.events < plexus.core
  53.   Imported: org.sonatype.aether.transfer < plexus.core
  54.   Imported: org.apache.maven.exception < plexus.core
  55.   Imported: org.sonatype.aether.metadata < plexus.core
  56.   Imported: org.codehaus.plexus.util.xml.Xpp3Dom < plexus.core
  57.   Imported: org.sonatype.aether.collection < plexus.core
  58.   Imported: org.sonatype.aether.version < plexus.core
  59.   Imported: org.apache.maven.monitor < plexus.core
  60.   Imported: org.apache.maven.wagon.repository < plexus.core
  61.   Imported: org.apache.maven.repository < plexus.core
  62.   Imported: org.apache.maven.wagon.resource < plexus.core
  63.   Imported: org.codehaus.plexus.logging < plexus.core
  64.   Imported: org.apache.maven.profiles < plexus.core
  65.   Imported: org.sonatype.aether.repository < plexus.core
  66.   Imported: org.apache.maven.classrealm < plexus.core
  67.   Imported: org.apache.maven.execution < plexus.core
  68.   Imported: org.sonatype.aether.artifact < plexus.core
  69.   Imported: org.sonatype.aether.spi < plexus.core
  70.   Imported: org.apache.maven.reporting < plexus.core
  71.   Imported: org.apache.maven.usability < plexus.core
  72.   Imported: org.codehaus.plexus.container < plexus.core
  73.   Imported: org.codehaus.plexus.component < plexus.core
  74.   Imported: org.codehaus.plexus.util.xml.pull.XmlSerializer < plexus.core
  75.   Imported: org.apache.maven.wagon.authentication < plexus.core
  76.   Imported: org.apache.maven.lifecycle < plexus.core
  77.   Imported: org.codehaus.plexus.classworlds < plexus.core
  78.   Imported: org.sonatype.aether.graph < plexus.core
  79.   Imported: org.sonatype.aether.* < plexus.core
  80.   Imported: org.apache.maven.settings < plexus.core
  81.   Imported: org.codehaus.classworlds < plexus.core
  82.   Imported: org.sonatype.aether.impl < plexus.core
  83.   Imported: org.apache.maven.wagon.* < plexus.core
  84.   Imported: org.apache.maven.toolchain < plexus.core
  85.   Imported: org.sonatype.aether.deployment < plexus.core
  86.   Imported: org.apache.maven.wagon.observers < plexus.core
  87.   Imported: org.codehaus.plexus.util.xml.pull.XmlPullParserException < plexus.core
  88.   Imported: org.codehaus.plexus.util.xml.pull.XmlPullParser < plexus.core
  89.   Imported: org.apache.maven.configuration < plexus.core
  90.   Imported: org.apache.maven.cli < plexus.core
  91.   Imported: org.sonatype.aether.installation < plexus.core
  92.   Imported: org.codehaus.plexus.context < plexus.core
  93.   Imported: org.apache.maven.wagon.authorization < plexus.core
  94.   Imported: org.apache.maven.project < plexus.core
  95.   Imported: org.apache.maven.rtinfo < plexus.core
  96.   Imported: org.codehaus.plexus.lifecycle < plexus.core
  97.   Imported: org.codehaus.plexus.configuration < plexus.core
  98.   Imported: org.apache.maven.artifact < plexus.core
  99.   Imported: org.apache.maven.model < plexus.core
  100.   Imported: org.apache.maven.* < plexus.core
  101.   Imported: org.apache.maven.wagon.proxy < plexus.core
  102.   Imported: org.sonatype.aether.resolution < plexus.core
  103.   Imported: org.apache.maven.plugin < plexus.core
  104.   Imported: org.codehaus.plexus.* < plexus.core
  105.   Imported: org.codehaus.plexus.personality < plexus.core
  106. Populating class realm maven.api
  107. Created new class realm extension>org.apache.felix:maven-bundle-plugin:2.3.6
  108. Importing foreign packages into class realm extension>org.apache.felix:maven-bundle-plugin:2.3.6
  109.   Imported:  < maven.api
  110. Populating class realm extension>org.apache.felix:maven-bundle-plugin:2.3.6
  111.   Included: org.apache.felix:maven-bundle-plugin:jar:2.3.6
  112.   Included: biz.aQute:bndlib:jar:1.50.0
  113.   Included: org.apache.felix:org.apache.felix.bundlerepository:jar:1.6.6
  114.   Included: org.osgi:org.osgi.core:jar:4.1.0
  115.   Included: org.easymock:easymock:jar:2.4
  116.   Included: org.apache.maven.reporting:maven-reporting-api:jar:2.0.7
  117.   Included: org.apache.maven.doxia:doxia-sink-api:jar:1.0-alpha-7
  118.   Included: junit:junit:jar:3.8.1
  119.   Included: commons-cli:commons-cli:jar:1.0
  120.   Included: org.codehaus.plexus:plexus-interactivity-api:jar:1.0-alpha-4
  121.   Included: org.apache.maven:maven-archiver:jar:2.4.1
  122.   Included: org.codehaus.plexus:plexus-archiver:jar:1.0
  123.   Included: org.codehaus.plexus:plexus-io:jar:1.0
  124.   Included: org.codehaus.plexus:plexus-interpolation:jar:1.13
  125.   Included: org.apache.maven.shared:maven-dependency-tree:jar:1.2
  126.   Included: org.codehaus.plexus:plexus-utils:jar:2.1
  127. Extension realms for project org.DX_57.osgi.SH_27:SH_27-impl:bundle:1.0-SNAPSHOT: [ClassRealm[extension>org.apache.felix:maven-bundle-plugin:2.3.6, parent: sun.misc.Launcher$AppClassLoader@397577f9]]
  128. Created new class realm project>org.DX_57.osgi.SH_27:SH_27-impl:1.0-SNAPSHOT
  129. Populating class realm project>org.DX_57.osgi.SH_27:SH_27-impl:1.0-SNAPSHOT
  130. Looking up lifecyle mappings for packaging bundle from ClassRealm[project>org.DX_57.osgi.SH_27:SH_27-impl:1.0-SNAPSHOT, parent: ClassRealm[maven.api, parent: null]]
  131.  
  132. Some problems were encountered while building the effective model for org.DX_57.osgi.SH_27:SH_27-impl:bundle:1.0-SNAPSHOT
  133. 'build.plugins.plugin.version' for org.apache.felix:maven-bundle-plugin is missing. @ line 40, column 21
  134. The expression ${pom.groupId} is deprecated. Please use ${project.groupId} instead.
  135. The expression ${pom.groupId} is deprecated. Please use ${project.groupId} instead.
  136. The expression ${pom.artifactId} is deprecated. Please use ${project.artifactId} instead.
  137. The expression ${pom.groupId} is deprecated. Please use ${project.groupId} instead.
  138.  
  139. It is highly recommended to fix these problems because they threaten the stability of your build.
  140.  
  141. For this reason, future Maven versions might no longer support building such malformed projects.
  142.  
  143. === REACTOR BUILD PLAN ================================================
  144. Project: org.DX_57.osgi.SH_27:SH_27-impl:bundle:1.0-SNAPSHOT
  145. Tasks:   [clean, install]
  146. Style:   Regular
  147. =======================================================================
  148.                                                                        
  149. ------------------------------------------------------------------------
  150. Building SH_27-impl 1.0-SNAPSHOT
  151. ------------------------------------------------------------------------
  152. Resolving plugin version for org.apache.maven.plugins:maven-install-plugin
  153. Could not find metadata org.apache.maven.plugins:maven-install-plugin/maven-metadata.xml in local (/home/rcbandit/.m2/repository)
  154. Skipped remote update check for org.apache.maven.plugins:maven-install-plugin/maven-metadata.xml, locally cached metadata up-to-date.
  155. Resolved plugin version for org.apache.maven.plugins:maven-install-plugin to 2.3.1 from repository central (http://repo1.maven.org/maven2, releases)
  156. Resolving plugin version for org.apache.maven.plugins:maven-resources-plugin
  157. Could not find metadata org.apache.maven.plugins:maven-resources-plugin/maven-metadata.xml in local (/home/rcbandit/.m2/repository)
  158. Skipped remote update check for org.apache.maven.plugins:maven-resources-plugin/maven-metadata.xml, locally cached metadata up-to-date.
  159. Resolved plugin version for org.apache.maven.plugins:maven-resources-plugin to 2.5 from repository central (http://repo1.maven.org/maven2, releases)
  160. Resolving plugin version for org.apache.maven.plugins:maven-surefire-plugin
  161. Could not find metadata org.apache.maven.plugins:maven-surefire-plugin/maven-metadata.xml in local (/home/rcbandit/.m2/repository)
  162. Skipped remote update check for org.apache.maven.plugins:maven-surefire-plugin/maven-metadata.xml, locally cached metadata up-to-date.
  163. Resolved plugin version for org.apache.maven.plugins:maven-surefire-plugin to 2.11 from repository central (http://repo1.maven.org/maven2, releases)
  164. Resolving plugin version for org.apache.maven.plugins:maven-deploy-plugin
  165. Could not find metadata org.apache.maven.plugins:maven-deploy-plugin/maven-metadata.xml in local (/home/rcbandit/.m2/repository)
  166. Skipped remote update check for org.apache.maven.plugins:maven-deploy-plugin/maven-metadata.xml, locally cached metadata up-to-date.
  167. Resolved plugin version for org.apache.maven.plugins:maven-deploy-plugin to 2.7 from repository central (http://repo1.maven.org/maven2, releases)
  168. Lifecycle default -> [validate, initialize, generate-sources, process-sources, generate-resources, process-resources, compile, process-classes, generate-test-sources, process-test-sources, generate-test-resources, process-test-resources, test-compile, process-test-classes, test, prepare-package, package, pre-integration-test, integration-test, post-integration-test, verify, install, deploy]
  169. Lifecycle clean -> [pre-clean, clean, post-clean]
  170. Lifecycle site -> [pre-site, site, post-site, site-deploy]
  171. Lifecycle default -> [validate, initialize, generate-sources, process-sources, generate-resources, process-resources, compile, process-classes, generate-test-sources, process-test-sources, generate-test-resources, process-test-resources, test-compile, process-test-classes, test, prepare-package, package, pre-integration-test, integration-test, post-integration-test, verify, install, deploy]
  172. Lifecycle clean -> [pre-clean, clean, post-clean]
  173. Lifecycle site -> [pre-site, site, post-site, site-deploy]
  174. Lifecycle default -> [validate, initialize, generate-sources, process-sources, generate-resources, process-resources, compile, process-classes, generate-test-sources, process-test-sources, generate-test-resources, process-test-resources, test-compile, process-test-classes, test, prepare-package, package, pre-integration-test, integration-test, post-integration-test, verify, install, deploy]
  175. Lifecycle clean -> [pre-clean, clean, post-clean]
  176. Lifecycle site -> [pre-site, site, post-site, site-deploy]
  177. Lifecycle default -> [validate, initialize, generate-sources, process-sources, generate-resources, process-resources, compile, process-classes, generate-test-sources, process-test-sources, generate-test-resources, process-test-resources, test-compile, process-test-classes, test, prepare-package, package, pre-integration-test, integration-test, post-integration-test, verify, install, deploy]
  178. Lifecycle clean -> [pre-clean, clean, post-clean]
  179. Lifecycle site -> [pre-site, site, post-site, site-deploy]
  180. Lifecycle default -> [validate, initialize, generate-sources, process-sources, generate-resources, process-resources, compile, process-classes, generate-test-sources, process-test-sources, generate-test-resources, process-test-resources, test-compile, process-test-classes, test, prepare-package, package, pre-integration-test, integration-test, post-integration-test, verify, install, deploy]
  181. Lifecycle clean -> [pre-clean, clean, post-clean]
  182. Lifecycle site -> [pre-site, site, post-site, site-deploy]
  183. Lifecycle default -> [validate, initialize, generate-sources, process-sources, generate-resources, process-resources, compile, process-classes, generate-test-sources, process-test-sources, generate-test-resources, process-test-resources, test-compile, process-test-classes, test, prepare-package, package, pre-integration-test, integration-test, post-integration-test, verify, install, deploy]
  184. Lifecycle clean -> [pre-clean, clean, post-clean]
  185. Lifecycle site -> [pre-site, site, post-site, site-deploy]
  186. Lifecycle default -> [validate, initialize, generate-sources, process-sources, generate-resources, process-resources, compile, process-classes, generate-test-sources, process-test-sources, generate-test-resources, process-test-resources, test-compile, process-test-classes, test, prepare-package, package, pre-integration-test, integration-test, post-integration-test, verify, install, deploy]
  187. Lifecycle clean -> [pre-clean, clean, post-clean]
  188. Lifecycle site -> [pre-site, site, post-site, site-deploy]
  189. Lifecycle default -> [validate, initialize, generate-sources, process-sources, generate-resources, process-resources, compile, process-classes, generate-test-sources, process-test-sources, generate-test-resources, process-test-resources, test-compile, process-test-classes, test, prepare-package, package, pre-integration-test, integration-test, post-integration-test, verify, install, deploy]
  190. Lifecycle clean -> [pre-clean, clean, post-clean]
  191. Lifecycle site -> [pre-site, site, post-site, site-deploy]
  192. Lifecycle default -> [validate, initialize, generate-sources, process-sources, generate-resources, process-resources, compile, process-classes, generate-test-sources, process-test-sources, generate-test-resources, process-test-resources, test-compile, process-test-classes, test, prepare-package, package, pre-integration-test, integration-test, post-integration-test, verify, install, deploy]
  193. Lifecycle clean -> [pre-clean, clean, post-clean]
  194. Lifecycle site -> [pre-site, site, post-site, site-deploy]
  195. Lifecycle default -> [validate, initialize, generate-sources, process-sources, generate-resources, process-resources, compile, process-classes, generate-test-sources, process-test-sources, generate-test-resources, process-test-resources, test-compile, process-test-classes, test, prepare-package, package, pre-integration-test, integration-test, post-integration-test, verify, install, deploy]
  196. Lifecycle clean -> [pre-clean, clean, post-clean]
  197. Lifecycle site -> [pre-site, site, post-site, site-deploy]
  198. === PROJECT BUILD PLAN ================================================
  199. Project:       org.DX_57.osgi.SH_27:SH_27-impl:1.0-SNAPSHOT
  200. Dependencies (collect): []
  201. Dependencies (resolve): [compile, test]
  202. Repositories (dependencies): [central (http://repo1.maven.org/maven2, releases)]
  203. Repositories (plugins)     : [central (http://repo1.maven.org/maven2, releases)]
  204. -----------------------------------------------------------------------
  205. Goal:          org.apache.maven.plugins:maven-clean-plugin:2.4.1:clean (default-clean)
  206. Style:         Regular
  207. Configuration: <?xml version="1.0" encoding="UTF-8"?>
  208. <configuration>
  209.   <directory default-value="${project.build.directory}"/>
  210.   <excludeDefaultDirectories default-value="false">${clean.excludeDefaultDirectories}</excludeDefaultDirectories>
  211.   <failOnError default-value="true">${maven.clean.failOnError}</failOnError>
  212.   <followSymLinks default-value="false">${clean.followSymLinks}</followSymLinks>
  213.   <outputDirectory default-value="${project.build.outputDirectory}"/>
  214.   <reportDirectory default-value="${project.reporting.outputDirectory}"/>
  215.   <skip default-value="false">${clean.skip}</skip>
  216.   <testOutputDirectory default-value="${project.build.testOutputDirectory}"/>
  217.   <verbose>${clean.verbose}</verbose>
  218. </configuration>
  219. -----------------------------------------------------------------------
  220. Goal:          org.apache.maven.plugins:maven-resources-plugin:2.5:resources (default-resources)
  221. Style:         Regular
  222. Configuration: <?xml version="1.0" encoding="UTF-8"?>
  223. <configuration>
  224.   <buildFilters default-value="${project.build.filters}"/>
  225.   <encoding default-value="${project.build.sourceEncoding}">${encoding}</encoding>
  226.   <escapeString>${maven.resources.escapeString}</escapeString>
  227.   <escapeWindowsPaths default-value="true">${maven.resources.escapeWindowsPaths}</escapeWindowsPaths>
  228.   <includeEmptyDirs default-value="false">${maven.resources.includeEmptyDirs}</includeEmptyDirs>
  229.   <outputDirectory default-value="${project.build.outputDirectory}"/>
  230.   <overwrite default-value="false">${maven.resources.overwrite}</overwrite>
  231.   <project default-value="${project}"/>
  232.   <resources default-value="${project.resources}"/>
  233.   <session default-value="${session}"/>
  234.   <supportMultiLineFiltering default-value="false">${maven.resources.supportMultiLineFiltering}</supportMultiLineFiltering>
  235.   <useBuildFilters default-value="true"/>
  236.   <useDefaultDelimiters default-value="true"/>
  237. </configuration>
  238. -----------------------------------------------------------------------
  239. Goal:          org.apache.maven.plugins:maven-compiler-plugin:2.3.2:compile (default-compile)
  240. Style:         Regular
  241. Configuration: <?xml version="1.0" encoding="UTF-8"?>
  242. <configuration>
  243.   <basedir default-value="${basedir}"/>
  244.   <buildDirectory default-value="${project.build.directory}"/>
  245.   <classpathElements default-value="${project.compileClasspathElements}"/>
  246.   <compileSourceRoots default-value="${project.compileSourceRoots}"/>
  247.   <compilerId default-value="javac">${maven.compiler.compilerId}</compilerId>
  248.   <compilerVersion>${maven.compiler.compilerVersion}</compilerVersion>
  249.   <debug default-value="true">${maven.compiler.debug}</debug>
  250.   <debuglevel>${maven.compiler.debuglevel}</debuglevel>
  251.   <encoding default-value="${project.build.sourceEncoding}">${encoding}</encoding>
  252.   <executable>${maven.compiler.executable}</executable>
  253.   <failOnError default-value="true">${maven.compiler.failOnError}</failOnError>
  254.   <fork default-value="false">${maven.compiler.fork}</fork>
  255.   <generatedSourcesDirectory default-value="${project.build.directory}/generated-sources/annotations"/>
  256.   <maxmem>${maven.compiler.maxmem}</maxmem>
  257.   <meminitial>${maven.compiler.meminitial}</meminitial>
  258.   <optimize default-value="false">${maven.compiler.optimize}</optimize>
  259.   <outputDirectory default-value="${project.build.outputDirectory}"/>
  260.   <outputFileName>${project.build.finalName}</outputFileName>
  261.   <projectArtifact default-value="${project.artifact}"/>
  262.   <session default-value="${session}"/>
  263.   <showDeprecation default-value="false">${maven.compiler.showDeprecation}</showDeprecation>
  264.   <showWarnings default-value="false">${maven.compiler.showWarnings}</showWarnings>
  265.   <source default-value="1.5">1.7</source>
  266.   <staleMillis default-value="0">${lastModGranularityMs}</staleMillis>
  267.   <target default-value="1.5">1.7</target>
  268.   <verbose default-value="false">${maven.compiler.verbose}</verbose>
  269. </configuration>
  270. -----------------------------------------------------------------------
  271. Goal:          org.apache.maven.plugins:maven-resources-plugin:2.5:testResources (default-testResources)
  272. Style:         Regular
  273. Configuration: <?xml version="1.0" encoding="UTF-8"?>
  274. <configuration>
  275.   <buildFilters default-value="${project.build.filters}"/>
  276.   <encoding default-value="${project.build.sourceEncoding}">${encoding}</encoding>
  277.   <escapeString>${maven.resources.escapeString}</escapeString>
  278.   <escapeWindowsPaths default-value="true">${maven.resources.escapeWindowsPaths}</escapeWindowsPaths>
  279.   <includeEmptyDirs default-value="false">${maven.resources.includeEmptyDirs}</includeEmptyDirs>
  280.   <outputDirectory>${project.build.testOutputDirectory}</outputDirectory>
  281.   <overwrite default-value="false">${maven.resources.overwrite}</overwrite>
  282.   <project default-value="${project}"/>
  283.   <resources>${project.testResources}</resources>
  284.   <session default-value="${session}"/>
  285.   <supportMultiLineFiltering default-value="false">${maven.resources.supportMultiLineFiltering}</supportMultiLineFiltering>
  286.   <useBuildFilters default-value="true"/>
  287.   <useDefaultDelimiters default-value="true"/>
  288. </configuration>
  289. -----------------------------------------------------------------------
  290. Goal:          org.apache.maven.plugins:maven-compiler-plugin:2.3.2:testCompile (default-testCompile)
  291. Style:         Regular
  292. Configuration: <?xml version="1.0" encoding="UTF-8"?>
  293. <configuration>
  294.   <basedir default-value="${basedir}"/>
  295.   <buildDirectory default-value="${project.build.directory}"/>
  296.   <classpathElements default-value="${project.testClasspathElements}"/>
  297.   <compileSourceRoots default-value="${project.testCompileSourceRoots}"/>
  298.   <compilerId default-value="javac">${maven.compiler.compilerId}</compilerId>
  299.   <compilerVersion>${maven.compiler.compilerVersion}</compilerVersion>
  300.   <debug default-value="true">${maven.compiler.debug}</debug>
  301.   <debuglevel>${maven.compiler.debuglevel}</debuglevel>
  302.   <encoding default-value="${project.build.sourceEncoding}">${encoding}</encoding>
  303.   <executable>${maven.compiler.executable}</executable>
  304.   <failOnError default-value="true">${maven.compiler.failOnError}</failOnError>
  305.   <fork default-value="false">${maven.compiler.fork}</fork>
  306.   <generatedTestSourcesDirectory default-value="${project.build.directory}/generated-sources/test-annotations"/>
  307.   <maxmem>${maven.compiler.maxmem}</maxmem>
  308.   <meminitial>${maven.compiler.meminitial}</meminitial>
  309.   <optimize default-value="false">${maven.compiler.optimize}</optimize>
  310.   <outputDirectory default-value="${project.build.testOutputDirectory}"/>
  311.   <outputFileName>${project.build.finalName}</outputFileName>
  312.   <session default-value="${session}"/>
  313.   <showDeprecation default-value="false">${maven.compiler.showDeprecation}</showDeprecation>
  314.   <showWarnings default-value="false">${maven.compiler.showWarnings}</showWarnings>
  315.   <skip>${maven.test.skip}</skip>
  316.   <source default-value="1.5">1.7</source>
  317.   <staleMillis default-value="0">${lastModGranularityMs}</staleMillis>
  318.   <target default-value="1.5">1.7</target>
  319.   <testSource>${maven.compiler.testSource}</testSource>
  320.   <testTarget>${maven.compiler.testTarget}</testTarget>
  321.   <verbose default-value="false">${maven.compiler.verbose}</verbose>
  322. </configuration>
  323. -----------------------------------------------------------------------
  324. Goal:          org.apache.maven.plugins:maven-surefire-plugin:2.11:test (default-test)
  325. Style:         Regular
  326. Configuration: <?xml version="1.0" encoding="UTF-8"?>
  327. <configuration>
  328.   <argLine>${argLine}</argLine>
  329.   <basedir default-value="${basedir}"/>
  330.   <childDelegation default-value="false">${childDelegation}</childDelegation>
  331.   <classesDirectory default-value="${project.build.outputDirectory}"/>
  332.   <debugForkedProcess>${maven.surefire.debug}</debugForkedProcess>
  333.   <disableXmlReport default-value="false">${disableXmlReport}</disableXmlReport>
  334.   <enableAssertions default-value="true">${enableAssertions}</enableAssertions>
  335.   <excludedGroups>${excludedGroups}</excludedGroups>
  336.   <failIfNoTests>${failIfNoTests}</failIfNoTests>
  337.   <forkMode default-value="once">${forkMode}</forkMode>
  338.   <forkedProcessTimeoutInSeconds>${surefire.timeout}</forkedProcessTimeoutInSeconds>
  339.   <groups>${groups}</groups>
  340.   <junitArtifactName default-value="junit:junit">${junitArtifactName}</junitArtifactName>
  341.   <jvm>${jvm}</jvm>
  342.   <localRepository>${localRepository}</localRepository>
  343.   <objectFactory>${objectFactory}</objectFactory>
  344.   <parallel>${parallel}</parallel>
  345.   <parallelMavenExecution default-value="${session.parallel}"/>
  346.   <perCoreThreadCount default-value="true">${perCoreThreadCount}</perCoreThreadCount>
  347.   <pluginArtifactMap>${plugin.artifactMap}</pluginArtifactMap>
  348.   <printSummary default-value="true">${surefire.printSummary}</printSummary>
  349.   <project default-value="${project}"/>
  350.   <projectArtifactMap>${project.artifactMap}</projectArtifactMap>
  351.   <redirectTestOutputToFile default-value="false">${maven.test.redirectTestOutputToFile}</redirectTestOutputToFile>
  352.   <remoteRepositories>${project.pluginArtifactRepositories}</remoteRepositories>
  353.   <reportFormat default-value="brief">${surefire.reportFormat}</reportFormat>
  354.   <reportNameSuffix default-value="">${surefire.reportNameSuffix}</reportNameSuffix>
  355.   <reportsDirectory default-value="${project.build.directory}/surefire-reports"/>
  356.   <runOrder default-value="filesystem"/>
  357.   <session>${session}</session>
  358.   <skip default-value="false">${maven.test.skip}</skip>
  359.   <skipExec>${maven.test.skip.exec}</skipExec>
  360.   <skipTests default-value="false">${skipTests}</skipTests>
  361.   <test>${test}</test>
  362.   <testClassesDirectory default-value="${project.build.testOutputDirectory}"/>
  363.   <testFailureIgnore default-value="false">${maven.test.failure.ignore}</testFailureIgnore>
  364.   <testNGArtifactName default-value="org.testng:testng">${testNGArtifactName}</testNGArtifactName>
  365.   <testSourceDirectory default-value="${project.build.testSourceDirectory}"/>
  366.   <threadCount>${threadCount}</threadCount>
  367.   <trimStackTrace default-value="true">${trimStackTrace}</trimStackTrace>
  368.   <useFile default-value="true">${surefire.useFile}</useFile>
  369.   <useManifestOnlyJar default-value="true">${surefire.useManifestOnlyJar}</useManifestOnlyJar>
  370.   <useSystemClassLoader default-value="true">${surefire.useSystemClassLoader}</useSystemClassLoader>
  371.   <useUnlimitedThreads default-value="false">${useUnlimitedThreads}</useUnlimitedThreads>
  372.   <workingDirectory>${basedir}</workingDirectory>
  373. </configuration>
  374. -----------------------------------------------------------------------
  375. Goal:          org.apache.felix:maven-bundle-plugin:2.3.6:bundle (default-bundle)
  376. Style:         Regular
  377. Configuration: <?xml version="1.0" encoding="UTF-8"?>
  378. <configuration>
  379.   <buildDirectory>${project.build.directory}</buildDirectory>
  380.   <dumpClasspath>${dumpClasspath}</dumpClasspath>
  381.   <dumpInstructions>${dumpInstructions}</dumpInstructions>
  382.   <excludeDependencies>${excludeDependencies}</excludeDependencies>
  383.   <instructions>
  384.     <Import-Package>org.DX_57.osgi.SH_27.api, org.osgi.framework, javax.activation, javax.annotation</Import-Package>
  385.     <Bundle-SymbolicName>SH_27-impl</Bundle-SymbolicName>
  386.     <Bundle-Activator>org.DX_57.osgi.SH_27.impl.SessionHandleApp</Bundle-Activator>
  387.   </instructions>
  388.   <m_mavenSession default-value="${session}"/>
  389.   <manifestLocation default-value="${project.build.outputDirectory}/META-INF">${manifestLocation}</manifestLocation>
  390.   <outputDirectory>${project.build.outputDirectory}</outputDirectory>
  391.   <project>${project}</project>
  392.   <unpackBundle>${unpackBundle}</unpackBundle>
  393. </configuration>
  394. -----------------------------------------------------------------------
  395. Goal:          org.apache.maven.plugins:maven-install-plugin:2.3.1:install (default-install)
  396. Style:         Regular
  397. Configuration: <?xml version="1.0" encoding="UTF-8"?>
  398. <configuration>
  399.   <artifact default-value="${project.artifact}"/>
  400.   <attachedArtifacts default-value="${project.attachedArtifacts}"/>
  401.   <createChecksum default-value="false">${createChecksum}</createChecksum>
  402.   <localRepository>${localRepository}</localRepository>
  403.   <packaging default-value="${project.packaging}"/>
  404.   <pomFile default-value="${project.file}"/>
  405.   <updateReleaseInfo default-value="false">${updateReleaseInfo}</updateReleaseInfo>
  406. </configuration>
  407. -----------------------------------------------------------------------
  408. Goal:          org.apache.felix:maven-bundle-plugin:2.3.6:install (default-install)
  409. Style:         Regular
  410. Configuration: <?xml version="1.0" encoding="UTF-8"?>
  411. <configuration>
  412.   <attachedArtifacts>${project.attachedArtifacts}</attachedArtifacts>
  413.   <localRepository>${localRepository}</localRepository>
  414.   <obrRepository>${obrRepository}</obrRepository>
  415.   <project>${project}</project>
  416. </configuration>
  417. =======================================================================
  418. org.DX_57.osgi.SH_27:SH_27-impl:bundle:1.0-SNAPSHOT
  419.    junit:junit:jar:3.8.1:test
  420.    org.apache.felix:org.osgi.core:jar:1.0.0:compile
  421.    org.DX_57.osgi.SH_27:SH_27-api:jar:1.0-SNAPSHOT:compile
  422.    org.DX_57.osgi.CL_27:CL_27-api:jar:1.0-SNAPSHOT:compile
  423.    javax:javaee-web-api:jar:6.0:provided
  424.    org.osgi:org.osgi.core:jar:4.2.0:provided
  425.    org.osgi:org.osgi.compendium:jar:4.2.0:provided
  426.    org.glassfish:osgi-cdi-api:jar:3.1-b41:provided
  427.  
  428. [clean:clean]
  429. org.apache.maven.plugins:maven-clean-plugin:jar:2.4.1:
  430.    org.apache.maven:maven-plugin-api:jar:2.0.6:compile
  431.    org.codehaus.plexus:plexus-utils:jar:2.0.5:compile
  432. Created new class realm plugin>org.apache.maven.plugins:maven-clean-plugin:2.4.1
  433. Importing foreign packages into class realm plugin>org.apache.maven.plugins:maven-clean-plugin:2.4.1
  434.   Imported:  < project>org.DX_57.osgi.SH_27:SH_27-impl:1.0-SNAPSHOT
  435. Populating class realm plugin>org.apache.maven.plugins:maven-clean-plugin:2.4.1
  436.   Included: org.apache.maven.plugins:maven-clean-plugin:jar:2.4.1
  437.   Included: org.codehaus.plexus:plexus-utils:jar:2.0.5
  438.   Excluded: org.apache.maven:maven-plugin-api:jar:2.0.6
  439. Configuring mojo org.apache.maven.plugins:maven-clean-plugin:2.4.1:clean from plugin realm ClassRealm[plugin>org.apache.maven.plugins:maven-clean-plugin:2.4.1, parent: sun.misc.Launcher$AppClassLoader@397577f9]
  440. Configuring mojo 'org.apache.maven.plugins:maven-clean-plugin:2.4.1:clean' with basic configurator -->
  441.   (f) directory = /home/rcbandit/Desktop/NetBeans/Prototype_3/SH_27/SH_27-impl/target
  442.   (f) excludeDefaultDirectories = false
  443.   (f) failOnError = true
  444.   (f) followSymLinks = false
  445.   (f) outputDirectory = /home/rcbandit/Desktop/NetBeans/Prototype_3/SH_27/SH_27-impl/target/classes
  446.   (f) reportDirectory = /home/rcbandit/Desktop/NetBeans/Prototype_3/SH_27/SH_27-impl/target/site
  447.   (f) skip = false
  448.   (f) testOutputDirectory = /home/rcbandit/Desktop/NetBeans/Prototype_3/SH_27/SH_27-impl/target/test-classes
  449. -- end configuration --
  450. Deleting /home/rcbandit/Desktop/NetBeans/Prototype_3/SH_27/SH_27-impl/target
  451. Deleting directory /home/rcbandit/Desktop/NetBeans/Prototype_3/SH_27/SH_27-impl/target/generated-sources/annotations
  452. Deleting directory /home/rcbandit/Desktop/NetBeans/Prototype_3/SH_27/SH_27-impl/target/generated-sources
  453. Deleting directory /home/rcbandit/Desktop/NetBeans/Prototype_3/SH_27/SH_27-impl/target/classes
  454. Deleting directory /home/rcbandit/Desktop/NetBeans/Prototype_3/SH_27/SH_27-impl/target
  455. Skipping non-existing directory /home/rcbandit/Desktop/NetBeans/Prototype_3/SH_27/SH_27-impl/target/classes
  456. Skipping non-existing directory /home/rcbandit/Desktop/NetBeans/Prototype_3/SH_27/SH_27-impl/target/test-classes
  457. Skipping non-existing directory /home/rcbandit/Desktop/NetBeans/Prototype_3/SH_27/SH_27-impl/target/site
  458.  
  459. [resources:resources]
  460. org.apache.maven.plugins:maven-resources-plugin:jar:2.5:
  461.    org.apache.maven:maven-plugin-api:jar:2.0.6:compile
  462.    org.apache.maven:maven-project:jar:2.0.6:compile
  463.       org.apache.maven:maven-profile:jar:2.0.6:compile
  464.       org.apache.maven:maven-artifact-manager:jar:2.0.6:compile
  465.       org.apache.maven:maven-plugin-registry:jar:2.0.6:compile
  466.    org.apache.maven:maven-core:jar:2.0.6:compile
  467.       org.apache.maven:maven-plugin-parameter-documenter:jar:2.0.6:compile
  468.       org.apache.maven.reporting:maven-reporting-api:jar:2.0.6:compile
  469.          org.apache.maven.doxia:doxia-sink-api:jar:1.0-alpha-7:compile
  470.       org.apache.maven:maven-repository-metadata:jar:2.0.6:compile
  471.       org.apache.maven:maven-error-diagnostics:jar:2.0.6:compile
  472.       commons-cli:commons-cli:jar:1.0:compile
  473.       org.apache.maven:maven-plugin-descriptor:jar:2.0.6:compile
  474.       org.codehaus.plexus:plexus-interactivity-api:jar:1.0-alpha-4:compile
  475.       classworlds:classworlds:jar:1.1:compile
  476.    org.apache.maven:maven-artifact:jar:2.0.6:compile
  477.    org.apache.maven:maven-settings:jar:2.0.6:compile
  478.    org.apache.maven:maven-model:jar:2.0.6:compile
  479.    org.apache.maven:maven-monitor:jar:2.0.6:compile
  480.    org.codehaus.plexus:plexus-container-default:jar:1.0-alpha-9-stable-1:compile
  481.       junit:junit:jar:3.8.1:compile
  482.    org.codehaus.plexus:plexus-utils:jar:2.0.5:compile
  483.    org.apache.maven.shared:maven-filtering:jar:1.0:compile
  484.       org.sonatype.plexus:plexus-build-api:jar:0.0.4:compile
  485.    org.codehaus.plexus:plexus-interpolation:jar:1.13:compile
  486. Created new class realm plugin>org.apache.maven.plugins:maven-resources-plugin:2.5
  487. Importing foreign packages into class realm plugin>org.apache.maven.plugins:maven-resources-plugin:2.5
  488.   Imported:  < project>org.DX_57.osgi.SH_27:SH_27-impl:1.0-SNAPSHOT
  489. Populating class realm plugin>org.apache.maven.plugins:maven-resources-plugin:2.5
  490.   Included: org.apache.maven.plugins:maven-resources-plugin:jar:2.5
  491.   Included: org.apache.maven.reporting:maven-reporting-api:jar:2.0.6
  492.   Included: org.apache.maven.doxia:doxia-sink-api:jar:1.0-alpha-7
  493.   Included: commons-cli:commons-cli:jar:1.0
  494.   Included: org.codehaus.plexus:plexus-interactivity-api:jar:1.0-alpha-4
  495.   Included: junit:junit:jar:3.8.1
  496.   Included: org.codehaus.plexus:plexus-utils:jar:2.0.5
  497.   Included: org.apache.maven.shared:maven-filtering:jar:1.0
  498.   Included: org.sonatype.plexus:plexus-build-api:jar:0.0.4
  499.   Included: org.codehaus.plexus:plexus-interpolation:jar:1.13
  500.   Excluded: org.apache.maven:maven-plugin-api:jar:2.0.6
  501.   Excluded: org.apache.maven:maven-project:jar:2.0.6
  502.   Excluded: org.apache.maven:maven-profile:jar:2.0.6
  503.   Excluded: org.apache.maven:maven-artifact-manager:jar:2.0.6
  504.   Excluded: org.apache.maven:maven-plugin-registry:jar:2.0.6
  505.   Excluded: org.apache.maven:maven-core:jar:2.0.6
  506.   Excluded: org.apache.maven:maven-plugin-parameter-documenter:jar:2.0.6
  507.   Excluded: org.apache.maven:maven-repository-metadata:jar:2.0.6
  508.   Excluded: org.apache.maven:maven-error-diagnostics:jar:2.0.6
  509.   Excluded: org.apache.maven:maven-plugin-descriptor:jar:2.0.6
  510.   Excluded: classworlds:classworlds:jar:1.1
  511.   Excluded: org.apache.maven:maven-artifact:jar:2.0.6
  512.   Excluded: org.apache.maven:maven-settings:jar:2.0.6
  513.   Excluded: org.apache.maven:maven-model:jar:2.0.6
  514.   Excluded: org.apache.maven:maven-monitor:jar:2.0.6
  515.   Excluded: org.codehaus.plexus:plexus-container-default:jar:1.0-alpha-9-stable-1
  516. Configuring mojo org.apache.maven.plugins:maven-resources-plugin:2.5:resources from plugin realm ClassRealm[plugin>org.apache.maven.plugins:maven-resources-plugin:2.5, parent: sun.misc.Launcher$AppClassLoader@397577f9]
  517. [debug] execute contextualize
  518. Configuring mojo 'org.apache.maven.plugins:maven-resources-plugin:2.5:resources' with basic configurator -->
  519.   (f) buildFilters = []
  520.   (f) escapeWindowsPaths = true
  521.   (s) includeEmptyDirs = false
  522.   (s) outputDirectory = /home/rcbandit/Desktop/NetBeans/Prototype_3/SH_27/SH_27-impl/target/classes
  523.   (s) overwrite = false
  524.   (f) project = MavenProject: org.DX_57.osgi.SH_27:SH_27-impl:1.0-SNAPSHOT @ /home/rcbandit/Desktop/NetBeans/Prototype_3/SH_27/SH_27-impl/pom.xml
  525.   (s) resources = [Resource {targetPath: null, filtering: false, FileSet {directory: /home/rcbandit/Desktop/NetBeans/Prototype_3/SH_27/SH_27-impl/src/main/resources, PatternSet [includes: {}, excludes: {}]}}]
  526.   (f) session = org.apache.maven.execution.MavenSession@92d4709
  527.   (f) supportMultiLineFiltering = false
  528.   (f) useBuildFilters = true
  529.   (s) useDefaultDelimiters = true
  530. -- end configuration --
  531. properties used {java.vendor=Oracle Corporation, env.SESSION_MANAGER=local/unix:@/tmp/.ICE-unix/4715,unix/unix:/tmp/.ICE-unix/4715, env.LESSOPEN=|/usr/bin/lesspipe.sh %s, sun.java.launcher=SUN_STANDARD, env.QT_IM_MODULE=xim, sun.management.compiler=HotSpot 64-Bit Tiered Compilers, os.name=Linux, sun.boot.class.path=/opt/jdk1.7.0_02/jre/lib/resources.jar:/opt/jdk1.7.0_02/jre/lib/rt.jar:/opt/jdk1.7.0_02/jre/lib/sunrsasign.jar:/opt/jdk1.7.0_02/jre/lib/jsse.jar:/opt/jdk1.7.0_02/jre/lib/jce.jar:/opt/jdk1.7.0_02/jre/lib/charsets.jar:/opt/jdk1.7.0_02/jre/classes, env.PWD=/home/rcbandit/Desktop/NetBeans/Prototype_3/SH_27/SH_27-impl, env.XDG_SESSION_COOKIE=afe11249cbb6cc58fdd3097100000027-1328039777.819713-137155912, sun.desktop=gnome, env.LANG=en_US.utf8, java.vm.specification.vendor=Oracle Corporation, java.runtime.version=1.7.0_02-b13, env.HISTSIZE=1000, env.DISPLAY=:0.0, user.name=rcbandit, env.USER=rcbandit, env.HISTCONTROL=ignoredups, env.SHELL=/bin/bash, env.QTLIB=/usr/lib64/qt-3.3/lib, env.DESKTOP_SESSION=gnome, env.NLSPATH=/usr/dt/lib/nls/msg/%L/%N.cat, env.PATH=/usr/lib64/qt-3.3/bin:/usr/local/bin:/usr/bin:/bin:/usr/local/sbin:/usr/sbin:/sbin:/home/rcbandit/bin, user.language=en, env.IMSETTINGS_MODULE=none, sun.boot.library.path=/opt/jdk1.7.0_02/jre/lib/amd64, classworlds.conf=/home/rcbandit/netbeans-7.1/java/maven/bin/m2.conf, java.version=1.7.0_02, user.timezone=Europe/Sofia, env.DBUS_SESSION_BUS_ADDRESS=unix:abstract=/tmp/dbus-AlEyarShX3,guid=6a3e86f41f2ad75cc083b99c00000c9e, sun.arch.data.model=64, java.endorsed.dirs=/opt/jdk1.7.0_02/jre/lib/endorsed, sun.cpu.isalist=, sun.jnu.encoding=UTF-8, file.encoding.pkg=sun.io, env.SHLVL=2, file.separator=/, env.HOSTNAME=Laptop, java.specification.name=Java Platform API Specification, env.IMSETTINGS_INTEGRATE_DESKTOP=yes, env.QTDIR=/usr/lib64/qt-3.3, env.GNOME_DESKTOP_SESSION_ID=this-is-deprecated, java.class.version=51.0, env.GDMSESSION=gnome, env.GDM_KEYBOARD_LAYOUT=us, user.country=US, env.GNOME_KEYRING_PID=4706, java.home=/opt/jdk1.7.0_02/jre, java.vm.info=mixed mode, env.LOGNAME=rcbandit, os.version=2.6.32-220.4.1.el6.x86_64, env.G_BROKEN_FILENAMES=1, path.separator=:, java.vm.version=22.0-b10, env.QTINC=/usr/lib64/qt-3.3/include, env.JAVA_HOME=/opt/jdk1.7.0_02, java.awt.printerjob=sun.print.PSPrinterJob, env.TERM=dumb, env.WINDOWPATH=7, sun.io.unicode.encoding=UnicodeLittle, awt.toolkit=sun.awt.X11.XToolkit, env.XMODIFIERS=@im=none, env.GDM_LANG=en_US.utf8, user.home=/home/rcbandit, env.NB_EXEC_MAVEN_PROCESS_UUID=648cb314-54e4-4740-9a96-fcff34e3083f, env.OLDPWD=/home/rcbandit/Desktop/NetBeans/Prototype_3/SH_27/SH_27-impl, java.specification.vendor=Oracle Corporation, java.library.path=/usr/java/packages/lib/amd64:/usr/lib64:/lib64:/lib:/usr/lib, java.vendor.url=http://java.oracle.com/, java.vm.vendor=Oracle Corporation, maven.home=/home/rcbandit/netbeans-7.1/java/maven, java.runtime.name=Java(TM) SE Runtime Environment, sun.java.command=org.codehaus.plexus.classworlds.launcher.Launcher clean install -X, java.class.path=/home/rcbandit/netbeans-7.1/java/maven/boot/plexus-classworlds-2.4.jar, env.CVS_RSH=ssh, env.XFILESEARCHPATH=/usr/dt/app-defaults/%L/Dt, java.vm.specification.name=Java Virtual Machine Specification, java.vm.specification.version=1.7, sun.cpu.endian=little, env.GTK_RC_FILES=/etc/gtk/gtkrc:/home/rcbandit/.gtkrc-1.2-gnome2, sun.os.patch.level=unknown, env.HOME=/home/rcbandit, java.io.tmpdir=/tmp, java.vendor.url.bug=http://bugreport.sun.com/bugreport/, env.SSH_AUTH_SOCK=/tmp/keyring-3NQaJS/socket.ssh, os.arch=amd64, java.awt.graphicsenv=sun.awt.X11GraphicsEnvironment, java.ext.dirs=/opt/jdk1.7.0_02/jre/lib/ext:/usr/java/packages/lib/ext, env.XAUTHORITY=/var/run/gdm/auth-for-rcbandit-MA9Ivd/database, user.dir=/home/rcbandit/Desktop/NetBeans/Prototype_3/SH_27/SH_27-impl, env.J2D_PIXMAPS=shared, line.separator=
  532. , java.vm.name=Java HotSpot(TM) 64-Bit Server VM, env.ORBIT_SOCKETDIR=/tmp/orbit-rcbandit, env.USERNAME=rcbandit, file.encoding=UTF-8, env.MAIL=/var/spool/mail/rcbandit, env.GNOME_KEYRING_SOCKET=/tmp/keyring-3NQaJS/socket, java.specification.version=1.7, env.SSH_ASKPASS=/usr/libexec/openssh/gnome-ssh-askpass}
  533. Using platform encoding (UTF-8 actually) to copy filtered resources, i.e. build is platform dependent!
  534. resource with targetPath null
  535. directory /home/rcbandit/Desktop/NetBeans/Prototype_3/SH_27/SH_27-impl/src/main/resources
  536. excludes []
  537. includes []
  538. ignoreDelta true
  539. Copying 0 resource
  540. no use filter components
  541.  
  542. [compiler:compile]
  543. org.apache.maven.plugins:maven-compiler-plugin:jar:2.3.2:
  544.    org.apache.maven:maven-plugin-api:jar:2.0.6:compile
  545.    org.apache.maven:maven-artifact:jar:2.0.6:compile
  546.    org.apache.maven:maven-core:jar:2.0.6:compile
  547.       org.apache.maven:maven-settings:jar:2.0.6:compile
  548.       org.apache.maven:maven-plugin-parameter-documenter:jar:2.0.6:compile
  549.       org.apache.maven:maven-profile:jar:2.0.6:compile
  550.       org.apache.maven:maven-model:jar:2.0.6:compile
  551.       org.apache.maven:maven-repository-metadata:jar:2.0.6:compile
  552.       org.apache.maven:maven-error-diagnostics:jar:2.0.6:compile
  553.       org.apache.maven:maven-project:jar:2.0.6:compile
  554.          org.apache.maven:maven-plugin-registry:jar:2.0.6:compile
  555.       org.apache.maven:maven-plugin-descriptor:jar:2.0.6:compile
  556.       org.apache.maven:maven-artifact-manager:jar:2.0.6:compile
  557.       org.apache.maven:maven-monitor:jar:2.0.6:compile
  558.    org.apache.maven:maven-toolchain:jar:1.0:compile
  559.    org.codehaus.plexus:plexus-utils:jar:2.0.5:compile
  560.    org.codehaus.plexus:plexus-compiler-api:jar:1.8.1:compile
  561.    org.codehaus.plexus:plexus-compiler-manager:jar:1.8.1:compile
  562.    org.codehaus.plexus:plexus-compiler-javac:jar:1.8.1:runtime
  563. Created new class realm plugin>org.apache.maven.plugins:maven-compiler-plugin:2.3.2
  564. Importing foreign packages into class realm plugin>org.apache.maven.plugins:maven-compiler-plugin:2.3.2
  565.   Imported:  < project>org.DX_57.osgi.SH_27:SH_27-impl:1.0-SNAPSHOT
  566. Populating class realm plugin>org.apache.maven.plugins:maven-compiler-plugin:2.3.2
  567.   Included: org.apache.maven.plugins:maven-compiler-plugin:jar:2.3.2
  568.   Included: org.codehaus.plexus:plexus-utils:jar:2.0.5
  569.   Included: org.codehaus.plexus:plexus-compiler-api:jar:1.8.1
  570.   Included: org.codehaus.plexus:plexus-compiler-manager:jar:1.8.1
  571.   Included: org.codehaus.plexus:plexus-compiler-javac:jar:1.8.1
  572.   Excluded: org.apache.maven:maven-plugin-api:jar:2.0.6
  573.   Excluded: org.apache.maven:maven-artifact:jar:2.0.6
  574.   Excluded: org.apache.maven:maven-core:jar:2.0.6
  575.   Excluded: org.apache.maven:maven-settings:jar:2.0.6
  576.   Excluded: org.apache.maven:maven-plugin-parameter-documenter:jar:2.0.6
  577.   Excluded: org.apache.maven:maven-profile:jar:2.0.6
  578.   Excluded: org.apache.maven:maven-model:jar:2.0.6
  579.   Excluded: org.apache.maven:maven-repository-metadata:jar:2.0.6
  580.   Excluded: org.apache.maven:maven-error-diagnostics:jar:2.0.6
  581.   Excluded: org.apache.maven:maven-project:jar:2.0.6
  582.   Excluded: org.apache.maven:maven-plugin-registry:jar:2.0.6
  583.   Excluded: org.apache.maven:maven-plugin-descriptor:jar:2.0.6
  584.   Excluded: org.apache.maven:maven-artifact-manager:jar:2.0.6
  585.   Excluded: org.apache.maven:maven-monitor:jar:2.0.6
  586.   Excluded: org.apache.maven:maven-toolchain:jar:1.0
  587. Configuring mojo org.apache.maven.plugins:maven-compiler-plugin:2.3.2:compile from plugin realm ClassRealm[plugin>org.apache.maven.plugins:maven-compiler-plugin:2.3.2, parent: sun.misc.Launcher$AppClassLoader@397577f9]
  588. Configuring mojo 'org.apache.maven.plugins:maven-compiler-plugin:2.3.2:compile' with basic configurator -->
  589.   (f) basedir = /home/rcbandit/Desktop/NetBeans/Prototype_3/SH_27/SH_27-impl
  590.   (f) buildDirectory = /home/rcbandit/Desktop/NetBeans/Prototype_3/SH_27/SH_27-impl/target
  591.   (f) classpathElements = [/home/rcbandit/Desktop/NetBeans/Prototype_3/SH_27/SH_27-impl/target/classes, /home/rcbandit/.m2/repository/org/apache/felix/org.osgi.core/1.0.0/org.osgi.core-1.0.0.jar, /home/rcbandit/.m2/repository/org/DX_57/osgi/SH_27/SH_27-api/1.0-SNAPSHOT/SH_27-api-1.0-SNAPSHOT.jar, /home/rcbandit/.m2/repository/org/DX_57/osgi/CL_27/CL_27-api/1.0-SNAPSHOT/CL_27-api-1.0-SNAPSHOT.jar, /home/rcbandit/.m2/repository/javax/javaee-web-api/6.0/javaee-web-api-6.0.jar, /home/rcbandit/.m2/repository/org/osgi/org.osgi.core/4.2.0/org.osgi.core-4.2.0.jar, /home/rcbandit/.m2/repository/org/osgi/org.osgi.compendium/4.2.0/org.osgi.compendium-4.2.0.jar, /home/rcbandit/.m2/repository/org/glassfish/osgi-cdi-api/3.1-b41/osgi-cdi-api-3.1-b41.jar]
  592.   (f) compileSourceRoots = [/home/rcbandit/Desktop/NetBeans/Prototype_3/SH_27/SH_27-impl/src/main/java]
  593.   (f) compilerId = javac
  594.   (f) debug = true
  595.   (f) failOnError = true
  596.   (f) fork = false
  597.   (f) generatedSourcesDirectory = /home/rcbandit/Desktop/NetBeans/Prototype_3/SH_27/SH_27-impl/target/generated-sources/annotations
  598.   (f) optimize = false
  599.   (f) outputDirectory = /home/rcbandit/Desktop/NetBeans/Prototype_3/SH_27/SH_27-impl/target/classes
  600.   (f) outputFileName = SH_27-impl-1.0-SNAPSHOT
  601.   (f) projectArtifact = org.DX_57.osgi.SH_27:SH_27-impl:bundle:1.0-SNAPSHOT
  602.   (f) session = org.apache.maven.execution.MavenSession@92d4709
  603.   (f) showDeprecation = false
  604.   (f) showWarnings = false
  605.   (f) source = 1.7
  606.   (f) staleMillis = 0
  607.   (f) target = 1.7
  608.   (f) verbose = false
  609. -- end configuration --
  610. Using compiler 'javac'.
  611. Source directories: [/home/rcbandit/Desktop/NetBeans/Prototype_3/SH_27/SH_27-impl/src/main/java]
  612. Classpath: [/home/rcbandit/Desktop/NetBeans/Prototype_3/SH_27/SH_27-impl/target/classes
  613.  /home/rcbandit/.m2/repository/org/apache/felix/org.osgi.core/1.0.0/org.osgi.core-1.0.0.jar
  614.  /home/rcbandit/.m2/repository/org/DX_57/osgi/SH_27/SH_27-api/1.0-SNAPSHOT/SH_27-api-1.0-SNAPSHOT.jar
  615.  /home/rcbandit/.m2/repository/org/DX_57/osgi/CL_27/CL_27-api/1.0-SNAPSHOT/CL_27-api-1.0-SNAPSHOT.jar
  616.  /home/rcbandit/.m2/repository/javax/javaee-web-api/6.0/javaee-web-api-6.0.jar
  617.  /home/rcbandit/.m2/repository/org/osgi/org.osgi.core/4.2.0/org.osgi.core-4.2.0.jar
  618.  /home/rcbandit/.m2/repository/org/osgi/org.osgi.compendium/4.2.0/org.osgi.compendium-4.2.0.jar
  619.  /home/rcbandit/.m2/repository/org/glassfish/osgi-cdi-api/3.1-b41/osgi-cdi-api-3.1-b41.jar]
  620. Output directory: /home/rcbandit/Desktop/NetBeans/Prototype_3/SH_27/SH_27-impl/target/classes
  621. Classpath:
  622.  /home/rcbandit/Desktop/NetBeans/Prototype_3/SH_27/SH_27-impl/target/classes
  623.  /home/rcbandit/.m2/repository/org/apache/felix/org.osgi.core/1.0.0/org.osgi.core-1.0.0.jar
  624.  /home/rcbandit/.m2/repository/org/DX_57/osgi/SH_27/SH_27-api/1.0-SNAPSHOT/SH_27-api-1.0-SNAPSHOT.jar
  625.  /home/rcbandit/.m2/repository/org/DX_57/osgi/CL_27/CL_27-api/1.0-SNAPSHOT/CL_27-api-1.0-SNAPSHOT.jar
  626.  /home/rcbandit/.m2/repository/javax/javaee-web-api/6.0/javaee-web-api-6.0.jar
  627.  /home/rcbandit/.m2/repository/org/osgi/org.osgi.core/4.2.0/org.osgi.core-4.2.0.jar
  628.  /home/rcbandit/.m2/repository/org/osgi/org.osgi.compendium/4.2.0/org.osgi.compendium-4.2.0.jar
  629.  /home/rcbandit/.m2/repository/org/glassfish/osgi-cdi-api/3.1-b41/osgi-cdi-api-3.1-b41.jar
  630. Source roots:
  631.  /home/rcbandit/Desktop/NetBeans/Prototype_3/SH_27/SH_27-impl/src/main/java
  632. Command line options:
  633. -d /home/rcbandit/Desktop/NetBeans/Prototype_3/SH_27/SH_27-impl/target/classes -classpath /home/rcbandit/Desktop/NetBeans/Prototype_3/SH_27/SH_27-impl/target/classes:/home/rcbandit/.m2/repository/org/apache/felix/org.osgi.core/1.0.0/org.osgi.core-1.0.0.jar:/home/rcbandit/.m2/repository/org/DX_57/osgi/SH_27/SH_27-api/1.0-SNAPSHOT/SH_27-api-1.0-SNAPSHOT.jar:/home/rcbandit/.m2/repository/org/DX_57/osgi/CL_27/CL_27-api/1.0-SNAPSHOT/CL_27-api-1.0-SNAPSHOT.jar:/home/rcbandit/.m2/repository/javax/javaee-web-api/6.0/javaee-web-api-6.0.jar:/home/rcbandit/.m2/repository/org/osgi/org.osgi.core/4.2.0/org.osgi.core-4.2.0.jar:/home/rcbandit/.m2/repository/org/osgi/org.osgi.compendium/4.2.0/org.osgi.compendium-4.2.0.jar:/home/rcbandit/.m2/repository/org/glassfish/osgi-cdi-api/3.1-b41/osgi-cdi-api-3.1-b41.jar: -sourcepath /home/rcbandit/Desktop/NetBeans/Prototype_3/SH_27/SH_27-impl/src/main/java: /home/rcbandit/Desktop/NetBeans/Prototype_3/SH_27/SH_27-impl/src/main/java/org/DX_57/osgi/SH_27/impl/SessionHandleImpl.java /home/rcbandit/Desktop/NetBeans/Prototype_3/SH_27/SH_27-impl/src/main/java/org/DX_57/osgi/SH_27/impl/SessionHandleApp.java -s /home/rcbandit/Desktop/NetBeans/Prototype_3/SH_27/SH_27-impl/target/generated-sources/annotations -g -nowarn -target 1.7 -source 1.7
  634. File encoding has not been set, using platform encoding UTF-8, i.e. build is platform dependent!
  635. Compiling 2 source files to /home/rcbandit/Desktop/NetBeans/Prototype_3/SH_27/SH_27-impl/target/classes
  636. -------------------------------------------------------------
  637. COMPILATION ERROR :
  638. -------------------------------------------------------------
  639. org/DX_57/osgi/SH_27/impl/SessionHandleImpl.java:[42,27] error: cannot find symbol
  640. 1 error
  641. -------------------------------------------------------------
  642. ------------------------------------------------------------------------
  643. BUILD FAILURE
  644. ------------------------------------------------------------------------
  645. Total time: 3.184s
  646. Finished at: Wed Feb 01 11:44:56 EET 2012
  647. Final Memory: 14M/166M
  648. ------------------------------------------------------------------------
  649. Failed to execute goal org.apache.maven.plugins:maven-compiler-plugin:2.3.2:compile (default-compile) on project SH_27-impl: Compilation failure
  650. /home/rcbandit/Desktop/NetBeans/Prototype_3/SH_27/SH_27-impl/src/main/java/org/DX_57/osgi/SH_27/impl/SessionHandleImpl.java:[42,27] error: cannot find symbol
  651. -> [Help 1]
  652. org.apache.maven.lifecycle.LifecycleExecutionException: Failed to execute goal org.apache.maven.plugins:maven-compiler-plugin:2.3.2:compile (default-compile) on project SH_27-impl: Compilation failure
  653. /home/rcbandit/Desktop/NetBeans/Prototype_3/SH_27/SH_27-impl/src/main/java/org/DX_57/osgi/SH_27/impl/SessionHandleImpl.java:[42,27] error: cannot find symbol
  654.  
  655.         at org.apache.maven.lifecycle.internal.MojoExecutor.execute(MojoExecutor.java:213)
  656.         at org.apache.maven.lifecycle.internal.MojoExecutor.execute(MojoExecutor.java:153)
  657.         at org.apache.maven.lifecycle.internal.MojoExecutor.execute(MojoExecutor.java:145)
  658.         at org.apache.maven.lifecycle.internal.LifecycleModuleBuilder.buildProject(LifecycleModuleBuilder.java:84)
  659.         at org.apache.maven.lifecycle.internal.LifecycleModuleBuilder.buildProject(LifecycleModuleBuilder.java:59)
  660.         at org.apache.maven.lifecycle.internal.LifecycleStarter.singleThreadedBuild(LifecycleStarter.java:183)
  661.         at org.apache.maven.lifecycle.internal.LifecycleStarter.execute(LifecycleStarter.java:161)
  662.         at org.apache.maven.DefaultMaven.doExecute(DefaultMaven.java:319)
  663.         at org.apache.maven.DefaultMaven.execute(DefaultMaven.java:156)
  664.         at org.apache.maven.cli.MavenCli.execute(MavenCli.java:537)
  665.         at org.apache.maven.cli.MavenCli.doMain(MavenCli.java:196)
  666.         at org.apache.maven.cli.MavenCli.main(MavenCli.java:141)
  667.         at sun.reflect.NativeMethodAccessorImpl.invoke0(Native Method)
  668.         at sun.reflect.NativeMethodAccessorImpl.invoke(NativeMethodAccessorImpl.java:57)
  669.         at sun.reflect.DelegatingMethodAccessorImpl.invoke(DelegatingMethodAccessorImpl.java:43)
  670.         at java.lang.reflect.Method.invoke(Method.java:601)
  671.         at org.codehaus.plexus.classworlds.launcher.Launcher.launchEnhanced(Launcher.java:290)
  672.         at org.codehaus.plexus.classworlds.launcher.Launcher.launch(Launcher.java:230)
  673.         at org.codehaus.plexus.classworlds.launcher.Launcher.mainWithExitCode(Launcher.java:409)
  674.         at org.codehaus.plexus.classworlds.launcher.Launcher.main(Launcher.java:352)
  675. Caused by: org.apache.maven.plugin.CompilationFailureException: Compilation failure
  676. /home/rcbandit/Desktop/NetBeans/Prototype_3/SH_27/SH_27-impl/src/main/java/org/DX_57/osgi/SH_27/impl/SessionHandleImpl.java:[42,27] error: cannot find symbol
  677.  
  678.         at org.apache.maven.plugin.AbstractCompilerMojo.execute(AbstractCompilerMojo.java:656)
  679.         at org.apache.maven.plugin.CompilerMojo.execute(CompilerMojo.java:128)
  680.         at org.apache.maven.plugin.DefaultBuildPluginManager.executeMojo(DefaultBuildPluginManager.java:101)
  681.         at org.apache.maven.lifecycle.internal.MojoExecutor.execute(MojoExecutor.java:209)
  682.         ... 19 more
  683.  
  684.  
  685. For more information about the errors and possible solutions, please read the following articles:
  686. [Help 1] http://cwiki.apache.org/confluence/display/MAVEN/MojoFailureException
clone this paste RAW Paste Data