This week only. Pastebin PRO Accounts Christmas Special! Don't miss out!Want more features on Pastebin? Sign Up, it's FREE!
Guest

Untitled

By: a guest on Jan 23rd, 2013  |  syntax: None  |  size: 22.26 KB  |  views: 28  |  expires: Never
download  |  raw  |  embed  |  report abuse  |  print
Text below is selected. Please press Ctrl+C to copy to your clipboard. (⌘+C on Mac)
  1. Generating dependencies
  2. CC firmware/common/config.c
  3. BMP2RB rockboxlogo.176x54x16.bmp
  4. BMP2RB usblogo.128x37x16.bmp
  5. BMP2RB default_icons.6x8x16.bmp
  6. CC apps/abrepeat.c
  7. CONVBDF fonts/08-Schumacher-Clean.bdf
  8. CC apps/voice_thread.c
  9. CC apps/rbcodec_helpers.c
  10. GEN version.h
  11. CC apps/status.c
  12. CC apps/scrobbler.c
  13. CC apps/gui/scrollbar.c
  14. CC apps/gui/statusbar-skinned.c
  15. CC apps/gui/viewport.c
  16. CC apps/gui/skin_engine/skin_backdrops.c
  17. CC apps/gui/skin_engine/skin_engine.c
  18. CC apps/gui/skin_engine/skin_render.c
  19. CC apps/gui/backdrop.c
  20. CC apps/recorder/bmp.c
  21. CC apps/recorder/resize.c
  22. CC apps/recorder/albumart.c
  23. CC apps/radio/radio_skin.c
  24. CC apps/radio/radioart.c
  25. CC apps/audio_path.c
  26. CC apps/fixedpoint.c
  27. CC apps/pcmbuf.c
  28. CC apps/codec_thread.c
  29. CC apps/playback.c
  30. CC apps/beep.c
  31. CC apps/recorder/pcm_record.c
  32. CC apps/keymaps/keymap-zenxfi3.c
  33. CC firmware/asm/ffs.c
  34. CC firmware/asm/memset16.c
  35. CC firmware/ata_idle_notify.c
  36. CC firmware/events.c
  37. CC firmware/backlight.c
  38. CC firmware/buflib.c
  39. CC firmware/core_alloc.c
  40. CC firmware/general.c
  41. CC firmware/powermgmt.c
  42. CC firmware/target/hosted/cpuinfo-linux.c
  43. CC firmware/target/hosted/rtc.c
  44. CC firmware/target/hosted/debug-hosted.c
  45. CC firmware/system.c
  46. CC firmware/usb.c
  47. CC firmware/kernel.c
  48. CC firmware/panic.c
  49. CC firmware/target/hosted/sdl/button-sdl.c
  50. CC firmware/target/hosted/sdl/kernel-sdl.c
  51. CC firmware/target/hosted/sdl/lcd-bitmap.c
  52. CC firmware/target/hosted/sdl/lcd-sdl.c
  53. CC firmware/target/hosted/sdl/system-sdl.c
  54. CC firmware/thread.c
  55. CC firmware/target/hosted/sdl/timer-sdl.c
  56. CC firmware/common/version.c
  57. In file included from /usr/include/x86_64-linux-gnu/asm/signal.h:6:0,
  58.                  from /home/jean-louis/Informatique/Rockbox/rbfuzep/rockbox/firmware/asm/thread-unix.c:33,
  59.                  from /home/jean-louis/Informatique/Rockbox/rbfuzep/rockbox/firmware/asm/thread.c:5,
  60.                  from /home/jean-louis/Informatique/Rockbox/rbfuzep/rockbox/firmware/thread.c:191:
  61. /usr/include/linux/time.h:9:8: error: redefinition of ‘struct timespec’
  62. In file included from /usr/include/signal.h:76:0,
  63.                  from /home/jean-louis/Informatique/Rockbox/rbfuzep/rockbox/firmware/asm/thread.h:40,
  64.                  from /home/jean-louis/Informatique/Rockbox/rbfuzep/rockbox/firmware/export/thread.h:109,
  65.                  from /home/jean-louis/Informatique/Rockbox/rbfuzep/rockbox/firmware/thread.c:33:
  66. /usr/include/time.h:120:8: note: originally defined here
  67. In file included from /usr/include/x86_64-linux-gnu/asm/signal.h:6:0,
  68.                  from /home/jean-louis/Informatique/Rockbox/rbfuzep/rockbox/firmware/asm/thread-unix.c:33,
  69.                  from /home/jean-louis/Informatique/Rockbox/rbfuzep/rockbox/firmware/asm/thread.c:5,
  70.                  from /home/jean-louis/Informatique/Rockbox/rbfuzep/rockbox/firmware/thread.c:191:
  71. /usr/include/linux/time.h:15:8: error: redefinition of ‘struct timeval’
  72. In file included from /usr/include/x86_64-linux-gnu/sys/select.h:46:0,
  73.                  from /usr/include/x86_64-linux-gnu/sys/types.h:220,
  74.                  from /usr/include/stdlib.h:320,
  75.                  from /home/jean-louis/Informatique/Rockbox/rbfuzep/rockbox/firmware/asm/thread-unix.c:24,
  76.                  from /home/jean-louis/Informatique/Rockbox/rbfuzep/rockbox/firmware/asm/thread.c:5,
  77.                  from /home/jean-louis/Informatique/Rockbox/rbfuzep/rockbox/firmware/thread.c:191:
  78. /usr/include/x86_64-linux-gnu/bits/time.h:75:8: note: originally defined here
  79. In file included from /usr/include/x86_64-linux-gnu/asm/signal.h:6:0,
  80.                  from /home/jean-louis/Informatique/Rockbox/rbfuzep/rockbox/firmware/asm/thread-unix.c:33,
  81.                  from /home/jean-louis/Informatique/Rockbox/rbfuzep/rockbox/firmware/asm/thread.c:5,
  82.                  from /home/jean-louis/Informatique/Rockbox/rbfuzep/rockbox/firmware/thread.c:191:
  83. /usr/include/linux/time.h:42:8: error: redefinition of ‘struct itimerspec’
  84. In file included from /usr/include/pthread.h:26:0,
  85.                  from /home/jean-louis/Informatique/Rockbox/rbfuzep/rockbox/firmware/asm/thread-unix.c:30,
  86.                  from /home/jean-louis/Informatique/Rockbox/rbfuzep/rockbox/firmware/asm/thread.c:5,
  87.                  from /home/jean-louis/Informatique/Rockbox/rbfuzep/rockbox/firmware/thread.c:191:
  88. /usr/include/time.h:161:8: note: originally defined here
  89. In file included from /home/jean-louis/Informatique/Rockbox/rbfuzep/rockbox/firmware/asm/thread-unix.c:33:0,
  90.                  from /home/jean-louis/Informatique/Rockbox/rbfuzep/rockbox/firmware/asm/thread.c:5,
  91.                  from /home/jean-louis/Informatique/Rockbox/rbfuzep/rockbox/firmware/thread.c:191:
  92. /usr/include/x86_64-linux-gnu/asm/signal.h:15:23: error: conflicting types for ‘sigset_t’
  93. In file included from /home/jean-louis/Informatique/Rockbox/rbfuzep/rockbox/firmware/asm/thread.h:40:0,
  94.                  from /home/jean-louis/Informatique/Rockbox/rbfuzep/rockbox/firmware/export/thread.h:109,
  95.                  from /home/jean-louis/Informatique/Rockbox/rbfuzep/rockbox/firmware/thread.c:33:
  96. /usr/include/signal.h:50:20: note: previous declaration of ‘sigset_t’ was here
  97. In file included from /home/jean-louis/Informatique/Rockbox/rbfuzep/rockbox/firmware/asm/thread-unix.c:33:0,
  98.                  from /home/jean-louis/Informatique/Rockbox/rbfuzep/rockbox/firmware/asm/thread.c:5,
  99.                  from /home/jean-louis/Informatique/Rockbox/rbfuzep/rockbox/firmware/thread.c:191:
  100. /usr/include/x86_64-linux-gnu/asm/signal.h:119:8: error: redefinition of ‘struct sigaction’
  101. In file included from /usr/include/signal.h:252:0,
  102.                  from /home/jean-louis/Informatique/Rockbox/rbfuzep/rockbox/firmware/asm/thread.h:40,
  103.                  from /home/jean-louis/Informatique/Rockbox/rbfuzep/rockbox/firmware/export/thread.h:109,
  104.                  from /home/jean-louis/Informatique/Rockbox/rbfuzep/rockbox/firmware/thread.c:33:
  105. /usr/include/x86_64-linux-gnu/bits/sigaction.h:25:8: note: originally defined here
  106. In file included from /home/jean-louis/Informatique/Rockbox/rbfuzep/rockbox/firmware/asm/thread-unix.c:33:0,
  107.                  from /home/jean-louis/Informatique/Rockbox/rbfuzep/rockbox/firmware/asm/thread.c:5,
  108.                  from /home/jean-louis/Informatique/Rockbox/rbfuzep/rockbox/firmware/thread.c:191:
  109. /usr/include/x86_64-linux-gnu/asm/signal.h:120:17: error: expected ‘:’, ‘,’, ‘;’, ‘}’ or ‘__attribute__’ before ‘.’ token
  110. /usr/include/x86_64-linux-gnu/asm/signal.h:132:16: error: redefinition of ‘struct sigaltstack’
  111. In file included from /usr/include/signal.h:356:0,
  112.                  from /home/jean-louis/Informatique/Rockbox/rbfuzep/rockbox/firmware/asm/thread.h:40,
  113.                  from /home/jean-louis/Informatique/Rockbox/rbfuzep/rockbox/firmware/export/thread.h:109,
  114.                  from /home/jean-louis/Informatique/Rockbox/rbfuzep/rockbox/firmware/thread.c:33:
  115. /usr/include/x86_64-linux-gnu/bits/sigstack.h:50:16: note: originally defined here
  116. In file included from /home/jean-louis/Informatique/Rockbox/rbfuzep/rockbox/firmware/asm/thread-unix.c:33:0,
  117.                  from /home/jean-louis/Informatique/Rockbox/rbfuzep/rockbox/firmware/asm/thread.c:5,
  118.                  from /home/jean-louis/Informatique/Rockbox/rbfuzep/rockbox/firmware/thread.c:191:
  119. /usr/include/x86_64-linux-gnu/asm/signal.h:136:3: error: conflicting types for ‘stack_t’
  120. In file included from /usr/include/signal.h:356:0,
  121.                  from /home/jean-louis/Informatique/Rockbox/rbfuzep/rockbox/firmware/asm/thread.h:40,
  122.                  from /home/jean-louis/Informatique/Rockbox/rbfuzep/rockbox/firmware/export/thread.h:109,
  123.                  from /home/jean-louis/Informatique/Rockbox/rbfuzep/rockbox/firmware/thread.c:33:
  124. /usr/include/x86_64-linux-gnu/bits/sigstack.h:55:5: note: previous declaration of ‘stack_t’ was here
  125. In file included from /home/jean-louis/Informatique/Rockbox/rbfuzep/rockbox/firmware/asm/thread.c:5:0,
  126.                  from /home/jean-louis/Informatique/Rockbox/rbfuzep/rockbox/firmware/thread.c:191:
  127. /home/jean-louis/Informatique/Rockbox/rbfuzep/rockbox/firmware/asm/thread-unix.c: In function ‘make_context’:
  128. /home/jean-louis/Informatique/Rockbox/rbfuzep/rockbox/firmware/asm/thread-unix.c:95:5: warning: passing argument 1 of ‘sigemptyset’ from incompatible pointer type [enabled by default]
  129. In file included from /home/jean-louis/Informatique/Rockbox/rbfuzep/rockbox/firmware/asm/thread.h:40:0,
  130.                  from /home/jean-louis/Informatique/Rockbox/rbfuzep/rockbox/firmware/export/thread.h:109,
  131.                  from /home/jean-louis/Informatique/Rockbox/rbfuzep/rockbox/firmware/thread.c:33:
  132. /usr/include/signal.h:222:12: note: expected ‘struct sigset_t *’ but argument is of type ‘sigset_t *’
  133. In file included from /home/jean-louis/Informatique/Rockbox/rbfuzep/rockbox/firmware/asm/thread.c:5:0,
  134.                  from /home/jean-louis/Informatique/Rockbox/rbfuzep/rockbox/firmware/thread.c:191:
  135. /home/jean-louis/Informatique/Rockbox/rbfuzep/rockbox/firmware/asm/thread-unix.c:96:5: warning: passing argument 1 of ‘sigaddset’ from incompatible pointer type [enabled by default]
  136. In file included from /home/jean-louis/Informatique/Rockbox/rbfuzep/rockbox/firmware/asm/thread.h:40:0,
  137.                  from /home/jean-louis/Informatique/Rockbox/rbfuzep/rockbox/firmware/export/thread.h:109,
  138.                  from /home/jean-louis/Informatique/Rockbox/rbfuzep/rockbox/firmware/thread.c:33:
  139. /usr/include/signal.h:228:12: note: expected ‘struct sigset_t *’ but argument is of type ‘sigset_t *’
  140. In file included from /home/jean-louis/Informatique/Rockbox/rbfuzep/rockbox/firmware/asm/thread.c:5:0,
  141.                  from /home/jean-louis/Informatique/Rockbox/rbfuzep/rockbox/firmware/thread.c:191:
  142. /home/jean-louis/Informatique/Rockbox/rbfuzep/rockbox/firmware/asm/thread-unix.c:97:5: warning: passing argument 2 of ‘sigprocmask’ from incompatible pointer type [enabled by default]
  143. In file included from /home/jean-louis/Informatique/Rockbox/rbfuzep/rockbox/firmware/asm/thread.h:40:0,
  144.                  from /home/jean-louis/Informatique/Rockbox/rbfuzep/rockbox/firmware/export/thread.h:109,
  145.                  from /home/jean-louis/Informatique/Rockbox/rbfuzep/rockbox/firmware/thread.c:33:
  146. /usr/include/signal.h:255:12: note: expected ‘const struct sigset_t * restrict’ but argument is of type ‘sigset_t *’
  147. In file included from /home/jean-louis/Informatique/Rockbox/rbfuzep/rockbox/firmware/asm/thread.c:5:0,
  148.                  from /home/jean-louis/Informatique/Rockbox/rbfuzep/rockbox/firmware/thread.c:191:
  149. /home/jean-louis/Informatique/Rockbox/rbfuzep/rockbox/firmware/asm/thread-unix.c:97:5: warning: passing argument 3 of ‘sigprocmask’ from incompatible pointer type [enabled by default]
  150. In file included from /home/jean-louis/Informatique/Rockbox/rbfuzep/rockbox/firmware/asm/thread.h:40:0,
  151.                  from /home/jean-louis/Informatique/Rockbox/rbfuzep/rockbox/firmware/export/thread.h:109,
  152.                  from /home/jean-louis/Informatique/Rockbox/rbfuzep/rockbox/firmware/thread.c:33:
  153. /usr/include/signal.h:255:12: note: expected ‘struct sigset_t * restrict’ but argument is of type ‘sigset_t *’
  154. In file included from /home/jean-louis/Informatique/Rockbox/rbfuzep/rockbox/firmware/asm/thread.c:5:0,
  155.                  from /home/jean-louis/Informatique/Rockbox/rbfuzep/rockbox/firmware/thread.c:191:
  156. /home/jean-louis/Informatique/Rockbox/rbfuzep/rockbox/firmware/asm/thread-unix.c:98:7: error: ‘struct sigaction’ has no member named ‘__sigaction_handler’
  157. /home/jean-louis/Informatique/Rockbox/rbfuzep/rockbox/firmware/asm/thread-unix.c:99:20: error: ‘struct sigaction’ has no member named ‘sa_mask’
  158. /home/jean-louis/Informatique/Rockbox/rbfuzep/rockbox/firmware/asm/thread-unix.c:100:7: error: ‘struct sigaction’ has no member named ‘sa_flags’
  159. /home/jean-louis/Informatique/Rockbox/rbfuzep/rockbox/firmware/asm/thread-unix.c:101:5: warning: passing argument 2 of ‘sigaction’ from incompatible pointer type [enabled by default]
  160. In file included from /home/jean-louis/Informatique/Rockbox/rbfuzep/rockbox/firmware/asm/thread.h:40:0,
  161.                  from /home/jean-louis/Informatique/Rockbox/rbfuzep/rockbox/firmware/export/thread.h:109,
  162.                  from /home/jean-louis/Informatique/Rockbox/rbfuzep/rockbox/firmware/thread.c:33:
  163. /usr/include/signal.h:266:12: note: expected ‘const struct sigaction * restrict’ but argument is of type ‘struct sigaction *’
  164. In file included from /home/jean-louis/Informatique/Rockbox/rbfuzep/rockbox/firmware/asm/thread.c:5:0,
  165.                  from /home/jean-louis/Informatique/Rockbox/rbfuzep/rockbox/firmware/thread.c:191:
  166. /home/jean-louis/Informatique/Rockbox/rbfuzep/rockbox/firmware/asm/thread-unix.c:101:5: warning: passing argument 3 of ‘sigaction’ from incompatible pointer type [enabled by default]
  167. In file included from /home/jean-louis/Informatique/Rockbox/rbfuzep/rockbox/firmware/asm/thread.h:40:0,
  168.                  from /home/jean-louis/Informatique/Rockbox/rbfuzep/rockbox/firmware/export/thread.h:109,
  169.                  from /home/jean-louis/Informatique/Rockbox/rbfuzep/rockbox/firmware/thread.c:33:
  170. /usr/include/signal.h:266:12: note: expected ‘struct sigaction * restrict’ but argument is of type ‘struct sigaction *’
  171. In file included from /home/jean-louis/Informatique/Rockbox/rbfuzep/rockbox/firmware/asm/thread.c:5:0,
  172.                  from /home/jean-louis/Informatique/Rockbox/rbfuzep/rockbox/firmware/thread.c:191:
  173. /home/jean-louis/Informatique/Rockbox/rbfuzep/rockbox/firmware/asm/thread-unix.c:123:5: warning: passing argument 1 of ‘sigaltstack’ from incompatible pointer type [enabled by default]
  174. In file included from /home/jean-louis/Informatique/Rockbox/rbfuzep/rockbox/firmware/asm/thread.h:40:0,
  175.                  from /home/jean-louis/Informatique/Rockbox/rbfuzep/rockbox/firmware/export/thread.h:109,
  176.                  from /home/jean-louis/Informatique/Rockbox/rbfuzep/rockbox/firmware/thread.c:33:
  177. /usr/include/signal.h:370:12: note: expected ‘const struct sigaltstack * restrict’ but argument is of type ‘struct stack_t *’
  178. In file included from /home/jean-louis/Informatique/Rockbox/rbfuzep/rockbox/firmware/asm/thread.c:5:0,
  179.                  from /home/jean-louis/Informatique/Rockbox/rbfuzep/rockbox/firmware/thread.c:191:
  180. /home/jean-louis/Informatique/Rockbox/rbfuzep/rockbox/firmware/asm/thread-unix.c:123:5: warning: passing argument 2 of ‘sigaltstack’ from incompatible pointer type [enabled by default]
  181. In file included from /home/jean-louis/Informatique/Rockbox/rbfuzep/rockbox/firmware/asm/thread.h:40:0,
  182.                  from /home/jean-louis/Informatique/Rockbox/rbfuzep/rockbox/firmware/export/thread.h:109,
  183.                  from /home/jean-louis/Informatique/Rockbox/rbfuzep/rockbox/firmware/thread.c:33:
  184. /usr/include/signal.h:370:12: note: expected ‘struct sigaltstack * restrict’ but argument is of type ‘struct stack_t *’
  185. In file included from /home/jean-louis/Informatique/Rockbox/rbfuzep/rockbox/firmware/asm/thread.c:5:0,
  186.                  from /home/jean-louis/Informatique/Rockbox/rbfuzep/rockbox/firmware/thread.c:191:
  187. /home/jean-louis/Informatique/Rockbox/rbfuzep/rockbox/firmware/asm/thread-unix.c:138:5: warning: passing argument 1 of ‘sigfillset’ from incompatible pointer type [enabled by default]
  188. In file included from /home/jean-louis/Informatique/Rockbox/rbfuzep/rockbox/firmware/asm/thread.h:40:0,
  189.                  from /home/jean-louis/Informatique/Rockbox/rbfuzep/rockbox/firmware/export/thread.h:109,
  190.                  from /home/jean-louis/Informatique/Rockbox/rbfuzep/rockbox/firmware/thread.c:33:
  191. /usr/include/signal.h:225:12: note: expected ‘struct sigset_t *’ but argument is of type ‘sigset_t *’
  192. In file included from /home/jean-louis/Informatique/Rockbox/rbfuzep/rockbox/firmware/asm/thread.c:5:0,
  193.                  from /home/jean-louis/Informatique/Rockbox/rbfuzep/rockbox/firmware/thread.c:191:
  194. /home/jean-louis/Informatique/Rockbox/rbfuzep/rockbox/firmware/asm/thread-unix.c:139:5: warning: passing argument 1 of ‘sigdelset’ from incompatible pointer type [enabled by default]
  195. In file included from /home/jean-louis/Informatique/Rockbox/rbfuzep/rockbox/firmware/asm/thread.h:40:0,
  196.                  from /home/jean-louis/Informatique/Rockbox/rbfuzep/rockbox/firmware/export/thread.h:109,
  197.                  from /home/jean-louis/Informatique/Rockbox/rbfuzep/rockbox/firmware/thread.c:33:
  198. /usr/include/signal.h:231:12: note: expected ‘struct sigset_t *’ but argument is of type ‘sigset_t *’
  199. In file included from /home/jean-louis/Informatique/Rockbox/rbfuzep/rockbox/firmware/asm/thread.c:5:0,
  200.                  from /home/jean-louis/Informatique/Rockbox/rbfuzep/rockbox/firmware/thread.c:191:
  201. /home/jean-louis/Informatique/Rockbox/rbfuzep/rockbox/firmware/asm/thread-unix.c:142:9: warning: passing argument 1 of ‘sigsuspend’ from incompatible pointer type [enabled by default]
  202. In file included from /home/jean-louis/Informatique/Rockbox/rbfuzep/rockbox/firmware/asm/thread.h:40:0,
  203.                  from /home/jean-louis/Informatique/Rockbox/rbfuzep/rockbox/firmware/export/thread.h:109,
  204.                  from /home/jean-louis/Informatique/Rockbox/rbfuzep/rockbox/firmware/thread.c:33:
  205. /usr/include/signal.h:263:12: note: expected ‘const struct sigset_t *’ but argument is of type ‘sigset_t *’
  206. In file included from /home/jean-louis/Informatique/Rockbox/rbfuzep/rockbox/firmware/asm/thread.c:5:0,
  207.                  from /home/jean-louis/Informatique/Rockbox/rbfuzep/rockbox/firmware/thread.c:191:
  208. /home/jean-louis/Informatique/Rockbox/rbfuzep/rockbox/firmware/asm/thread-unix.c:149:5: warning: passing argument 2 of ‘sigaltstack’ from incompatible pointer type [enabled by default]
  209. In file included from /home/jean-louis/Informatique/Rockbox/rbfuzep/rockbox/firmware/asm/thread.h:40:0,
  210.                  from /home/jean-louis/Informatique/Rockbox/rbfuzep/rockbox/firmware/export/thread.h:109,
  211.                  from /home/jean-louis/Informatique/Rockbox/rbfuzep/rockbox/firmware/thread.c:33:
  212. /usr/include/signal.h:370:12: note: expected ‘struct sigaltstack * restrict’ but argument is of type ‘struct stack_t *’
  213. In file included from /home/jean-louis/Informatique/Rockbox/rbfuzep/rockbox/firmware/asm/thread.c:5:0,
  214.                  from /home/jean-louis/Informatique/Rockbox/rbfuzep/rockbox/firmware/thread.c:191:
  215. /home/jean-louis/Informatique/Rockbox/rbfuzep/rockbox/firmware/asm/thread-unix.c:151:5: warning: passing argument 1 of ‘sigaltstack’ from incompatible pointer type [enabled by default]
  216. In file included from /home/jean-louis/Informatique/Rockbox/rbfuzep/rockbox/firmware/asm/thread.h:40:0,
  217.                  from /home/jean-louis/Informatique/Rockbox/rbfuzep/rockbox/firmware/export/thread.h:109,
  218.                  from /home/jean-louis/Informatique/Rockbox/rbfuzep/rockbox/firmware/thread.c:33:
  219. /usr/include/signal.h:370:12: note: expected ‘const struct sigaltstack * restrict’ but argument is of type ‘struct stack_t *’
  220. In file included from /home/jean-louis/Informatique/Rockbox/rbfuzep/rockbox/firmware/asm/thread.c:5:0,
  221.                  from /home/jean-louis/Informatique/Rockbox/rbfuzep/rockbox/firmware/thread.c:191:
  222. /home/jean-louis/Informatique/Rockbox/rbfuzep/rockbox/firmware/asm/thread-unix.c:156:5: warning: passing argument 2 of ‘sigaltstack’ from incompatible pointer type [enabled by default]
  223. In file included from /home/jean-louis/Informatique/Rockbox/rbfuzep/rockbox/firmware/asm/thread.h:40:0,
  224.                  from /home/jean-louis/Informatique/Rockbox/rbfuzep/rockbox/firmware/export/thread.h:109,
  225.                  from /home/jean-louis/Informatique/Rockbox/rbfuzep/rockbox/firmware/thread.c:33:
  226. /usr/include/signal.h:370:12: note: expected ‘struct sigaltstack * restrict’ but argument is of type ‘struct stack_t *’
  227. In file included from /home/jean-louis/Informatique/Rockbox/rbfuzep/rockbox/firmware/asm/thread.c:5:0,
  228.                  from /home/jean-louis/Informatique/Rockbox/rbfuzep/rockbox/firmware/thread.c:191:
  229. /home/jean-louis/Informatique/Rockbox/rbfuzep/rockbox/firmware/asm/thread-unix.c:163:9: warning: passing argument 1 of ‘sigaltstack’ from incompatible pointer type [enabled by default]
  230. In file included from /home/jean-louis/Informatique/Rockbox/rbfuzep/rockbox/firmware/asm/thread.h:40:0,
  231.                  from /home/jean-louis/Informatique/Rockbox/rbfuzep/rockbox/firmware/export/thread.h:109,
  232.                  from /home/jean-louis/Informatique/Rockbox/rbfuzep/rockbox/firmware/thread.c:33:
  233. /usr/include/signal.h:370:12: note: expected ‘const struct sigaltstack * restrict’ but argument is of type ‘struct stack_t *’
  234. In file included from /home/jean-louis/Informatique/Rockbox/rbfuzep/rockbox/firmware/asm/thread.c:5:0,
  235.                  from /home/jean-louis/Informatique/Rockbox/rbfuzep/rockbox/firmware/thread.c:191:
  236. /home/jean-louis/Informatique/Rockbox/rbfuzep/rockbox/firmware/asm/thread-unix.c:168:5: warning: passing argument 2 of ‘sigaction’ from incompatible pointer type [enabled by default]
  237. In file included from /home/jean-louis/Informatique/Rockbox/rbfuzep/rockbox/firmware/asm/thread.h:40:0,
  238.                  from /home/jean-louis/Informatique/Rockbox/rbfuzep/rockbox/firmware/export/thread.h:109,
  239.                  from /home/jean-louis/Informatique/Rockbox/rbfuzep/rockbox/firmware/thread.c:33:
  240. /usr/include/signal.h:266:12: note: expected ‘const struct sigaction * restrict’ but argument is of type ‘struct sigaction *’
  241. In file included from /home/jean-louis/Informatique/Rockbox/rbfuzep/rockbox/firmware/asm/thread.c:5:0,
  242.                  from /home/jean-louis/Informatique/Rockbox/rbfuzep/rockbox/firmware/thread.c:191:
  243. /home/jean-louis/Informatique/Rockbox/rbfuzep/rockbox/firmware/asm/thread-unix.c:169:5: warning: passing argument 2 of ‘sigprocmask’ from incompatible pointer type [enabled by default]
  244. In file included from /home/jean-louis/Informatique/Rockbox/rbfuzep/rockbox/firmware/asm/thread.h:40:0,
  245.                  from /home/jean-louis/Informatique/Rockbox/rbfuzep/rockbox/firmware/export/thread.h:109,
  246.                  from /home/jean-louis/Informatique/Rockbox/rbfuzep/rockbox/firmware/thread.c:33:
  247. /usr/include/signal.h:255:12: note: expected ‘const struct sigset_t * restrict’ but argument is of type ‘sigset_t *’
  248. CC firmware/common/crc32.c
  249. make: *** [/home/jean-louis/Informatique/Rockbox/rbfuzep/rockbox/buildzenx3/firmware/thread.o] Erreur 1
  250. make: *** Attente des tâches non terminées....
clone this paste RAW Paste Data