SHARE
TWEET

Untitled

a guest May 12th, 2012 51 Never
  1. [ 23%] Building CXX object src/CMakeFiles/minetest.dir/filesys.cpp.o
  2. /home/ricky/minetest/src/celeron55-minetest-bc0e5c0/src/filesys.cpp: In function ‘bool fs::RecursiveDelete(std::string)’:
  3. /home/ricky/minetest/src/celeron55-minetest-bc0e5c0/src/filesys.cpp:236:25: error: ‘fork’ was not declared in this scope
  4. /home/ricky/minetest/src/celeron55-minetest-bc0e5c0/src/filesys.cpp:254:22: error: ‘execv’ was not declared in this scope
  5. /home/ricky/minetest/src/celeron55-minetest-bc0e5c0/src/filesys.cpp:257:10: error: ‘_exit’ was not declared in this scope
  6. /home/ricky/minetest/src/celeron55-minetest-bc0e5c0/src/filesys.cpp:270:1: warning: control reaches end of non-void function [-Wreturn-type]
  7. make[2]: *** [src/CMakeFiles/minetest.dir/filesys.cpp.o] Error 1
  8. make[1]: *** [src/CMakeFiles/minetest.dir/all] Error 2
  9. make: *** [all] Error 2
  10. ==> ERROR: A failure occurred in build().
  11.     Aborting...
  12. [~/src/pkg] %
RAW Paste Data
Top