This week only. Pastebin PRO Accounts Christmas Special! Don't miss out!Want more features on Pastebin? Sign Up, it's FREE!
Guest

Failed build of nmapsi4 in Archlinux-64-bits

By: a guest on Aug 13th, 2012  |  syntax: None  |  size: 7.11 KB  |  views: 28  |  expires: Never
download  |  raw  |  embed  |  report abuse  |  print
Text below is selected. Please press Ctrl+C to copy to your clipboard. (⌘+C on Mac)
  1. [chris@christiane ~]$ yaourt nmapsi4
  2. 1 aur/nmapsi4 0.3.1-1 (97)
  3.     Qt-based GUI for nmap.
  4. ==> Numéro(s) des paquets à installer (ex: 1 2 3 ou 1-3)
  5. ==> ----------------------------------------------------
  6. ==> 1
  7.  
  8.  
  9. ==> Téléchargement du PKGBUILD de nmapsi4 depuis AUR...
  10. x PKGBUILD
  11.  
  12.  
  13. ( Paquet non supporté : peut être dangereux ! )
  14.  
  15. ==> Dépendances de nmapsi4 :
  16.  - qt (déjà installé)
  17.  - nmap (déjà installé)
  18.  - cmake (déjà installé)
  19.  
  20.  
  21. ==> Éditer PKGBUILD ? [O/n] ("A" pour annuler)
  22. ==> ------------------------------------------
  23. ==> n
  24.  
  25. ==> Lancer la compilation de nmapsi4 ? [O/n]
  26. ==> ----------------------------------------
  27. ==>
  28. ==> Construction et installation du paquet
  29. ==> Création du paquet nmapsi4 0.3.1-1 (lun. août 13 13:29:54 CEST 2012)
  30. ==> Vérification des dépendances pour l'exécution...
  31. ==> Vérification des dépendances pour la compilation...
  32. ==> Récupération des sources...
  33.   -> Téléchargement de nmapsi4-0.3.1.tar.bz2...
  34.   % Total    % Received % Xferd  Average Speed   Time    Time     Time  Current
  35.                                  Dload  Upload   Total   Spent    Left  Speed
  36. 100 3321k  100 3321k    0     0  1142k      0  0:00:02  0:00:02 --:--:-- 1190k
  37. ==> Validation des fichiers sources avec md5sums...
  38.     nmapsi4-0.3.1.tar.bz2 ... Réussite
  39. ==> Extraction des sources...
  40.   -> Extraction de nmapsi4-0.3.1.tar.bz2 avec bsdtar
  41. ==> Lancement de build()...
  42. -- The C compiler identification is GNU 4.7.1
  43. -- The CXX compiler identification is GNU 4.7.1
  44. -- Check for working C compiler: /usr/bin/gcc
  45. -- Check for working C compiler: /usr/bin/gcc -- works
  46. -- Detecting C compiler ABI info
  47. -- Detecting C compiler ABI info - done
  48. -- Check for working CXX compiler: /usr/bin/c++
  49. -- Check for working CXX compiler: /usr/bin/c++ -- works
  50. -- Detecting CXX compiler ABI info
  51. -- Detecting CXX compiler ABI info - done
  52. -- Looking for Q_WS_X11
  53. -- Looking for Q_WS_X11 - found
  54. -- Looking for Q_WS_WIN
  55. -- Looking for Q_WS_WIN - not found.
  56. -- Looking for Q_WS_QWS
  57. -- Looking for Q_WS_QWS - not found.
  58. -- Looking for Q_WS_MAC
  59. -- Looking for Q_WS_MAC - not found.
  60. -- Found Qt4: /usr/bin/qmake (found suitable version "4.8.2", required is "4.5.3")
  61. nmapsi4:: update translation
  62. nmapsi4-logr:: update translation
  63. ------------------------------------------------
  64.  Required for build:   qt4-dev (>> 4.5.3)
  65.  Required for runtime: nmap ( >= 5.51 ) with nping for discovery tool
  66.  Recommends for runtime: dig
  67. ------------------------------------------------
  68. -- Configuring done
  69. -- Generating done
  70. -- Build files have been written to: /tmp/yaourt-tmp-chris/aur-nmapsi4/src/nmapsi4-0.3.1/build
  71. Scanning dependencies of target nmapsi4_history
  72. [  1%] Building CXX object lib/history/CMakeFiles/nmapsi4_history.dir/coreHistory.cpp.o
  73. [  2%] Building CXX object lib/history/CMakeFiles/nmapsi4_history.dir/loghistory.cpp.o                                                                          
  74. Linking CXX static library libnmapsi4_history.a
  75. [  2%] Built target nmapsi4_history
  76. [  3%] Generating qrc_mainwin.cxx
  77. [  4%] Generating ui_about.h
  78. Scanning dependencies of target nmapsi4_about
  79. [  5%] Building CXX object lib/about/CMakeFiles/nmapsi4_about.dir/about.cpp.o
  80. [  6%] Building CXX object lib/about/CMakeFiles/nmapsi4_about.dir/qrc_mainwin.cxx.o                                                                              
  81. Linking CXX static library libnmapsi4_about.a
  82. [  6%] Built target nmapsi4_about
  83. [  7%] Generating nmapsi4_ru.qm
  84. Updating '/tmp/yaourt-tmp-chris/aur-nmapsi4/src/nmapsi4-0.3.1/build/nmapsi4/nmapsi4_ru.qm'...
  85.     Generated 298 translation(s) (142 finished and 156 unfinished)
  86. [  8%] Generating nmapsi4adaptor.cpp, nmapsi4adaptor.h
  87. [  9%] Generating nmapsi4adaptor.moc
  88. [ 10%] Generating app/moc_mainwin.cxx
  89. [ 11%] Generating platform/lookup/moc_lookUpT.cxx
  90. [ 12%] Generating platform/digSupport/moc_digSupport.cxx
  91. [ 13%] Generating platform/vulnerability/moc_addurl.cxx
  92. [ 14%] Generating platform/vulnerability/moc_vulnerability.cxx
  93. [ 15%] Generating platform/bookmarks/moc_addparbook.cxx
  94. [ 16%] Generating platform/discover/moc_maindiscover.cxx
  95. [ 17%] Generating common/moc_utilities.cxx
  96. [ 18%] Generating common/moc_qprocessthread.cxx
  97. [ 19%] Generating app/preference/moc_profilemain.cxx
  98. [ 20%] Generating app/monitor/moc_details.cxx
  99. [ 21%] Generating app/monitor/moc_monitor.cxx
  100. [ 22%] Generating app/parser/moc_parser.cxx
  101. [ 23%] Generating ui_mainwin.h
  102. [ 24%] Generating ui_addurl.h
  103. [ 25%] Generating ui_addparbook.h
  104. [ 26%] Generating ui_profilemain.h
  105. [ 27%] Generating ui_details.h
  106. [ 28%] Generating qrc_mainwin.cxx
  107. [ 29%] Generating nmapsi4_it.qm
  108. Updating '/tmp/yaourt-tmp-chris/aur-nmapsi4/src/nmapsi4-0.3.1/build/nmapsi4/nmapsi4_it.qm'...
  109.     Generated 298 translation(s) (298 finished and 0 unfinished)
  110. [ 30%] Generating nmapsi4_fr.qm
  111. Updating '/tmp/yaourt-tmp-chris/aur-nmapsi4/src/nmapsi4-0.3.1/build/nmapsi4/nmapsi4_fr.qm'...
  112.     Generated 286 translation(s) (262 finished and 24 unfinished)
  113.     Ignored 12 untranslated source text(s)
  114. [ 31%] Generating nmapsi4_es.qm
  115. Updating '/tmp/yaourt-tmp-chris/aur-nmapsi4/src/nmapsi4-0.3.1/build/nmapsi4/nmapsi4_es.qm'...
  116.     Generated 298 translation(s) (298 finished and 0 unfinished)
  117. [ 32%] Generating nmapsi4_de.qm
  118. Updating '/tmp/yaourt-tmp-chris/aur-nmapsi4/src/nmapsi4-0.3.1/build/nmapsi4/nmapsi4_de.qm'...
  119.     Generated 133 translation(s) (126 finished and 7 unfinished)
  120.     Ignored 165 untranslated source text(s)
  121. [ 34%] Generating nmapsi4_pl.qm
  122. Updating '/tmp/yaourt-tmp-chris/aur-nmapsi4/src/nmapsi4-0.3.1/build/nmapsi4/nmapsi4_pl.qm'...
  123.     Generated 0 translation(s) (0 finished and 0 unfinished)
  124.     Ignored 298 untranslated source text(s)
  125. [ 35%] Generating nmapsi4_pt_BR.qm
  126. Updating '/tmp/yaourt-tmp-chris/aur-nmapsi4/src/nmapsi4-0.3.1/build/nmapsi4/nmapsi4_pt_BR.qm'...
  127.     Generated 129 translation(s) (0 finished and 129 unfinished)
  128.     Ignored 169 untranslated source text(s)
  129. [ 36%] Generating nmapsi4_cs.qm
  130. Updating '/tmp/yaourt-tmp-chris/aur-nmapsi4/src/nmapsi4-0.3.1/build/nmapsi4/nmapsi4_cs.qm'...
  131.     Generated 298 translation(s) (298 finished and 0 unfinished)
  132. Scanning dependencies of target nmapsi4
  133. [ 37%] Building CXX object nmapsi4/CMakeFiles/nmapsi4.dir/app/parser/parser.cpp.o
  134. [ 38%] Building CXX object nmapsi4/CMakeFiles/nmapsi4.dir/app/parser/parserObjects.cpp.o
  135. [ 39%] Building CXX object nmapsi4/CMakeFiles/nmapsi4.dir/app/monitor/monitor.cpp.o
  136. [ 40%] Building CXX object nmapsi4/CMakeFiles/nmapsi4.dir/app/monitor/details.cpp.o
  137. [ 41%] Building CXX object nmapsi4/CMakeFiles/nmapsi4.dir/app/preference/profilemain.cpp.o
  138. /tmp/yaourt-tmp-chris/aur-nmapsi4/src/nmapsi4-0.3.1/nmapsi4/app/preference/profilemain.cpp: In member function ‘void mainProfile::setProfile()’:
  139. /tmp/yaourt-tmp-chris/aur-nmapsi4/src/nmapsi4-0.3.1/nmapsi4/app/preference/profilemain.cpp:245:18: erreur: ‘getuid’ was not declared in this scope
  140. make[2]: *** [nmapsi4/CMakeFiles/nmapsi4.dir/app/preference/profilemain.cpp.o] Erreur 1
  141. make[1]: *** [nmapsi4/CMakeFiles/nmapsi4.dir/all] Erreur 2
  142. make: *** [all] Erreur 2
  143. ==> ERREUR : Une erreur s'est produite dans build().
  144.     Abandon...
  145. ==> ERREUR: Makepkg n'a pas pu construire nmapsi4.
clone this paste RAW Paste Data