Pastebin launched a little side project called VERYVIRAL.com, check it out ;-) Want more features on Pastebin? Sign Up, it's FREE!
Guest

Untitled

By: a guest on Apr 19th, 2013  |  syntax: None  |  size: 5.94 KB  |  views: 47  |  expires: Never
download  |  raw  |  embed  |  report abuse  |  print
Text below is selected. Please press Ctrl+C to copy to your clipboard. (⌘+C on Mac)
  1. ==> Edit PKGBUILD ? [Y/n] ("A" to abort)
  2. ==> ------------------------------------
  3. ==> n
  4.  
  5. ==> skanlite dependencies:
  6.  - kdebase-runtime (already installed)
  7.  - libksane (already installed)
  8.  - cmake (already installed)
  9.  - automoc4 (already installed)
  10.  
  11.  
  12. ==> Continue building skanlite ? [Y/n]
  13. ==> ----------------------------------
  14. ==>
  15. ==> Building and installing package
  16. ==> Making package: skanlite 1.0-1 (Fri 19 Apr 11:43:35 BST 2013)
  17. ==> Checking runtime dependencies...
  18. ==> Checking buildtime dependencies...
  19. ==> Retrieving sources...
  20.   -> Downloading skanlite-1.0.tar.bz2...
  21.   % Total    % Received % Xferd  Average Speed   Time    Time     Time  Current
  22.                                  Dload  Upload   Total   Spent    Left  Speed
  23. 100   325  100   325    0     0   3223      0 --:--:-- --:--:-- --:--:--  3250
  24. 100 2535k  100 2535k    0     0  3189k      0 --:--:-- --:--:-- --:--:-- 7640k
  25. ==> Validating source files with md5sums...
  26.     skanlite-1.0.tar.bz2 ... Passed
  27. ==> Extracting sources...
  28.   -> Extracting skanlite-1.0.tar.bz2 with bsdtar
  29. ==> Starting build()...
  30. -- The C compiler identification is GNU 4.8.0
  31. -- The CXX compiler identification is GNU 4.8.0
  32. -- Check for working C compiler: /usr/bin/cc
  33. -- Check for working C compiler: /usr/bin/cc -- works
  34. -- Detecting C compiler ABI info
  35. -- Detecting C compiler ABI info - done
  36. -- Check for working CXX compiler: /usr/bin/c++
  37. -- Check for working CXX compiler: /usr/bin/c++ -- works
  38. -- Detecting CXX compiler ABI info
  39. -- Detecting CXX compiler ABI info - done
  40. -- Looking for Q_WS_X11
  41. -- Looking for Q_WS_X11 - found
  42. -- Looking for Q_WS_WIN
  43. -- Looking for Q_WS_WIN - not found
  44. -- Looking for Q_WS_QWS
  45. -- Looking for Q_WS_QWS - not found
  46. -- Looking for Q_WS_MAC
  47. -- Looking for Q_WS_MAC - not found
  48. -- Found Qt-Version 4.8.4 (using /usr/bin/qmake-qt4)
  49. -- Looking for XOpenDisplay in /usr/lib64/libX11.so;/usr/lib64/libXext.so;/usr/lib64/libXft.so;/usr/lib64/libXau.so;/usr/lib64/libXdmcp.so;/usr/lib64/libXpm.so
  50. -- Looking for XOpenDisplay in /usr/lib64/libX11.so;/usr/lib64/libXext.so;/usr/lib64/libXft.so;/usr/lib64/libXau.so;/usr/lib64/libXdmcp.so;/usr/lib64/libXpm.so - found
  51. -- Looking for gethostbyname
  52. -- Looking for gethostbyname - found
  53. -- Looking for connect
  54. -- Looking for connect - found
  55. -- Looking for remove
  56. -- Looking for remove - found
  57. -- Looking for shmat
  58. -- Looking for shmat - found
  59. -- Looking for IceConnectionNumber in ICE
  60. -- Looking for IceConnectionNumber in ICE - found
  61. -- Found X11: /usr/lib64/libX11.so
  62. -- Looking for include file pthread.h
  63. -- Looking for include file pthread.h - found
  64. -- Looking for pthread_create
  65. -- Looking for pthread_create - not found
  66. -- Looking for pthread_create in pthreads
  67. -- Looking for pthread_create in pthreads - not found
  68. -- Looking for pthread_create in pthread
  69. -- Looking for pthread_create in pthread - found
  70. -- Found Threads: TRUE  
  71. -- Found OpenSSL: /usr/lib64/libssl.so;/usr/lib64/libcrypto.so (found version "1.0.1e")
  72. -- Looking for _POSIX_TIMERS
  73. -- Looking for _POSIX_TIMERS - found
  74. -- Found Automoc4: /usr/bin/automoc4  
  75. -- Found Perl: /usr/bin/perl (found version "5.16.3")
  76. -- Found Phonon: /usr/include/qt4 (Required is at least version "4.3.80")
  77. -- Performing Test _OFFT_IS_64BIT
  78. -- Performing Test _OFFT_IS_64BIT - Success
  79. -- Performing Test HAVE_FPIE_SUPPORT
  80. -- Performing Test HAVE_FPIE_SUPPORT - Success
  81. -- Performing Test __KDE_HAVE_W_OVERLOADED_VIRTUAL
  82. -- Performing Test __KDE_HAVE_W_OVERLOADED_VIRTUAL - Success
  83. -- Performing Test __KDE_HAVE_GCC_VISIBILITY
  84. -- Performing Test __KDE_HAVE_GCC_VISIBILITY - Success
  85. -- Found KDE 4.10 include dir: /usr/include
  86. -- Found KDE 4.10 library dir: /usr/lib
  87. -- Found the KDE4 kconfig_compiler preprocessor: /usr/bin/kconfig_compiler
  88. -- Found automoc4: /usr/bin/automoc4
  89. -- Found ZLIB: /usr/lib64/libz.so (found version "1.2.7")
  90. -- Found PNG: /usr/lib64/libpng.so (found version "1.5.15")
  91. -- Looking for dgettext
  92. -- Looking for dgettext - found
  93. -- Found Gettext: built in libc
  94. -- Configuring done
  95. -- Generating done
  96. -- Build files have been written to: /tmp/yaourt-tmp-ben/aur-skanlite/src/build
  97. Scanning dependencies of target skanlite_automoc
  98. Generating ImageViewer.moc
  99. Generating SaveLocation.moc
  100. Generating skanlite.moc
  101. Generating moc_KSaneImageSaver.cpp
  102. [  0%] Built target skanlite_automoc
  103. [  1%] Generating ui_SaveLocation.h
  104. [  2%] Generating ui_settings.h
  105. Scanning dependencies of target skanlite
  106. [  4%] Building CXX object src/CMakeFiles/skanlite.dir/skanlite_automoc.o
  107. [  5%] Building CXX object src/CMakeFiles/skanlite.dir/main.o
  108. [  7%] Building CXX object src/CMakeFiles/skanlite.dir/skanlite.o
  109. [  8%] Building CXX object src/CMakeFiles/skanlite.dir/ImageViewer.o
  110. [ 10%] Building CXX object src/CMakeFiles/skanlite.dir/KSaneImageSaver.o
  111. [ 11%] Building CXX object src/CMakeFiles/skanlite.dir/SaveLocation.o
  112. Linking CXX executable skanlite
  113. [ 11%] Built target skanlite
  114. Scanning dependencies of target doc-handbook
  115. [ 13%] Generating index.cache.bz2
  116. I/O warning : failed to load external entity "/usr/share/xml/docbook/xsl-stylesheets-1.78.0/html/autoidx.xsl"
  117. compilation error: file /usr/share/apps/ksgmltools2/customization/kde-include-common.xsl line 4 element import
  118. xsl:import : unable to load /usr/share/xml/docbook/xsl-stylesheets-1.78.0/html/autoidx.xsl
  119. I/O warning : failed to load external entity "/usr/share/xml/docbook/xsl-stylesheets-1.78.0/html/chunk.xsl"
  120. compilation error: file /usr/share/apps/ksgmltools2/customization/kde-include-common.xsl line 5 element import
  121. xsl:import : unable to load /usr/share/xml/docbook/xsl-stylesheets-1.78.0/html/chunk.xsl
  122. unable to parse /tmp/yaourt-tmp-ben/aur-skanlite/src/skanlite-1.0/doc/index.docbook
  123. make[2]: *** [doc/index.cache.bz2] Error 1
  124. make[1]: *** [doc/CMakeFiles/doc-handbook.dir/all] Error 2
  125. make: *** [all] Error 2
  126. ==> ERROR: A failure occurred in build().
  127.     Aborting...
  128. ==> ERROR: Makepkg was unable to build skanlite.
  129. ==> Restart building skanlite ? [y/N]
  130. ==> ---------------------------------
  131. ==>
clone this paste RAW Paste Data