Guest User

OpenSSL Bitcoin Compile Error Output

a guest
Sep 14th, 2016
570
0
Never
Not a member of Pastebin yet? Sign Up, it unlocks many cool features!
text 2.35 KB | None | 0 0
  1. Making all in src
  2. make[1]: Entering directory '/root/bitcoin-0.13.0/src'
  3. make[2]: Entering directory '/root/bitcoin-0.13.0/src'
  4. make -C secp256k1 libsecp256k1.la
  5. make[3]: Entering directory '/root/bitcoin-0.13.0/src/secp256k1'
  6. make[3]: Leaving directory '/root/bitcoin-0.13.0/src/secp256k1'
  7. /bin/bash ../libtool --tag=CXX --mode=link g++ -std=c++11 -Wstack-protector -fstack-protector-all -fPIE -g -O2 -Wall -Wextra -Wformat -Wformat-security -Wno-unused-parameter -pthread -Wl,-z,relro -Wl,-z,now -pie -L/usr/local/BerkeleyDB.4.8/lib -o bitcoind bitcoind-bitcoind.o libbitcoin_server.a libbitcoin_common.a univalue/libunivalue.la libbitcoin_util.a libbitcoin_wallet.a libbitcoin_consensus.a crypto/libbitcoin_crypto.a leveldb/libleveldb.a leveldb/libmemenv.a secp256k1/libsecp256k1.la -L/usr/lib/x86_64-linux-gnu -lboost_system -lboost_filesystem -lboost_program_options -lboost_thread -lboost_chrono -ldb_cxx-4.8 -L/usr/local/lib -lssl -L/usr/local/lib -lcrypto -lminiupnpc -levent_pthreads -levent -levent -lanl
  8. libtool: link: g++ -std=c++11 -Wstack-protector -fstack-protector-all -fPIE -g -O2 -Wall -Wextra -Wformat -Wformat-security -Wno-unused-parameter -pthread -Wl,-z -Wl,relro -Wl,-z -Wl,now -pie -o bitcoind bitcoind-bitcoind.o -L/usr/local/BerkeleyDB.4.8/lib libbitcoin_server.a libbitcoin_common.a univalue/.libs/libunivalue.a libbitcoin_util.a libbitcoin_wallet.a libbitcoin_consensus.a crypto/libbitcoin_crypto.a leveldb/libleveldb.a leveldb/libmemenv.a secp256k1/.libs/libsecp256k1.a -L/usr/lib/x86_64-linux-gnu -lboost_system -lboost_filesystem -lboost_program_options -lboost_thread -lboost_chrono /usr/local/BerkeleyDB.4.8/lib/libdb_cxx-4.8.so -L/usr/local/lib -lssl -lcrypto -lminiupnpc -levent_pthreads -levent -lanl -pthread -D__LIBTOOL_IS_A_FOOL__ -D__LIBTOOL_IS_A_FOOL__
  9. libbitcoin_util.a(libbitcoin_util_a-util.o): In function `CInit::CInit()':
  10. /root/bitcoin-0.13.0/src/util.cpp:147: undefined reference to `OPENSSL_init_crypto'
  11. collect2: error: ld returned 1 exit status
  12. Makefile:3317: recipe for target 'bitcoind' failed
  13. make[2]: *** [bitcoind] Error 1
  14. make[2]: Leaving directory '/root/bitcoin-0.13.0/src'
  15. Makefile:8338: recipe for target 'all-recursive' failed
  16. make[1]: *** [all-recursive] Error 1
  17. make[1]: Leaving directory '/root/bitcoin-0.13.0/src'
  18. Makefile:667: recipe for target 'all-recursive' failed
  19. make: *** [all-recursive] Error 1
Advertisement
Add Comment
Please, Sign In to add comment