Pastebin launched a little side project called HostCabi.net, check it out ;-)Don't like ads? PRO users don't see any ads ;-)
Guest

Untitled

By: a guest on Jan 28th, 2012  |  syntax: None  |  size: 157.67 KB  |  hits: 119  |  expires: Never
download  |  raw  |  embed  |  report abuse  |  print
Text below is selected. Please press Ctrl+C to copy to your clipboard. (⌘+C on Mac)
  1. cd /home/rcbandit/Desktop/NetBeans/Prototype_3/SH_27; JAVA_HOME=/opt/jdk1.7.0_02 /home/rcbandit/netbeans-7.0.1/java/maven/bin/mvn clean install -X
  2. Apache Maven 3.0.3 (r1075438; 2011-02-28 19:31:09+0200)
  3. Maven home: /home/rcbandit/netbeans-7.0.1/java/maven
  4. Java version: 1.7.0_02, vendor: Oracle Corporation
  5. Java home: /opt/jdk1.7.0_02/jre
  6. Default locale: en_US, platform encoding: UTF-8
  7. OS name: "linux", version: "3.2.2-1.fc16.x86_64", arch: "amd64", family: "unix"
  8. Error stacktraces are turned on.
  9. Reading global settings from /home/rcbandit/netbeans-7.0.1/java/maven/conf/settings.xml
  10. Reading user settings from /home/rcbandit/.m2/settings.xml
  11. Using local repository at /home/rcbandit/.m2/repository
  12. Using manager EnhancedLocalRepositoryManager with priority 10 for /home/rcbandit/.m2/repository
  13. Scanning for projects...
  14. Extension realms for project org.DX_57.osgi.SH_27:SH_27:pom:1.0-SNAPSHOT: (none)
  15. Looking up lifecyle mappings for packaging pom from ClassRealm[plexus.core, parent: null]
  16. Resolving plugin version for org.apache.felix:maven-bundle-plugin
  17. Could not find metadata org.apache.felix:maven-bundle-plugin/maven-metadata.xml in local (/home/rcbandit/.m2/repository)
  18. Skipped remote update check for org.apache.felix:maven-bundle-plugin/maven-metadata.xml, locally cached metadata up-to-date.
  19. Resolved plugin version for org.apache.felix:maven-bundle-plugin to 2.3.6 from repository central (http://repo1.maven.org/maven2, releases)
  20. org.apache.felix:maven-bundle-plugin:jar:2.3.6:
  21.    biz.aQute:bndlib:jar:1.50.0:compile
  22.    org.apache.felix:org.apache.felix.bundlerepository:jar:1.6.6:compile
  23.       org.osgi:org.osgi.core:jar:4.1.0:compile
  24.       org.easymock:easymock:jar:2.4:compile
  25.    org.apache.maven:maven-core:jar:2.0.7:compile
  26.       org.apache.maven:maven-settings:jar:2.0.7:compile
  27.       org.apache.maven:maven-plugin-parameter-documenter:jar:2.0.7:compile
  28.       org.apache.maven.reporting:maven-reporting-api:jar:2.0.7:compile
  29.          org.apache.maven.doxia:doxia-sink-api:jar:1.0-alpha-7:compile
  30.       org.apache.maven:maven-profile:jar:2.0.7:compile
  31.       org.apache.maven:maven-model:jar:2.0.7:compile
  32.       org.apache.maven:maven-artifact:jar:2.0.7:compile
  33.       org.codehaus.plexus:plexus-container-default:jar:1.0-alpha-9-stable-1:compile
  34.          junit:junit:jar:3.8.1:compile
  35.       org.apache.maven:maven-repository-metadata:jar:2.0.7:compile
  36.       org.apache.maven:maven-error-diagnostics:jar:2.0.7:compile
  37.       org.apache.maven:maven-project:jar:2.0.7:compile
  38.          org.apache.maven:maven-plugin-registry:jar:2.0.7:compile
  39.       commons-cli:commons-cli:jar:1.0:compile
  40.       org.apache.maven:maven-plugin-api:jar:2.0.7:compile
  41.       org.apache.maven:maven-plugin-descriptor:jar:2.0.7:compile
  42.       org.codehaus.plexus:plexus-interactivity-api:jar:1.0-alpha-4:compile
  43.       org.apache.maven:maven-artifact-manager:jar:2.0.7:compile
  44.       org.apache.maven:maven-monitor:jar:2.0.7:compile
  45.       classworlds:classworlds:jar:1.1:compile
  46.    org.apache.maven:maven-archiver:jar:2.4.1:compile
  47.       org.codehaus.plexus:plexus-archiver:jar:1.0:compile
  48.          org.codehaus.plexus:plexus-io:jar:1.0:compile
  49.       org.codehaus.plexus:plexus-interpolation:jar:1.13:compile
  50.    org.apache.maven.shared:maven-dependency-tree:jar:1.2:compile
  51.    org.codehaus.plexus:plexus-utils:jar:2.1:compile
  52. Created new class realm maven.api
  53. Importing foreign packages into class realm maven.api
  54.   Imported: org.apache.maven.wagon.events < plexus.core
  55.   Imported: org.sonatype.aether.transfer < plexus.core
  56.   Imported: org.apache.maven.exception < plexus.core
  57.   Imported: org.sonatype.aether.metadata < plexus.core
  58.   Imported: org.codehaus.plexus.util.xml.Xpp3Dom < plexus.core
  59.   Imported: org.sonatype.aether.collection < plexus.core
  60.   Imported: org.sonatype.aether.version < plexus.core
  61.   Imported: org.apache.maven.monitor < plexus.core
  62.   Imported: org.apache.maven.wagon.repository < plexus.core
  63.   Imported: org.apache.maven.repository < plexus.core
  64.   Imported: org.apache.maven.wagon.resource < plexus.core
  65.   Imported: org.codehaus.plexus.logging < plexus.core
  66.   Imported: org.apache.maven.profiles < plexus.core
  67.   Imported: org.sonatype.aether.repository < plexus.core
  68.   Imported: org.apache.maven.classrealm < plexus.core
  69.   Imported: org.apache.maven.execution < plexus.core
  70.   Imported: org.sonatype.aether.artifact < plexus.core
  71.   Imported: org.sonatype.aether.spi < plexus.core
  72.   Imported: org.apache.maven.reporting < plexus.core
  73.   Imported: org.apache.maven.usability < plexus.core
  74.   Imported: org.codehaus.plexus.container < plexus.core
  75.   Imported: org.codehaus.plexus.component < plexus.core
  76.   Imported: org.codehaus.plexus.util.xml.pull.XmlSerializer < plexus.core
  77.   Imported: org.apache.maven.wagon.authentication < plexus.core
  78.   Imported: org.apache.maven.lifecycle < plexus.core
  79.   Imported: org.codehaus.plexus.classworlds < plexus.core
  80.   Imported: org.sonatype.aether.graph < plexus.core
  81.   Imported: org.sonatype.aether.* < plexus.core
  82.   Imported: org.apache.maven.settings < plexus.core
  83.   Imported: org.codehaus.classworlds < plexus.core
  84.   Imported: org.sonatype.aether.impl < plexus.core
  85.   Imported: org.apache.maven.wagon.* < plexus.core
  86.   Imported: org.apache.maven.toolchain < plexus.core
  87.   Imported: org.sonatype.aether.deployment < plexus.core
  88.   Imported: org.apache.maven.wagon.observers < plexus.core
  89.   Imported: org.codehaus.plexus.util.xml.pull.XmlPullParserException < plexus.core
  90.   Imported: org.codehaus.plexus.util.xml.pull.XmlPullParser < plexus.core
  91.   Imported: org.apache.maven.configuration < plexus.core
  92.   Imported: org.apache.maven.cli < plexus.core
  93.   Imported: org.sonatype.aether.installation < plexus.core
  94.   Imported: org.codehaus.plexus.context < plexus.core
  95.   Imported: org.apache.maven.wagon.authorization < plexus.core
  96.   Imported: org.apache.maven.project < plexus.core
  97.   Imported: org.apache.maven.rtinfo < plexus.core
  98.   Imported: org.codehaus.plexus.lifecycle < plexus.core
  99.   Imported: org.codehaus.plexus.configuration < plexus.core
  100.   Imported: org.apache.maven.artifact < plexus.core
  101.   Imported: org.apache.maven.model < plexus.core
  102.   Imported: org.apache.maven.* < plexus.core
  103.   Imported: org.apache.maven.wagon.proxy < plexus.core
  104.   Imported: org.sonatype.aether.resolution < plexus.core
  105.   Imported: org.apache.maven.plugin < plexus.core
  106.   Imported: org.codehaus.plexus.* < plexus.core
  107.   Imported: org.codehaus.plexus.personality < plexus.core
  108. Populating class realm maven.api
  109. Created new class realm extension>org.apache.felix:maven-bundle-plugin:2.3.6
  110. Importing foreign packages into class realm extension>org.apache.felix:maven-bundle-plugin:2.3.6
  111.   Imported:  < maven.api
  112. Populating class realm extension>org.apache.felix:maven-bundle-plugin:2.3.6
  113.   Included: org.apache.felix:maven-bundle-plugin:jar:2.3.6
  114.   Included: biz.aQute:bndlib:jar:1.50.0
  115.   Included: org.apache.felix:org.apache.felix.bundlerepository:jar:1.6.6
  116.   Included: org.osgi:org.osgi.core:jar:4.1.0
  117.   Included: org.easymock:easymock:jar:2.4
  118.   Included: org.apache.maven.reporting:maven-reporting-api:jar:2.0.7
  119.   Included: org.apache.maven.doxia:doxia-sink-api:jar:1.0-alpha-7
  120.   Included: junit:junit:jar:3.8.1
  121.   Included: commons-cli:commons-cli:jar:1.0
  122.   Included: org.codehaus.plexus:plexus-interactivity-api:jar:1.0-alpha-4
  123.   Included: org.apache.maven:maven-archiver:jar:2.4.1
  124.   Included: org.codehaus.plexus:plexus-archiver:jar:1.0
  125.   Included: org.codehaus.plexus:plexus-io:jar:1.0
  126.   Included: org.codehaus.plexus:plexus-interpolation:jar:1.13
  127.   Included: org.apache.maven.shared:maven-dependency-tree:jar:1.2
  128.   Included: org.codehaus.plexus:plexus-utils:jar:2.1
  129. Extension realms for project org.DX_57.osgi.SH_27:SH_27-api:bundle:1.0-SNAPSHOT: [ClassRealm[extension>org.apache.felix:maven-bundle-plugin:2.3.6, parent: sun.misc.Launcher$AppClassLoader@397577f9]]
  130. Created new class realm project>org.DX_57.osgi.SH_27:SH_27-api:1.0-SNAPSHOT
  131. Populating class realm project>org.DX_57.osgi.SH_27:SH_27-api:1.0-SNAPSHOT
  132. Looking up lifecyle mappings for packaging bundle from ClassRealm[project>org.DX_57.osgi.SH_27:SH_27-api:1.0-SNAPSHOT, parent: ClassRealm[maven.api, parent: null]]
  133. Resolving plugin version for org.apache.felix:maven-bundle-plugin
  134. Could not find metadata org.apache.felix:maven-bundle-plugin/maven-metadata.xml in local (/home/rcbandit/.m2/repository)
  135. Skipped remote update check for org.apache.felix:maven-bundle-plugin/maven-metadata.xml, locally cached metadata up-to-date.
  136. Resolved plugin version for org.apache.felix:maven-bundle-plugin to 2.3.6 from repository central (http://repo1.maven.org/maven2, releases)
  137. Extension realms for project org.DX_57.osgi.SH_27:SH_27-impl:bundle:1.0-SNAPSHOT: [ClassRealm[extension>org.apache.felix:maven-bundle-plugin:2.3.6, parent: sun.misc.Launcher$AppClassLoader@397577f9]]
  138. Looking up lifecyle mappings for packaging bundle from ClassRealm[project>org.DX_57.osgi.SH_27:SH_27-api:1.0-SNAPSHOT, parent: ClassRealm[maven.api, parent: null]]
  139.  
  140. Some problems were encountered while building the effective model for org.DX_57.osgi.SH_27:SH_27-api:bundle:1.0-SNAPSHOT
  141. 'build.plugins.plugin.version' for org.apache.felix:maven-bundle-plugin is missing. @ line 27, column 21
  142. The expression ${pom.groupId} is deprecated. Please use ${project.groupId} instead.
  143. The expression ${pom.artifactId} is deprecated. Please use ${project.artifactId} instead.
  144.  
  145. Some problems were encountered while building the effective model for org.DX_57.osgi.SH_27:SH_27-impl:bundle:1.0-SNAPSHOT
  146. 'build.plugins.plugin.version' for org.apache.felix:maven-bundle-plugin is missing. @ line 40, column 21
  147. The expression ${pom.groupId} is deprecated. Please use ${project.groupId} instead.
  148. The expression ${pom.groupId} is deprecated. Please use ${project.groupId} instead.
  149. The expression ${pom.artifactId} is deprecated. Please use ${project.artifactId} instead.
  150. The expression ${pom.groupId} is deprecated. Please use ${project.groupId} instead.
  151.  
  152. It is highly recommended to fix these problems because they threaten the stability of your build.
  153.  
  154. For this reason, future Maven versions might no longer support building such malformed projects.
  155.  
  156. ------------------------------------------------------------------------
  157. Reactor Build Order:
  158.  
  159. SH_27
  160. SH_27-api
  161. SH_27-impl
  162. === REACTOR BUILD PLAN ================================================
  163. Project: org.DX_57.osgi.SH_27:SH_27:pom:1.0-SNAPSHOT
  164. Tasks:   [clean, install]
  165. Style:   Regular
  166. -----------------------------------------------------------------------
  167. Project: org.DX_57.osgi.SH_27:SH_27-api:bundle:1.0-SNAPSHOT
  168. Tasks:   [clean, install]
  169. Style:   Regular
  170. -----------------------------------------------------------------------
  171. Project: org.DX_57.osgi.SH_27:SH_27-impl:bundle:1.0-SNAPSHOT
  172. Tasks:   [clean, install]
  173. Style:   Regular
  174. =======================================================================
  175.                                                                        
  176. ------------------------------------------------------------------------
  177. Building SH_27 1.0-SNAPSHOT
  178. ------------------------------------------------------------------------
  179. Lifecycle default -> [validate, initialize, generate-sources, process-sources, generate-resources, process-resources, compile, process-classes, generate-test-sources, process-test-sources, generate-test-resources, process-test-resources, test-compile, process-test-classes, test, prepare-package, package, pre-integration-test, integration-test, post-integration-test, verify, install, deploy]
  180. Lifecycle clean -> [pre-clean, clean, post-clean]
  181. Lifecycle site -> [pre-site, site, post-site, site-deploy]
  182. Lifecycle default -> [validate, initialize, generate-sources, process-sources, generate-resources, process-resources, compile, process-classes, generate-test-sources, process-test-sources, generate-test-resources, process-test-resources, test-compile, process-test-classes, test, prepare-package, package, pre-integration-test, integration-test, post-integration-test, verify, install, deploy]
  183. Lifecycle clean -> [pre-clean, clean, post-clean]
  184. Lifecycle site -> [pre-site, site, post-site, site-deploy]
  185. Lifecycle default -> [validate, initialize, generate-sources, process-sources, generate-resources, process-resources, compile, process-classes, generate-test-sources, process-test-sources, generate-test-resources, process-test-resources, test-compile, process-test-classes, test, prepare-package, package, pre-integration-test, integration-test, post-integration-test, verify, install, deploy]
  186. Lifecycle clean -> [pre-clean, clean, post-clean]
  187. Lifecycle site -> [pre-site, site, post-site, site-deploy]
  188. Lifecycle default -> [validate, initialize, generate-sources, process-sources, generate-resources, process-resources, compile, process-classes, generate-test-sources, process-test-sources, generate-test-resources, process-test-resources, test-compile, process-test-classes, test, prepare-package, package, pre-integration-test, integration-test, post-integration-test, verify, install, deploy]
  189. Lifecycle clean -> [pre-clean, clean, post-clean]
  190. Lifecycle site -> [pre-site, site, post-site, site-deploy]
  191. === PROJECT BUILD PLAN ================================================
  192. Project:       org.DX_57.osgi.SH_27:SH_27:1.0-SNAPSHOT
  193. Dependencies (collect): []
  194. Dependencies (resolve): []
  195. Repositories (dependencies): [central (http://repo1.maven.org/maven2, releases)]
  196. Repositories (plugins)     : [central (http://repo1.maven.org/maven2, releases)]
  197. -----------------------------------------------------------------------
  198. Goal:          org.apache.maven.plugins:maven-clean-plugin:2.4.1:clean (default-clean)
  199. Style:         Regular
  200. Configuration: <?xml version="1.0" encoding="UTF-8"?>
  201. <configuration>
  202.   <directory default-value="${project.build.directory}"/>
  203.   <excludeDefaultDirectories default-value="false">${clean.excludeDefaultDirectories}</excludeDefaultDirectories>
  204.   <failOnError default-value="true">${maven.clean.failOnError}</failOnError>
  205.   <followSymLinks default-value="false">${clean.followSymLinks}</followSymLinks>
  206.   <outputDirectory default-value="${project.build.outputDirectory}"/>
  207.   <reportDirectory default-value="${project.reporting.outputDirectory}"/>
  208.   <skip default-value="false">${clean.skip}</skip>
  209.   <testOutputDirectory default-value="${project.build.testOutputDirectory}"/>
  210.   <verbose>${clean.verbose}</verbose>
  211. </configuration>
  212. -----------------------------------------------------------------------
  213. Goal:          org.apache.maven.plugins:maven-install-plugin:2.3.1:install (default-install)
  214. Style:         Regular
  215. Configuration: <?xml version="1.0" encoding="UTF-8"?>
  216. <configuration>
  217.   <artifact default-value="${project.artifact}"/>
  218.   <attachedArtifacts default-value="${project.attachedArtifacts}"/>
  219.   <createChecksum default-value="false">${createChecksum}</createChecksum>
  220.   <localRepository>${localRepository}</localRepository>
  221.   <packaging default-value="${project.packaging}"/>
  222.   <pomFile default-value="${project.file}"/>
  223.   <updateReleaseInfo default-value="false">${updateReleaseInfo}</updateReleaseInfo>
  224. </configuration>
  225. =======================================================================
  226.  
  227. [clean:clean]
  228. org.apache.maven.plugins:maven-clean-plugin:jar:2.4.1:
  229.    org.apache.maven:maven-plugin-api:jar:2.0.6:compile
  230.    org.codehaus.plexus:plexus-utils:jar:2.0.5:compile
  231. Created new class realm plugin>org.apache.maven.plugins:maven-clean-plugin:2.4.1
  232. Importing foreign packages into class realm plugin>org.apache.maven.plugins:maven-clean-plugin:2.4.1
  233.   Imported:  < maven.api
  234. Populating class realm plugin>org.apache.maven.plugins:maven-clean-plugin:2.4.1
  235.   Included: org.apache.maven.plugins:maven-clean-plugin:jar:2.4.1
  236.   Included: org.codehaus.plexus:plexus-utils:jar:2.0.5
  237.   Excluded: org.apache.maven:maven-plugin-api:jar:2.0.6
  238. Configuring mojo org.apache.maven.plugins:maven-clean-plugin:2.4.1:clean from plugin realm ClassRealm[plugin>org.apache.maven.plugins:maven-clean-plugin:2.4.1, parent: sun.misc.Launcher$AppClassLoader@397577f9]
  239. Configuring mojo 'org.apache.maven.plugins:maven-clean-plugin:2.4.1:clean' with basic configurator -->
  240.   (f) directory = /home/rcbandit/Desktop/NetBeans/Prototype_3/SH_27/target
  241.   (f) excludeDefaultDirectories = false
  242.   (f) failOnError = true
  243.   (f) followSymLinks = false
  244.   (f) outputDirectory = /home/rcbandit/Desktop/NetBeans/Prototype_3/SH_27/target/classes
  245.   (f) reportDirectory = /home/rcbandit/Desktop/NetBeans/Prototype_3/SH_27/target/site
  246.   (f) skip = false
  247.   (f) testOutputDirectory = /home/rcbandit/Desktop/NetBeans/Prototype_3/SH_27/target/test-classes
  248. -- end configuration --
  249. Skipping non-existing directory /home/rcbandit/Desktop/NetBeans/Prototype_3/SH_27/target
  250. Skipping non-existing directory /home/rcbandit/Desktop/NetBeans/Prototype_3/SH_27/target/classes
  251. Skipping non-existing directory /home/rcbandit/Desktop/NetBeans/Prototype_3/SH_27/target/test-classes
  252. Skipping non-existing directory /home/rcbandit/Desktop/NetBeans/Prototype_3/SH_27/target/site
  253.  
  254. [install:install]
  255. org.apache.maven.plugins:maven-install-plugin:jar:2.3.1:
  256.    org.apache.maven:maven-plugin-api:jar:2.0.6:compile
  257.    org.apache.maven:maven-project:jar:2.0.6:compile
  258.       org.apache.maven:maven-settings:jar:2.0.6:compile
  259.       org.apache.maven:maven-profile:jar:2.0.6:compile
  260.       org.apache.maven:maven-plugin-registry:jar:2.0.6:compile
  261.       org.codehaus.plexus:plexus-container-default:jar:1.0-alpha-9-stable-1:compile
  262.          junit:junit:jar:3.8.1:compile
  263.          classworlds:classworlds:jar:1.1-alpha-2:compile
  264.    org.apache.maven:maven-model:jar:2.0.6:compile
  265.    org.apache.maven:maven-artifact-manager:jar:2.0.6:compile
  266.       org.apache.maven:maven-repository-metadata:jar:2.0.6:compile
  267.    org.apache.maven:maven-artifact:jar:2.0.6:compile
  268.    org.codehaus.plexus:plexus-utils:jar:2.0.5:compile
  269.    org.codehaus.plexus:plexus-digest:jar:1.0:compile
  270. Created new class realm plugin>org.apache.maven.plugins:maven-install-plugin:2.3.1
  271. Importing foreign packages into class realm plugin>org.apache.maven.plugins:maven-install-plugin:2.3.1
  272.   Imported:  < maven.api
  273. Populating class realm plugin>org.apache.maven.plugins:maven-install-plugin:2.3.1
  274.   Included: org.apache.maven.plugins:maven-install-plugin:jar:2.3.1
  275.   Included: junit:junit:jar:3.8.1
  276.   Included: org.codehaus.plexus:plexus-utils:jar:2.0.5
  277.   Included: org.codehaus.plexus:plexus-digest:jar:1.0
  278.   Excluded: org.apache.maven:maven-plugin-api:jar:2.0.6
  279.   Excluded: org.apache.maven:maven-project:jar:2.0.6
  280.   Excluded: org.apache.maven:maven-settings:jar:2.0.6
  281.   Excluded: org.apache.maven:maven-profile:jar:2.0.6
  282.   Excluded: org.apache.maven:maven-plugin-registry:jar:2.0.6
  283.   Excluded: org.codehaus.plexus:plexus-container-default:jar:1.0-alpha-9-stable-1
  284.   Excluded: classworlds:classworlds:jar:1.1-alpha-2
  285.   Excluded: org.apache.maven:maven-model:jar:2.0.6
  286.   Excluded: org.apache.maven:maven-artifact-manager:jar:2.0.6
  287.   Excluded: org.apache.maven:maven-repository-metadata:jar:2.0.6
  288.   Excluded: org.apache.maven:maven-artifact:jar:2.0.6
  289. Configuring mojo org.apache.maven.plugins:maven-install-plugin:2.3.1:install from plugin realm ClassRealm[plugin>org.apache.maven.plugins:maven-install-plugin:2.3.1, parent: sun.misc.Launcher$AppClassLoader@397577f9]
  290. Configuring mojo 'org.apache.maven.plugins:maven-install-plugin:2.3.1:install' with basic configurator -->
  291.   (f) artifact = org.DX_57.osgi.SH_27:SH_27:pom:1.0-SNAPSHOT
  292.   (f) attachedArtifacts = []
  293.   (f) createChecksum = false
  294.   (f) localRepository =        id: local
  295.       url: file:///home/rcbandit/.m2/repository/
  296.    layout: none
  297.  
  298.   (f) packaging = pom
  299.   (f) pomFile = /home/rcbandit/Desktop/NetBeans/Prototype_3/SH_27/pom.xml
  300.   (f) updateReleaseInfo = false
  301. -- end configuration --
  302. Installing /home/rcbandit/Desktop/NetBeans/Prototype_3/SH_27/pom.xml to /home/rcbandit/.m2/repository/org/DX_57/osgi/SH_27/SH_27/1.0-SNAPSHOT/SH_27-1.0-SNAPSHOT.pom
  303. Installing org.DX_57.osgi.SH_27:SH_27:1.0-SNAPSHOT/maven-metadata.xml to /home/rcbandit/.m2/repository/org/DX_57/osgi/SH_27/SH_27/1.0-SNAPSHOT/maven-metadata-local.xml
  304. Installing org.DX_57.osgi.SH_27:SH_27/maven-metadata.xml to /home/rcbandit/.m2/repository/org/DX_57/osgi/SH_27/SH_27/maven-metadata-local.xml
  305.                                                                        
  306. ------------------------------------------------------------------------
  307. Building SH_27-api 1.0-SNAPSHOT
  308. ------------------------------------------------------------------------
  309. Resolving plugin version for org.apache.maven.plugins:maven-install-plugin
  310. Could not find metadata org.apache.maven.plugins:maven-install-plugin/maven-metadata.xml in local (/home/rcbandit/.m2/repository)
  311. Skipped remote update check for org.apache.maven.plugins:maven-install-plugin/maven-metadata.xml, locally cached metadata up-to-date.
  312. Resolved plugin version for org.apache.maven.plugins:maven-install-plugin to 2.3.1 from repository central (http://repo1.maven.org/maven2, releases)
  313. Resolving plugin version for org.apache.maven.plugins:maven-resources-plugin
  314. Could not find metadata org.apache.maven.plugins:maven-resources-plugin/maven-metadata.xml in local (/home/rcbandit/.m2/repository)
  315. Skipped remote update check for org.apache.maven.plugins:maven-resources-plugin/maven-metadata.xml, locally cached metadata up-to-date.
  316. Resolved plugin version for org.apache.maven.plugins:maven-resources-plugin to 2.5 from repository central (http://repo1.maven.org/maven2, releases)
  317. Resolving plugin version for org.apache.maven.plugins:maven-surefire-plugin
  318. Could not find metadata org.apache.maven.plugins:maven-surefire-plugin/maven-metadata.xml in local (/home/rcbandit/.m2/repository)
  319. Skipped remote update check for org.apache.maven.plugins:maven-surefire-plugin/maven-metadata.xml, locally cached metadata up-to-date.
  320. Resolved plugin version for org.apache.maven.plugins:maven-surefire-plugin to 2.11 from repository central (http://repo1.maven.org/maven2, releases)
  321. Resolving plugin version for org.apache.maven.plugins:maven-deploy-plugin
  322. Could not find metadata org.apache.maven.plugins:maven-deploy-plugin/maven-metadata.xml in local (/home/rcbandit/.m2/repository)
  323. Skipped remote update check for org.apache.maven.plugins:maven-deploy-plugin/maven-metadata.xml, locally cached metadata up-to-date.
  324. Resolved plugin version for org.apache.maven.plugins:maven-deploy-plugin to 2.7 from repository central (http://repo1.maven.org/maven2, releases)
  325. Lifecycle default -> [validate, initialize, generate-sources, process-sources, generate-resources, process-resources, compile, process-classes, generate-test-sources, process-test-sources, generate-test-resources, process-test-resources, test-compile, process-test-classes, test, prepare-package, package, pre-integration-test, integration-test, post-integration-test, verify, install, deploy]
  326. Lifecycle clean -> [pre-clean, clean, post-clean]
  327. Lifecycle site -> [pre-site, site, post-site, site-deploy]
  328. Lifecycle default -> [validate, initialize, generate-sources, process-sources, generate-resources, process-resources, compile, process-classes, generate-test-sources, process-test-sources, generate-test-resources, process-test-resources, test-compile, process-test-classes, test, prepare-package, package, pre-integration-test, integration-test, post-integration-test, verify, install, deploy]
  329. Lifecycle clean -> [pre-clean, clean, post-clean]
  330. Lifecycle site -> [pre-site, site, post-site, site-deploy]
  331. Lifecycle default -> [validate, initialize, generate-sources, process-sources, generate-resources, process-resources, compile, process-classes, generate-test-sources, process-test-sources, generate-test-resources, process-test-resources, test-compile, process-test-classes, test, prepare-package, package, pre-integration-test, integration-test, post-integration-test, verify, install, deploy]
  332. Lifecycle clean -> [pre-clean, clean, post-clean]
  333. Lifecycle site -> [pre-site, site, post-site, site-deploy]
  334. Lifecycle default -> [validate, initialize, generate-sources, process-sources, generate-resources, process-resources, compile, process-classes, generate-test-sources, process-test-sources, generate-test-resources, process-test-resources, test-compile, process-test-classes, test, prepare-package, package, pre-integration-test, integration-test, post-integration-test, verify, install, deploy]
  335. Lifecycle clean -> [pre-clean, clean, post-clean]
  336. Lifecycle site -> [pre-site, site, post-site, site-deploy]
  337. Lifecycle default -> [validate, initialize, generate-sources, process-sources, generate-resources, process-resources, compile, process-classes, generate-test-sources, process-test-sources, generate-test-resources, process-test-resources, test-compile, process-test-classes, test, prepare-package, package, pre-integration-test, integration-test, post-integration-test, verify, install, deploy]
  338. Lifecycle clean -> [pre-clean, clean, post-clean]
  339. Lifecycle site -> [pre-site, site, post-site, site-deploy]
  340. Lifecycle default -> [validate, initialize, generate-sources, process-sources, generate-resources, process-resources, compile, process-classes, generate-test-sources, process-test-sources, generate-test-resources, process-test-resources, test-compile, process-test-classes, test, prepare-package, package, pre-integration-test, integration-test, post-integration-test, verify, install, deploy]
  341. Lifecycle clean -> [pre-clean, clean, post-clean]
  342. Lifecycle site -> [pre-site, site, post-site, site-deploy]
  343. Lifecycle default -> [validate, initialize, generate-sources, process-sources, generate-resources, process-resources, compile, process-classes, generate-test-sources, process-test-sources, generate-test-resources, process-test-resources, test-compile, process-test-classes, test, prepare-package, package, pre-integration-test, integration-test, post-integration-test, verify, install, deploy]
  344. Lifecycle clean -> [pre-clean, clean, post-clean]
  345. Lifecycle site -> [pre-site, site, post-site, site-deploy]
  346. Lifecycle default -> [validate, initialize, generate-sources, process-sources, generate-resources, process-resources, compile, process-classes, generate-test-sources, process-test-sources, generate-test-resources, process-test-resources, test-compile, process-test-classes, test, prepare-package, package, pre-integration-test, integration-test, post-integration-test, verify, install, deploy]
  347. Lifecycle clean -> [pre-clean, clean, post-clean]
  348. Lifecycle site -> [pre-site, site, post-site, site-deploy]
  349. Lifecycle default -> [validate, initialize, generate-sources, process-sources, generate-resources, process-resources, compile, process-classes, generate-test-sources, process-test-sources, generate-test-resources, process-test-resources, test-compile, process-test-classes, test, prepare-package, package, pre-integration-test, integration-test, post-integration-test, verify, install, deploy]
  350. Lifecycle clean -> [pre-clean, clean, post-clean]
  351. Lifecycle site -> [pre-site, site, post-site, site-deploy]
  352. Lifecycle default -> [validate, initialize, generate-sources, process-sources, generate-resources, process-resources, compile, process-classes, generate-test-sources, process-test-sources, generate-test-resources, process-test-resources, test-compile, process-test-classes, test, prepare-package, package, pre-integration-test, integration-test, post-integration-test, verify, install, deploy]
  353. Lifecycle clean -> [pre-clean, clean, post-clean]
  354. Lifecycle site -> [pre-site, site, post-site, site-deploy]
  355. === PROJECT BUILD PLAN ================================================
  356. Project:       org.DX_57.osgi.SH_27:SH_27-api:1.0-SNAPSHOT
  357. Dependencies (collect): []
  358. Dependencies (resolve): [compile, test]
  359. Repositories (dependencies): [central (http://repo1.maven.org/maven2, releases)]
  360. Repositories (plugins)     : [central (http://repo1.maven.org/maven2, releases)]
  361. -----------------------------------------------------------------------
  362. Goal:          org.apache.maven.plugins:maven-clean-plugin:2.4.1:clean (default-clean)
  363. Style:         Regular
  364. Configuration: <?xml version="1.0" encoding="UTF-8"?>
  365. <configuration>
  366.   <directory default-value="${project.build.directory}"/>
  367.   <excludeDefaultDirectories default-value="false">${clean.excludeDefaultDirectories}</excludeDefaultDirectories>
  368.   <failOnError default-value="true">${maven.clean.failOnError}</failOnError>
  369.   <followSymLinks default-value="false">${clean.followSymLinks}</followSymLinks>
  370.   <outputDirectory default-value="${project.build.outputDirectory}"/>
  371.   <reportDirectory default-value="${project.reporting.outputDirectory}"/>
  372.   <skip default-value="false">${clean.skip}</skip>
  373.   <testOutputDirectory default-value="${project.build.testOutputDirectory}"/>
  374.   <verbose>${clean.verbose}</verbose>
  375. </configuration>
  376. -----------------------------------------------------------------------
  377. Goal:          org.apache.maven.plugins:maven-resources-plugin:2.5:resources (default-resources)
  378. Style:         Regular
  379. Configuration: <?xml version="1.0" encoding="UTF-8"?>
  380. <configuration>
  381.   <buildFilters default-value="${project.build.filters}"/>
  382.   <encoding default-value="${project.build.sourceEncoding}">${encoding}</encoding>
  383.   <escapeString>${maven.resources.escapeString}</escapeString>
  384.   <escapeWindowsPaths default-value="true">${maven.resources.escapeWindowsPaths}</escapeWindowsPaths>
  385.   <includeEmptyDirs default-value="false">${maven.resources.includeEmptyDirs}</includeEmptyDirs>
  386.   <outputDirectory default-value="${project.build.outputDirectory}"/>
  387.   <overwrite default-value="false">${maven.resources.overwrite}</overwrite>
  388.   <project default-value="${project}"/>
  389.   <resources default-value="${project.resources}"/>
  390.   <session default-value="${session}"/>
  391.   <supportMultiLineFiltering default-value="false">${maven.resources.supportMultiLineFiltering}</supportMultiLineFiltering>
  392.   <useBuildFilters default-value="true"/>
  393.   <useDefaultDelimiters default-value="true"/>
  394. </configuration>
  395. -----------------------------------------------------------------------
  396. Goal:          org.apache.maven.plugins:maven-compiler-plugin:2.3.2:compile (default-compile)
  397. Style:         Regular
  398. Configuration: <?xml version="1.0" encoding="UTF-8"?>
  399. <configuration>
  400.   <basedir default-value="${basedir}"/>
  401.   <buildDirectory default-value="${project.build.directory}"/>
  402.   <classpathElements default-value="${project.compileClasspathElements}"/>
  403.   <compileSourceRoots default-value="${project.compileSourceRoots}"/>
  404.   <compilerId default-value="javac">${maven.compiler.compilerId}</compilerId>
  405.   <compilerVersion>${maven.compiler.compilerVersion}</compilerVersion>
  406.   <debug default-value="true">${maven.compiler.debug}</debug>
  407.   <debuglevel>${maven.compiler.debuglevel}</debuglevel>
  408.   <encoding default-value="${project.build.sourceEncoding}">${encoding}</encoding>
  409.   <executable>${maven.compiler.executable}</executable>
  410.   <failOnError default-value="true">${maven.compiler.failOnError}</failOnError>
  411.   <fork default-value="false">${maven.compiler.fork}</fork>
  412.   <generatedSourcesDirectory default-value="${project.build.directory}/generated-sources/annotations"/>
  413.   <maxmem>${maven.compiler.maxmem}</maxmem>
  414.   <meminitial>${maven.compiler.meminitial}</meminitial>
  415.   <optimize default-value="false">${maven.compiler.optimize}</optimize>
  416.   <outputDirectory default-value="${project.build.outputDirectory}"/>
  417.   <outputFileName>${project.build.finalName}</outputFileName>
  418.   <projectArtifact default-value="${project.artifact}"/>
  419.   <session default-value="${session}"/>
  420.   <showDeprecation default-value="false">${maven.compiler.showDeprecation}</showDeprecation>
  421.   <showWarnings default-value="false">${maven.compiler.showWarnings}</showWarnings>
  422.   <source default-value="1.5">1.7</source>
  423.   <staleMillis default-value="0">${lastModGranularityMs}</staleMillis>
  424.   <target default-value="1.5">1.7</target>
  425.   <verbose default-value="false">${maven.compiler.verbose}</verbose>
  426. </configuration>
  427. -----------------------------------------------------------------------
  428. Goal:          org.apache.maven.plugins:maven-resources-plugin:2.5:testResources (default-testResources)
  429. Style:         Regular
  430. Configuration: <?xml version="1.0" encoding="UTF-8"?>
  431. <configuration>
  432.   <buildFilters default-value="${project.build.filters}"/>
  433.   <encoding default-value="${project.build.sourceEncoding}">${encoding}</encoding>
  434.   <escapeString>${maven.resources.escapeString}</escapeString>
  435.   <escapeWindowsPaths default-value="true">${maven.resources.escapeWindowsPaths}</escapeWindowsPaths>
  436.   <includeEmptyDirs default-value="false">${maven.resources.includeEmptyDirs}</includeEmptyDirs>
  437.   <outputDirectory>${project.build.testOutputDirectory}</outputDirectory>
  438.   <overwrite default-value="false">${maven.resources.overwrite}</overwrite>
  439.   <project default-value="${project}"/>
  440.   <resources>${project.testResources}</resources>
  441.   <session default-value="${session}"/>
  442.   <supportMultiLineFiltering default-value="false">${maven.resources.supportMultiLineFiltering}</supportMultiLineFiltering>
  443.   <useBuildFilters default-value="true"/>
  444.   <useDefaultDelimiters default-value="true"/>
  445. </configuration>
  446. -----------------------------------------------------------------------
  447. Goal:          org.apache.maven.plugins:maven-compiler-plugin:2.3.2:testCompile (default-testCompile)
  448. Style:         Regular
  449. Configuration: <?xml version="1.0" encoding="UTF-8"?>
  450. <configuration>
  451.   <basedir default-value="${basedir}"/>
  452.   <buildDirectory default-value="${project.build.directory}"/>
  453.   <classpathElements default-value="${project.testClasspathElements}"/>
  454.   <compileSourceRoots default-value="${project.testCompileSourceRoots}"/>
  455.   <compilerId default-value="javac">${maven.compiler.compilerId}</compilerId>
  456.   <compilerVersion>${maven.compiler.compilerVersion}</compilerVersion>
  457.   <debug default-value="true">${maven.compiler.debug}</debug>
  458.   <debuglevel>${maven.compiler.debuglevel}</debuglevel>
  459.   <encoding default-value="${project.build.sourceEncoding}">${encoding}</encoding>
  460.   <executable>${maven.compiler.executable}</executable>
  461.   <failOnError default-value="true">${maven.compiler.failOnError}</failOnError>
  462.   <fork default-value="false">${maven.compiler.fork}</fork>
  463.   <generatedTestSourcesDirectory default-value="${project.build.directory}/generated-sources/test-annotations"/>
  464.   <maxmem>${maven.compiler.maxmem}</maxmem>
  465.   <meminitial>${maven.compiler.meminitial}</meminitial>
  466.   <optimize default-value="false">${maven.compiler.optimize}</optimize>
  467.   <outputDirectory default-value="${project.build.testOutputDirectory}"/>
  468.   <outputFileName>${project.build.finalName}</outputFileName>
  469.   <session default-value="${session}"/>
  470.   <showDeprecation default-value="false">${maven.compiler.showDeprecation}</showDeprecation>
  471.   <showWarnings default-value="false">${maven.compiler.showWarnings}</showWarnings>
  472.   <skip>${maven.test.skip}</skip>
  473.   <source default-value="1.5">1.7</source>
  474.   <staleMillis default-value="0">${lastModGranularityMs}</staleMillis>
  475.   <target default-value="1.5">1.7</target>
  476.   <testSource>${maven.compiler.testSource}</testSource>
  477.   <testTarget>${maven.compiler.testTarget}</testTarget>
  478.   <verbose default-value="false">${maven.compiler.verbose}</verbose>
  479. </configuration>
  480. -----------------------------------------------------------------------
  481. Goal:          org.apache.maven.plugins:maven-surefire-plugin:2.11:test (default-test)
  482. Style:         Regular
  483. Configuration: <?xml version="1.0" encoding="UTF-8"?>
  484. <configuration>
  485.   <argLine>${argLine}</argLine>
  486.   <basedir default-value="${basedir}"/>
  487.   <childDelegation default-value="false">${childDelegation}</childDelegation>
  488.   <classesDirectory default-value="${project.build.outputDirectory}"/>
  489.   <debugForkedProcess>${maven.surefire.debug}</debugForkedProcess>
  490.   <disableXmlReport default-value="false">${disableXmlReport}</disableXmlReport>
  491.   <enableAssertions default-value="true">${enableAssertions}</enableAssertions>
  492.   <excludedGroups>${excludedGroups}</excludedGroups>
  493.   <failIfNoTests>${failIfNoTests}</failIfNoTests>
  494.   <forkMode default-value="once">${forkMode}</forkMode>
  495.   <forkedProcessTimeoutInSeconds>${surefire.timeout}</forkedProcessTimeoutInSeconds>
  496.   <groups>${groups}</groups>
  497.   <junitArtifactName default-value="junit:junit">${junitArtifactName}</junitArtifactName>
  498.   <jvm>${jvm}</jvm>
  499.   <localRepository>${localRepository}</localRepository>
  500.   <objectFactory>${objectFactory}</objectFactory>
  501.   <parallel>${parallel}</parallel>
  502.   <parallelMavenExecution default-value="${session.parallel}"/>
  503.   <perCoreThreadCount default-value="true">${perCoreThreadCount}</perCoreThreadCount>
  504.   <pluginArtifactMap>${plugin.artifactMap}</pluginArtifactMap>
  505.   <printSummary default-value="true">${surefire.printSummary}</printSummary>
  506.   <project default-value="${project}"/>
  507.   <projectArtifactMap>${project.artifactMap}</projectArtifactMap>
  508.   <redirectTestOutputToFile default-value="false">${maven.test.redirectTestOutputToFile}</redirectTestOutputToFile>
  509.   <remoteRepositories>${project.pluginArtifactRepositories}</remoteRepositories>
  510.   <reportFormat default-value="brief">${surefire.reportFormat}</reportFormat>
  511.   <reportNameSuffix default-value="">${surefire.reportNameSuffix}</reportNameSuffix>
  512.   <reportsDirectory default-value="${project.build.directory}/surefire-reports"/>
  513.   <runOrder default-value="filesystem"/>
  514.   <session>${session}</session>
  515.   <skip default-value="false">${maven.test.skip}</skip>
  516.   <skipExec>${maven.test.skip.exec}</skipExec>
  517.   <skipTests default-value="false">${skipTests}</skipTests>
  518.   <test>${test}</test>
  519.   <testClassesDirectory default-value="${project.build.testOutputDirectory}"/>
  520.   <testFailureIgnore default-value="false">${maven.test.failure.ignore}</testFailureIgnore>
  521.   <testNGArtifactName default-value="org.testng:testng">${testNGArtifactName}</testNGArtifactName>
  522.   <testSourceDirectory default-value="${project.build.testSourceDirectory}"/>
  523.   <threadCount>${threadCount}</threadCount>
  524.   <trimStackTrace default-value="true">${trimStackTrace}</trimStackTrace>
  525.   <useFile default-value="true">${surefire.useFile}</useFile>
  526.   <useManifestOnlyJar default-value="true">${surefire.useManifestOnlyJar}</useManifestOnlyJar>
  527.   <useSystemClassLoader default-value="true">${surefire.useSystemClassLoader}</useSystemClassLoader>
  528.   <useUnlimitedThreads default-value="false">${useUnlimitedThreads}</useUnlimitedThreads>
  529.   <workingDirectory>${basedir}</workingDirectory>
  530. </configuration>
  531. -----------------------------------------------------------------------
  532. Goal:          org.apache.felix:maven-bundle-plugin:2.3.6:bundle (default-bundle)
  533. Style:         Regular
  534. Configuration: <?xml version="1.0" encoding="UTF-8"?>
  535. <configuration>
  536.   <buildDirectory>${project.build.directory}</buildDirectory>
  537.   <dumpClasspath>${dumpClasspath}</dumpClasspath>
  538.   <dumpInstructions>${dumpInstructions}</dumpInstructions>
  539.   <excludeDependencies>${excludeDependencies}</excludeDependencies>
  540.   <instructions>
  541.     <Export-Package>org.DX_57.osgi.SH_27.api</Export-Package>
  542.     <Bundle-SymbolicName>SH_27-api</Bundle-SymbolicName>
  543.   </instructions>
  544.   <m_mavenSession default-value="${session}"/>
  545.   <manifestLocation default-value="${project.build.outputDirectory}/META-INF">${manifestLocation}</manifestLocation>
  546.   <outputDirectory>${project.build.outputDirectory}</outputDirectory>
  547.   <project>${project}</project>
  548.   <unpackBundle>${unpackBundle}</unpackBundle>
  549. </configuration>
  550. -----------------------------------------------------------------------
  551. Goal:          org.apache.maven.plugins:maven-install-plugin:2.3.1:install (default-install)
  552. Style:         Regular
  553. Configuration: <?xml version="1.0" encoding="UTF-8"?>
  554. <configuration>
  555.   <artifact default-value="${project.artifact}"/>
  556.   <attachedArtifacts default-value="${project.attachedArtifacts}"/>
  557.   <createChecksum default-value="false">${createChecksum}</createChecksum>
  558.   <localRepository>${localRepository}</localRepository>
  559.   <packaging default-value="${project.packaging}"/>
  560.   <pomFile default-value="${project.file}"/>
  561.   <updateReleaseInfo default-value="false">${updateReleaseInfo}</updateReleaseInfo>
  562. </configuration>
  563. -----------------------------------------------------------------------
  564. Goal:          org.apache.felix:maven-bundle-plugin:2.3.6:install (default-install)
  565. Style:         Regular
  566. Configuration: <?xml version="1.0" encoding="UTF-8"?>
  567. <configuration>
  568.   <attachedArtifacts>${project.attachedArtifacts}</attachedArtifacts>
  569.   <localRepository>${localRepository}</localRepository>
  570.   <obrRepository>${obrRepository}</obrRepository>
  571.   <project>${project}</project>
  572. </configuration>
  573. =======================================================================
  574. org.DX_57.osgi.SH_27:SH_27-api:bundle:1.0-SNAPSHOT
  575.    junit:junit:jar:3.8.1:test
  576.    org.apache.felix:org.osgi.core:jar:1.0.0:compile
  577.  
  578. [clean:clean]
  579. org.apache.maven.plugins:maven-clean-plugin:jar:2.4.1:
  580.    org.apache.maven:maven-plugin-api:jar:2.0.6:compile
  581.    org.codehaus.plexus:plexus-utils:jar:2.0.5:compile
  582. Created new class realm plugin>org.apache.maven.plugins:maven-clean-plugin:2.4.1-1267324105
  583. Importing foreign packages into class realm plugin>org.apache.maven.plugins:maven-clean-plugin:2.4.1-1267324105
  584.   Imported:  < project>org.DX_57.osgi.SH_27:SH_27-api:1.0-SNAPSHOT
  585. Populating class realm plugin>org.apache.maven.plugins:maven-clean-plugin:2.4.1-1267324105
  586.   Included: org.apache.maven.plugins:maven-clean-plugin:jar:2.4.1
  587.   Included: org.codehaus.plexus:plexus-utils:jar:2.0.5
  588.   Excluded: org.apache.maven:maven-plugin-api:jar:2.0.6
  589. Configuring mojo org.apache.maven.plugins:maven-clean-plugin:2.4.1:clean from plugin realm ClassRealm[plugin>org.apache.maven.plugins:maven-clean-plugin:2.4.1-1267324105, parent: sun.misc.Launcher$AppClassLoader@397577f9]
  590. Configuring mojo 'org.apache.maven.plugins:maven-clean-plugin:2.4.1:clean' with basic configurator -->
  591.   (f) directory = /home/rcbandit/Desktop/NetBeans/Prototype_3/SH_27/SH_27-api/target
  592.   (f) excludeDefaultDirectories = false
  593.   (f) failOnError = true
  594.   (f) followSymLinks = false
  595.   (f) outputDirectory = /home/rcbandit/Desktop/NetBeans/Prototype_3/SH_27/SH_27-api/target/classes
  596.   (f) reportDirectory = /home/rcbandit/Desktop/NetBeans/Prototype_3/SH_27/SH_27-api/target/site
  597.   (f) skip = false
  598.   (f) testOutputDirectory = /home/rcbandit/Desktop/NetBeans/Prototype_3/SH_27/SH_27-api/target/test-classes
  599. -- end configuration --
  600. Deleting /home/rcbandit/Desktop/NetBeans/Prototype_3/SH_27/SH_27-api/target
  601. Deleting file /home/rcbandit/Desktop/NetBeans/Prototype_3/SH_27/SH_27-api/target/surefire-reports/org.samples.osgi.service.AppTest.txt
  602. Deleting file /home/rcbandit/Desktop/NetBeans/Prototype_3/SH_27/SH_27-api/target/surefire-reports/TEST-org.samples.osgi.service.AppTest.xml
  603. Deleting directory /home/rcbandit/Desktop/NetBeans/Prototype_3/SH_27/SH_27-api/target/surefire-reports
  604. Deleting file /home/rcbandit/Desktop/NetBeans/Prototype_3/SH_27/SH_27-api/target/test-classes/org/samples/osgi/service/AppTest.class
  605. Deleting directory /home/rcbandit/Desktop/NetBeans/Prototype_3/SH_27/SH_27-api/target/test-classes/org/samples/osgi/service
  606. Deleting directory /home/rcbandit/Desktop/NetBeans/Prototype_3/SH_27/SH_27-api/target/test-classes/org/samples/osgi
  607. Deleting directory /home/rcbandit/Desktop/NetBeans/Prototype_3/SH_27/SH_27-api/target/test-classes/org/samples
  608. Deleting directory /home/rcbandit/Desktop/NetBeans/Prototype_3/SH_27/SH_27-api/target/test-classes/org
  609. Deleting directory /home/rcbandit/Desktop/NetBeans/Prototype_3/SH_27/SH_27-api/target/test-classes
  610. Deleting file /home/rcbandit/Desktop/NetBeans/Prototype_3/SH_27/SH_27-api/target/SH_27-api-1.0-SNAPSHOT.jar
  611. Deleting directory /home/rcbandit/Desktop/NetBeans/Prototype_3/SH_27/SH_27-api/target/generated-sources/annotations
  612. Deleting directory /home/rcbandit/Desktop/NetBeans/Prototype_3/SH_27/SH_27-api/target/generated-sources/test-annotations
  613. Deleting directory /home/rcbandit/Desktop/NetBeans/Prototype_3/SH_27/SH_27-api/target/generated-sources
  614. Deleting file /home/rcbandit/Desktop/NetBeans/Prototype_3/SH_27/SH_27-api/target/classes/META-INF/MANIFEST.MF
  615. Deleting directory /home/rcbandit/Desktop/NetBeans/Prototype_3/SH_27/SH_27-api/target/classes/META-INF
  616. Deleting file /home/rcbandit/Desktop/NetBeans/Prototype_3/SH_27/SH_27-api/target/classes/org/DX_57/osgi/SH_27/api/SessionHandle.class
  617. Deleting directory /home/rcbandit/Desktop/NetBeans/Prototype_3/SH_27/SH_27-api/target/classes/org/DX_57/osgi/SH_27/api
  618. Deleting directory /home/rcbandit/Desktop/NetBeans/Prototype_3/SH_27/SH_27-api/target/classes/org/DX_57/osgi/SH_27
  619. Deleting directory /home/rcbandit/Desktop/NetBeans/Prototype_3/SH_27/SH_27-api/target/classes/org/DX_57/osgi
  620. Deleting directory /home/rcbandit/Desktop/NetBeans/Prototype_3/SH_27/SH_27-api/target/classes/org/DX_57
  621. Deleting directory /home/rcbandit/Desktop/NetBeans/Prototype_3/SH_27/SH_27-api/target/classes/org
  622. Deleting directory /home/rcbandit/Desktop/NetBeans/Prototype_3/SH_27/SH_27-api/target/classes
  623. Deleting file /home/rcbandit/Desktop/NetBeans/Prototype_3/SH_27/SH_27-api/target/surefire/surefirebooter2799330996183788237.jar
  624. Deleting file /home/rcbandit/Desktop/NetBeans/Prototype_3/SH_27/SH_27-api/target/surefire/surefire5594337137350200252tmp
  625. Deleting file /home/rcbandit/Desktop/NetBeans/Prototype_3/SH_27/SH_27-api/target/surefire/surefire890959175846382629tmp
  626. Deleting directory /home/rcbandit/Desktop/NetBeans/Prototype_3/SH_27/SH_27-api/target/surefire
  627. Deleting directory /home/rcbandit/Desktop/NetBeans/Prototype_3/SH_27/SH_27-api/target
  628. Skipping non-existing directory /home/rcbandit/Desktop/NetBeans/Prototype_3/SH_27/SH_27-api/target/classes
  629. Skipping non-existing directory /home/rcbandit/Desktop/NetBeans/Prototype_3/SH_27/SH_27-api/target/test-classes
  630. Skipping non-existing directory /home/rcbandit/Desktop/NetBeans/Prototype_3/SH_27/SH_27-api/target/site
  631.  
  632. [resources:resources]
  633. org.apache.maven.plugins:maven-resources-plugin:jar:2.5:
  634.    org.apache.maven:maven-plugin-api:jar:2.0.6:compile
  635.    org.apache.maven:maven-project:jar:2.0.6:compile
  636.       org.apache.maven:maven-profile:jar:2.0.6:compile
  637.       org.apache.maven:maven-artifact-manager:jar:2.0.6:compile
  638.       org.apache.maven:maven-plugin-registry:jar:2.0.6:compile
  639.    org.apache.maven:maven-core:jar:2.0.6:compile
  640.       org.apache.maven:maven-plugin-parameter-documenter:jar:2.0.6:compile
  641.       org.apache.maven.reporting:maven-reporting-api:jar:2.0.6:compile
  642.          org.apache.maven.doxia:doxia-sink-api:jar:1.0-alpha-7:compile
  643.       org.apache.maven:maven-repository-metadata:jar:2.0.6:compile
  644.       org.apache.maven:maven-error-diagnostics:jar:2.0.6:compile
  645.       commons-cli:commons-cli:jar:1.0:compile
  646.       org.apache.maven:maven-plugin-descriptor:jar:2.0.6:compile
  647.       org.codehaus.plexus:plexus-interactivity-api:jar:1.0-alpha-4:compile
  648.       classworlds:classworlds:jar:1.1:compile
  649.    org.apache.maven:maven-artifact:jar:2.0.6:compile
  650.    org.apache.maven:maven-settings:jar:2.0.6:compile
  651.    org.apache.maven:maven-model:jar:2.0.6:compile
  652.    org.apache.maven:maven-monitor:jar:2.0.6:compile
  653.    org.codehaus.plexus:plexus-container-default:jar:1.0-alpha-9-stable-1:compile
  654.       junit:junit:jar:3.8.1:compile
  655.    org.codehaus.plexus:plexus-utils:jar:2.0.5:compile
  656.    org.apache.maven.shared:maven-filtering:jar:1.0:compile
  657.       org.sonatype.plexus:plexus-build-api:jar:0.0.4:compile
  658.    org.codehaus.plexus:plexus-interpolation:jar:1.13:compile
  659. Created new class realm plugin>org.apache.maven.plugins:maven-resources-plugin:2.5
  660. Importing foreign packages into class realm plugin>org.apache.maven.plugins:maven-resources-plugin:2.5
  661.   Imported:  < project>org.DX_57.osgi.SH_27:SH_27-api:1.0-SNAPSHOT
  662. Populating class realm plugin>org.apache.maven.plugins:maven-resources-plugin:2.5
  663.   Included: org.apache.maven.plugins:maven-resources-plugin:jar:2.5
  664.   Included: org.apache.maven.reporting:maven-reporting-api:jar:2.0.6
  665.   Included: org.apache.maven.doxia:doxia-sink-api:jar:1.0-alpha-7
  666.   Included: commons-cli:commons-cli:jar:1.0
  667.   Included: org.codehaus.plexus:plexus-interactivity-api:jar:1.0-alpha-4
  668.   Included: junit:junit:jar:3.8.1
  669.   Included: org.codehaus.plexus:plexus-utils:jar:2.0.5
  670.   Included: org.apache.maven.shared:maven-filtering:jar:1.0
  671.   Included: org.sonatype.plexus:plexus-build-api:jar:0.0.4
  672.   Included: org.codehaus.plexus:plexus-interpolation:jar:1.13
  673.   Excluded: org.apache.maven:maven-plugin-api:jar:2.0.6
  674.   Excluded: org.apache.maven:maven-project:jar:2.0.6
  675.   Excluded: org.apache.maven:maven-profile:jar:2.0.6
  676.   Excluded: org.apache.maven:maven-artifact-manager:jar:2.0.6
  677.   Excluded: org.apache.maven:maven-plugin-registry:jar:2.0.6
  678.   Excluded: org.apache.maven:maven-core:jar:2.0.6
  679.   Excluded: org.apache.maven:maven-plugin-parameter-documenter:jar:2.0.6
  680.   Excluded: org.apache.maven:maven-repository-metadata:jar:2.0.6
  681.   Excluded: org.apache.maven:maven-error-diagnostics:jar:2.0.6
  682.   Excluded: org.apache.maven:maven-plugin-descriptor:jar:2.0.6
  683.   Excluded: classworlds:classworlds:jar:1.1
  684.   Excluded: org.apache.maven:maven-artifact:jar:2.0.6
  685.   Excluded: org.apache.maven:maven-settings:jar:2.0.6
  686.   Excluded: org.apache.maven:maven-model:jar:2.0.6
  687.   Excluded: org.apache.maven:maven-monitor:jar:2.0.6
  688.   Excluded: org.codehaus.plexus:plexus-container-default:jar:1.0-alpha-9-stable-1
  689. Configuring mojo org.apache.maven.plugins:maven-resources-plugin:2.5:resources from plugin realm ClassRealm[plugin>org.apache.maven.plugins:maven-resources-plugin:2.5, parent: sun.misc.Launcher$AppClassLoader@397577f9]
  690. [debug] execute contextualize
  691. Configuring mojo 'org.apache.maven.plugins:maven-resources-plugin:2.5:resources' with basic configurator -->
  692.   (f) buildFilters = []
  693.   (f) escapeWindowsPaths = true
  694.   (s) includeEmptyDirs = false
  695.   (s) outputDirectory = /home/rcbandit/Desktop/NetBeans/Prototype_3/SH_27/SH_27-api/target/classes
  696.   (s) overwrite = false
  697.   (f) project = MavenProject: org.DX_57.osgi.SH_27:SH_27-api:1.0-SNAPSHOT @ /home/rcbandit/Desktop/NetBeans/Prototype_3/SH_27/SH_27-api/pom.xml
  698.   (s) resources = [Resource {targetPath: null, filtering: false, FileSet {directory: /home/rcbandit/Desktop/NetBeans/Prototype_3/SH_27/SH_27-api/src/main/resources, PatternSet [includes: {}, excludes: {}]}}]
  699.   (f) session = org.apache.maven.execution.MavenSession@65bd831f
  700.   (f) supportMultiLineFiltering = false
  701.   (f) useBuildFilters = true
  702.   (s) useDefaultDelimiters = true
  703. -- end configuration --
  704. properties used {java.vendor=Oracle Corporation, env.SESSION_MANAGER=local/unix:@/tmp/.ICE-unix/1343,unix/unix:/tmp/.ICE-unix/1343, env.LESSOPEN=||/usr/bin/lesspipe.sh %s, sun.java.launcher=SUN_STANDARD, env.QT_IM_MODULE=xim, sun.management.compiler=HotSpot 64-Bit Tiered Compilers, os.name=Linux, sun.boot.class.path=/opt/jdk1.7.0_02/jre/lib/resources.jar:/opt/jdk1.7.0_02/jre/lib/rt.jar:/opt/jdk1.7.0_02/jre/lib/sunrsasign.jar:/opt/jdk1.7.0_02/jre/lib/jsse.jar:/opt/jdk1.7.0_02/jre/lib/jce.jar:/opt/jdk1.7.0_02/jre/lib/charsets.jar:/opt/jdk1.7.0_02/jre/classes, env.PWD=/home/rcbandit/Desktop/NetBeans/Prototype_3/SH_27, env.XDG_SESSION_COOKIE=353e720329bb1813f71d8e5c0000000a-1327785405.693058-1237082549, sun.desktop=gnome, env.LANG=en_US.UTF-8, java.vm.specification.vendor=Oracle Corporation, java.runtime.version=1.7.0_02-b13, env.HISTSIZE=1000, env.XDG_VTNR=1, env.DISPLAY=:0.0, user.name=rcbandit, env.USER=rcbandit, env.HISTCONTROL=ignoredups, env.SHELL=/bin/bash, env.DESKTOP_SESSION=gnome, env.NLSPATH=/usr/dt/lib/nls/msg/%L/%N.cat, env.PATH=/usr/lib64/ccache:/usr/local/bin:/usr/bin:/bin:/usr/local/sbin:/usr/sbin:/sbin:/home/rcbandit/.local/bin:/home/rcbandit/bin, user.language=en, env.IMSETTINGS_MODULE=none, sun.boot.library.path=/opt/jdk1.7.0_02/jre/lib/amd64, classworlds.conf=/home/rcbandit/netbeans-7.0.1/java/maven/bin/m2.conf, java.version=1.7.0_02, user.timezone=Europe/Sofia, env.DBUS_SESSION_BUS_ADDRESS=unix:abstract=/tmp/dbus-mFRjLQobMX,guid=8ae9d800ce549290cbc92d550000001b, sun.arch.data.model=64, java.endorsed.dirs=/opt/jdk1.7.0_02/jre/lib/endorsed, sun.cpu.isalist=, sun.jnu.encoding=UTF-8, file.encoding.pkg=sun.io, env.SHLVL=2, file.separator=/, env.HOSTNAME=Laptop, java.specification.name=Java Platform API Specification, env.IMSETTINGS_INTEGRATE_DESKTOP=yes, env.GNOME_DESKTOP_SESSION_ID=this-is-deprecated, java.class.version=51.0, env.GDMSESSION=gnome, user.country=US, env.GNOME_KEYRING_PID=1339, java.home=/opt/jdk1.7.0_02/jre, java.vm.info=mixed mode, env.LOGNAME=rcbandit, os.version=3.2.2-1.fc16.x86_64, path.separator=:, java.vm.version=22.0-b10, env.JAVA_HOME=/opt/jdk1.7.0_02, java.awt.printerjob=sun.print.PSPrinterJob, env.TERM=dumb, env.WINDOWPATH=1, sun.io.unicode.encoding=UnicodeLittle, awt.toolkit=sun.awt.X11.XToolkit, env.XMODIFIERS=@im=none, user.home=/home/rcbandit, env.NB_EXEC_MAVEN_PROCESS_UUID=5919535d-c3e3-4e9c-bbce-644b074a4a89, env.OLDPWD=/home/rcbandit/Desktop/NetBeans/Prototype_3/SH_27, java.specification.vendor=Oracle Corporation, java.library.path=/usr/java/packages/lib/amd64:/usr/lib64:/lib64:/lib:/usr/lib, java.vendor.url=http://java.oracle.com/, env.GIO_LAUNCHED_DESKTOP_FILE=/home/rcbandit/.local/share/applications/netbeans-7.0.1.desktop, env.XDG_SEAT=seat0, java.vm.vendor=Oracle Corporation, maven.home=/home/rcbandit/netbeans-7.0.1/java/maven, java.runtime.name=Java(TM) SE Runtime Environment, sun.java.command=org.codehaus.plexus.classworlds.launcher.Launcher clean install -X, java.class.path=/home/rcbandit/netbeans-7.0.1/java/maven/boot/plexus-classworlds-2.4.jar, env.XDG_SESSION_ID=2, env.CVS_RSH=ssh, env.XFILESEARCHPATH=/usr/dt/app-defaults/%L/Dt, java.vm.specification.name=Java Virtual Machine Specification, java.vm.specification.version=1.7, sun.cpu.endian=little, sun.os.patch.level=unknown, env.HOME=/home/rcbandit, java.io.tmpdir=/tmp, java.vendor.url.bug=http://bugreport.sun.com/bugreport/, env.SSH_AUTH_SOCK=/tmp/keyring-Yj3bRR/ssh, os.arch=amd64, java.awt.graphicsenv=sun.awt.X11GraphicsEnvironment, java.ext.dirs=/opt/jdk1.7.0_02/jre/lib/ext:/usr/java/packages/lib/ext, env.XDG_RUNTIME_DIR=/run/user/rcbandit, env.XAUTHORITY=/var/run/gdm/auth-for-rcbandit-ZIWsIN/database, user.dir=/home/rcbandit/Desktop/NetBeans/Prototype_3/SH_27, env.J2D_PIXMAPS=shared, line.separator=
  705. , java.vm.name=Java HotSpot(TM) 64-Bit Server VM, env.CCACHE_HASHDIR=, env.USERNAME=rcbandit, file.encoding=UTF-8, env.MAIL=/var/spool/mail/rcbandit, env.GPG_AGENT_INFO=/tmp/keyring-Yj3bRR/gpg:0:1, env.GIO_LAUNCHED_DESKTOP_FILE_PID=3073, java.specification.version=1.7, env.GNOME_KEYRING_CONTROL=/tmp/keyring-Yj3bRR}
  706. Using platform encoding (UTF-8 actually) to copy filtered resources, i.e. build is platform dependent!
  707. resource with targetPath null
  708. directory /home/rcbandit/Desktop/NetBeans/Prototype_3/SH_27/SH_27-api/src/main/resources
  709. excludes []
  710. includes []
  711. ignoreDelta true
  712. Copying 0 resource
  713. no use filter components
  714.  
  715. [compiler:compile]
  716. org.apache.maven.plugins:maven-compiler-plugin:jar:2.3.2:
  717.    org.apache.maven:maven-plugin-api:jar:2.0.6:compile
  718.    org.apache.maven:maven-artifact:jar:2.0.6:compile
  719.    org.apache.maven:maven-core:jar:2.0.6:compile
  720.       org.apache.maven:maven-settings:jar:2.0.6:compile
  721.       org.apache.maven:maven-plugin-parameter-documenter:jar:2.0.6:compile
  722.       org.apache.maven:maven-profile:jar:2.0.6:compile
  723.       org.apache.maven:maven-model:jar:2.0.6:compile
  724.       org.apache.maven:maven-repository-metadata:jar:2.0.6:compile
  725.       org.apache.maven:maven-error-diagnostics:jar:2.0.6:compile
  726.       org.apache.maven:maven-project:jar:2.0.6:compile
  727.          org.apache.maven:maven-plugin-registry:jar:2.0.6:compile
  728.       org.apache.maven:maven-plugin-descriptor:jar:2.0.6:compile
  729.       org.apache.maven:maven-artifact-manager:jar:2.0.6:compile
  730.       org.apache.maven:maven-monitor:jar:2.0.6:compile
  731.    org.apache.maven:maven-toolchain:jar:1.0:compile
  732.    org.codehaus.plexus:plexus-utils:jar:2.0.5:compile
  733.    org.codehaus.plexus:plexus-compiler-api:jar:1.8.1:compile
  734.    org.codehaus.plexus:plexus-compiler-manager:jar:1.8.1:compile
  735.    org.codehaus.plexus:plexus-compiler-javac:jar:1.8.1:runtime
  736. Created new class realm plugin>org.apache.maven.plugins:maven-compiler-plugin:2.3.2
  737. Importing foreign packages into class realm plugin>org.apache.maven.plugins:maven-compiler-plugin:2.3.2
  738.   Imported:  < project>org.DX_57.osgi.SH_27:SH_27-api:1.0-SNAPSHOT
  739. Populating class realm plugin>org.apache.maven.plugins:maven-compiler-plugin:2.3.2
  740.   Included: org.apache.maven.plugins:maven-compiler-plugin:jar:2.3.2
  741.   Included: org.codehaus.plexus:plexus-utils:jar:2.0.5
  742.   Included: org.codehaus.plexus:plexus-compiler-api:jar:1.8.1
  743.   Included: org.codehaus.plexus:plexus-compiler-manager:jar:1.8.1
  744.   Included: org.codehaus.plexus:plexus-compiler-javac:jar:1.8.1
  745.   Excluded: org.apache.maven:maven-plugin-api:jar:2.0.6
  746.   Excluded: org.apache.maven:maven-artifact:jar:2.0.6
  747.   Excluded: org.apache.maven:maven-core:jar:2.0.6
  748.   Excluded: org.apache.maven:maven-settings:jar:2.0.6
  749.   Excluded: org.apache.maven:maven-plugin-parameter-documenter:jar:2.0.6
  750.   Excluded: org.apache.maven:maven-profile:jar:2.0.6
  751.   Excluded: org.apache.maven:maven-model:jar:2.0.6
  752.   Excluded: org.apache.maven:maven-repository-metadata:jar:2.0.6
  753.   Excluded: org.apache.maven:maven-error-diagnostics:jar:2.0.6
  754.   Excluded: org.apache.maven:maven-project:jar:2.0.6
  755.   Excluded: org.apache.maven:maven-plugin-registry:jar:2.0.6
  756.   Excluded: org.apache.maven:maven-plugin-descriptor:jar:2.0.6
  757.   Excluded: org.apache.maven:maven-artifact-manager:jar:2.0.6
  758.   Excluded: org.apache.maven:maven-monitor:jar:2.0.6
  759.   Excluded: org.apache.maven:maven-toolchain:jar:1.0
  760. Configuring mojo org.apache.maven.plugins:maven-compiler-plugin:2.3.2:compile from plugin realm ClassRealm[plugin>org.apache.maven.plugins:maven-compiler-plugin:2.3.2, parent: sun.misc.Launcher$AppClassLoader@397577f9]
  761. Configuring mojo 'org.apache.maven.plugins:maven-compiler-plugin:2.3.2:compile' with basic configurator -->
  762.   (f) basedir = /home/rcbandit/Desktop/NetBeans/Prototype_3/SH_27/SH_27-api
  763.   (f) buildDirectory = /home/rcbandit/Desktop/NetBeans/Prototype_3/SH_27/SH_27-api/target
  764.   (f) classpathElements = [/home/rcbandit/Desktop/NetBeans/Prototype_3/SH_27/SH_27-api/target/classes, /home/rcbandit/.m2/repository/org/apache/felix/org.osgi.core/1.0.0/org.osgi.core-1.0.0.jar]
  765.   (f) compileSourceRoots = [/home/rcbandit/Desktop/NetBeans/Prototype_3/SH_27/SH_27-api/src/main/java]
  766.   (f) compilerId = javac
  767.   (f) debug = true
  768.   (f) failOnError = true
  769.   (f) fork = false
  770.   (f) generatedSourcesDirectory = /home/rcbandit/Desktop/NetBeans/Prototype_3/SH_27/SH_27-api/target/generated-sources/annotations
  771.   (f) optimize = false
  772.   (f) outputDirectory = /home/rcbandit/Desktop/NetBeans/Prototype_3/SH_27/SH_27-api/target/classes
  773.   (f) outputFileName = SH_27-api-1.0-SNAPSHOT
  774.   (f) projectArtifact = org.DX_57.osgi.SH_27:SH_27-api:bundle:1.0-SNAPSHOT
  775.   (f) session = org.apache.maven.execution.MavenSession@65bd831f
  776.   (f) showDeprecation = false
  777.   (f) showWarnings = false
  778.   (f) source = 1.7
  779.   (f) staleMillis = 0
  780.   (f) target = 1.7
  781.   (f) verbose = false
  782. -- end configuration --
  783. Using compiler 'javac'.
  784. Source directories: [/home/rcbandit/Desktop/NetBeans/Prototype_3/SH_27/SH_27-api/src/main/java]
  785. Classpath: [/home/rcbandit/Desktop/NetBeans/Prototype_3/SH_27/SH_27-api/target/classes
  786.  /home/rcbandit/.m2/repository/org/apache/felix/org.osgi.core/1.0.0/org.osgi.core-1.0.0.jar]
  787. Output directory: /home/rcbandit/Desktop/NetBeans/Prototype_3/SH_27/SH_27-api/target/classes
  788. Classpath:
  789.  /home/rcbandit/Desktop/NetBeans/Prototype_3/SH_27/SH_27-api/target/classes
  790.  /home/rcbandit/.m2/repository/org/apache/felix/org.osgi.core/1.0.0/org.osgi.core-1.0.0.jar
  791. Source roots:
  792.  /home/rcbandit/Desktop/NetBeans/Prototype_3/SH_27/SH_27-api/src/main/java
  793. Command line options:
  794. -d /home/rcbandit/Desktop/NetBeans/Prototype_3/SH_27/SH_27-api/target/classes -classpath /home/rcbandit/Desktop/NetBeans/Prototype_3/SH_27/SH_27-api/target/classes:/home/rcbandit/.m2/repository/org/apache/felix/org.osgi.core/1.0.0/org.osgi.core-1.0.0.jar: -sourcepath /home/rcbandit/Desktop/NetBeans/Prototype_3/SH_27/SH_27-api/src/main/java: /home/rcbandit/Desktop/NetBeans/Prototype_3/SH_27/SH_27-api/src/main/java/org/DX_57/osgi/SH_27/api/SessionHandle.java -s /home/rcbandit/Desktop/NetBeans/Prototype_3/SH_27/SH_27-api/target/generated-sources/annotations -g -nowarn -target 1.7 -source 1.7
  795. File encoding has not been set, using platform encoding UTF-8, i.e. build is platform dependent!
  796. Compiling 1 source file to /home/rcbandit/Desktop/NetBeans/Prototype_3/SH_27/SH_27-api/target/classes
  797.  
  798. [resources:testResources]
  799. Configuring mojo org.apache.maven.plugins:maven-resources-plugin:2.5:testResources from plugin realm ClassRealm[plugin>org.apache.maven.plugins:maven-resources-plugin:2.5, parent: sun.misc.Launcher$AppClassLoader@397577f9]
  800. [debug] execute contextualize
  801. Configuring mojo 'org.apache.maven.plugins:maven-resources-plugin:2.5:testResources' with basic configurator -->
  802.   (f) buildFilters = []
  803.   (f) escapeWindowsPaths = true
  804.   (s) includeEmptyDirs = false
  805.   (s) outputDirectory = /home/rcbandit/Desktop/NetBeans/Prototype_3/SH_27/SH_27-api/target/test-classes
  806.   (s) overwrite = false
  807.   (f) project = MavenProject: org.DX_57.osgi.SH_27:SH_27-api:1.0-SNAPSHOT @ /home/rcbandit/Desktop/NetBeans/Prototype_3/SH_27/SH_27-api/pom.xml
  808.   (s) resources = [Resource {targetPath: null, filtering: false, FileSet {directory: /home/rcbandit/Desktop/NetBeans/Prototype_3/SH_27/SH_27-api/src/test/resources, PatternSet [includes: {}, excludes: {}]}}]
  809.   (f) session = org.apache.maven.execution.MavenSession@65bd831f
  810.   (f) supportMultiLineFiltering = false
  811.   (f) useBuildFilters = true
  812.   (s) useDefaultDelimiters = true
  813. -- end configuration --
  814. properties used {java.vendor=Oracle Corporation, env.SESSION_MANAGER=local/unix:@/tmp/.ICE-unix/1343,unix/unix:/tmp/.ICE-unix/1343, env.LESSOPEN=||/usr/bin/lesspipe.sh %s, sun.java.launcher=SUN_STANDARD, env.QT_IM_MODULE=xim, sun.management.compiler=HotSpot 64-Bit Tiered Compilers, os.name=Linux, sun.boot.class.path=/opt/jdk1.7.0_02/jre/lib/resources.jar:/opt/jdk1.7.0_02/jre/lib/rt.jar:/opt/jdk1.7.0_02/jre/lib/sunrsasign.jar:/opt/jdk1.7.0_02/jre/lib/jsse.jar:/opt/jdk1.7.0_02/jre/lib/jce.jar:/opt/jdk1.7.0_02/jre/lib/charsets.jar:/opt/jdk1.7.0_02/jre/classes, env.PWD=/home/rcbandit/Desktop/NetBeans/Prototype_3/SH_27, env.XDG_SESSION_COOKIE=353e720329bb1813f71d8e5c0000000a-1327785405.693058-1237082549, sun.desktop=gnome, env.LANG=en_US.UTF-8, java.vm.specification.vendor=Oracle Corporation, java.runtime.version=1.7.0_02-b13, env.HISTSIZE=1000, env.XDG_VTNR=1, env.DISPLAY=:0.0, user.name=rcbandit, env.USER=rcbandit, env.HISTCONTROL=ignoredups, env.SHELL=/bin/bash, env.DESKTOP_SESSION=gnome, env.NLSPATH=/usr/dt/lib/nls/msg/%L/%N.cat, env.PATH=/usr/lib64/ccache:/usr/local/bin:/usr/bin:/bin:/usr/local/sbin:/usr/sbin:/sbin:/home/rcbandit/.local/bin:/home/rcbandit/bin, user.language=en, env.IMSETTINGS_MODULE=none, sun.boot.library.path=/opt/jdk1.7.0_02/jre/lib/amd64, classworlds.conf=/home/rcbandit/netbeans-7.0.1/java/maven/bin/m2.conf, java.version=1.7.0_02, user.timezone=Europe/Sofia, env.DBUS_SESSION_BUS_ADDRESS=unix:abstract=/tmp/dbus-mFRjLQobMX,guid=8ae9d800ce549290cbc92d550000001b, sun.arch.data.model=64, java.endorsed.dirs=/opt/jdk1.7.0_02/jre/lib/endorsed, sun.cpu.isalist=, sun.jnu.encoding=UTF-8, file.encoding.pkg=sun.io, env.SHLVL=2, file.separator=/, env.HOSTNAME=Laptop, java.specification.name=Java Platform API Specification, env.IMSETTINGS_INTEGRATE_DESKTOP=yes, env.GNOME_DESKTOP_SESSION_ID=this-is-deprecated, java.class.version=51.0, env.GDMSESSION=gnome, user.country=US, env.GNOME_KEYRING_PID=1339, java.home=/opt/jdk1.7.0_02/jre, java.vm.info=mixed mode, env.LOGNAME=rcbandit, os.version=3.2.2-1.fc16.x86_64, path.separator=:, java.vm.version=22.0-b10, env.JAVA_HOME=/opt/jdk1.7.0_02, java.awt.printerjob=sun.print.PSPrinterJob, env.TERM=dumb, env.WINDOWPATH=1, sun.io.unicode.encoding=UnicodeLittle, awt.toolkit=sun.awt.X11.XToolkit, env.XMODIFIERS=@im=none, user.home=/home/rcbandit, env.NB_EXEC_MAVEN_PROCESS_UUID=5919535d-c3e3-4e9c-bbce-644b074a4a89, env.OLDPWD=/home/rcbandit/Desktop/NetBeans/Prototype_3/SH_27, java.specification.vendor=Oracle Corporation, java.library.path=/usr/java/packages/lib/amd64:/usr/lib64:/lib64:/lib:/usr/lib, java.vendor.url=http://java.oracle.com/, env.GIO_LAUNCHED_DESKTOP_FILE=/home/rcbandit/.local/share/applications/netbeans-7.0.1.desktop, env.XDG_SEAT=seat0, java.vm.vendor=Oracle Corporation, maven.home=/home/rcbandit/netbeans-7.0.1/java/maven, java.runtime.name=Java(TM) SE Runtime Environment, sun.java.command=org.codehaus.plexus.classworlds.launcher.Launcher clean install -X, java.class.path=/home/rcbandit/netbeans-7.0.1/java/maven/boot/plexus-classworlds-2.4.jar, env.XDG_SESSION_ID=2, env.CVS_RSH=ssh, env.XFILESEARCHPATH=/usr/dt/app-defaults/%L/Dt, java.vm.specification.name=Java Virtual Machine Specification, java.vm.specification.version=1.7, sun.cpu.endian=little, sun.os.patch.level=unknown, env.HOME=/home/rcbandit, java.io.tmpdir=/tmp, java.vendor.url.bug=http://bugreport.sun.com/bugreport/, env.SSH_AUTH_SOCK=/tmp/keyring-Yj3bRR/ssh, os.arch=amd64, java.awt.graphicsenv=sun.awt.X11GraphicsEnvironment, java.ext.dirs=/opt/jdk1.7.0_02/jre/lib/ext:/usr/java/packages/lib/ext, env.XDG_RUNTIME_DIR=/run/user/rcbandit, env.XAUTHORITY=/var/run/gdm/auth-for-rcbandit-ZIWsIN/database, user.dir=/home/rcbandit/Desktop/NetBeans/Prototype_3/SH_27, env.J2D_PIXMAPS=shared, line.separator=
  815. , java.vm.name=Java HotSpot(TM) 64-Bit Server VM, env.CCACHE_HASHDIR=, env.USERNAME=rcbandit, file.encoding=UTF-8, env.MAIL=/var/spool/mail/rcbandit, env.GPG_AGENT_INFO=/tmp/keyring-Yj3bRR/gpg:0:1, env.GIO_LAUNCHED_DESKTOP_FILE_PID=3073, java.specification.version=1.7, env.GNOME_KEYRING_CONTROL=/tmp/keyring-Yj3bRR}
  816. Using platform encoding (UTF-8 actually) to copy filtered resources, i.e. build is platform dependent!
  817. resource with targetPath null
  818. directory /home/rcbandit/Desktop/NetBeans/Prototype_3/SH_27/SH_27-api/src/test/resources
  819. excludes []
  820. includes []
  821. skip non existing resourceDirectory /home/rcbandit/Desktop/NetBeans/Prototype_3/SH_27/SH_27-api/src/test/resources
  822. no use filter components
  823.  
  824. [compiler:testCompile]
  825. Configuring mojo org.apache.maven.plugins:maven-compiler-plugin:2.3.2:testCompile from plugin realm ClassRealm[plugin>org.apache.maven.plugins:maven-compiler-plugin:2.3.2, parent: sun.misc.Launcher$AppClassLoader@397577f9]
  826. Configuring mojo 'org.apache.maven.plugins:maven-compiler-plugin:2.3.2:testCompile' with basic configurator -->
  827.   (f) basedir = /home/rcbandit/Desktop/NetBeans/Prototype_3/SH_27/SH_27-api
  828.   (f) buildDirectory = /home/rcbandit/Desktop/NetBeans/Prototype_3/SH_27/SH_27-api/target
  829.   (f) classpathElements = [/home/rcbandit/Desktop/NetBeans/Prototype_3/SH_27/SH_27-api/target/test-classes, /home/rcbandit/Desktop/NetBeans/Prototype_3/SH_27/SH_27-api/target/classes, /home/rcbandit/.m2/repository/junit/junit/3.8.1/junit-3.8.1.jar, /home/rcbandit/.m2/repository/org/apache/felix/org.osgi.core/1.0.0/org.osgi.core-1.0.0.jar]
  830.   (f) compileSourceRoots = [/home/rcbandit/Desktop/NetBeans/Prototype_3/SH_27/SH_27-api/src/test/java]
  831.   (f) compilerId = javac
  832.   (f) debug = true
  833.   (f) failOnError = true
  834.   (f) fork = false
  835.   (f) generatedTestSourcesDirectory = /home/rcbandit/Desktop/NetBeans/Prototype_3/SH_27/SH_27-api/target/generated-sources/test-annotations
  836.   (f) optimize = false
  837.   (f) outputDirectory = /home/rcbandit/Desktop/NetBeans/Prototype_3/SH_27/SH_27-api/target/test-classes
  838.   (f) outputFileName = SH_27-api-1.0-SNAPSHOT
  839.   (f) session = org.apache.maven.execution.MavenSession@65bd831f
  840.   (f) showDeprecation = false
  841.   (f) showWarnings = false
  842.   (f) source = 1.7
  843.   (f) staleMillis = 0
  844.   (f) target = 1.7
  845.   (f) verbose = false
  846. -- end configuration --
  847. Using compiler 'javac'.
  848. Source directories: [/home/rcbandit/Desktop/NetBeans/Prototype_3/SH_27/SH_27-api/src/test/java]
  849. Classpath: [/home/rcbandit/Desktop/NetBeans/Prototype_3/SH_27/SH_27-api/target/test-classes
  850.  /home/rcbandit/Desktop/NetBeans/Prototype_3/SH_27/SH_27-api/target/classes
  851.  /home/rcbandit/.m2/repository/junit/junit/3.8.1/junit-3.8.1.jar
  852.  /home/rcbandit/.m2/repository/org/apache/felix/org.osgi.core/1.0.0/org.osgi.core-1.0.0.jar]
  853. Output directory: /home/rcbandit/Desktop/NetBeans/Prototype_3/SH_27/SH_27-api/target/test-classes
  854. Classpath:
  855.  /home/rcbandit/Desktop/NetBeans/Prototype_3/SH_27/SH_27-api/target/test-classes
  856.  /home/rcbandit/Desktop/NetBeans/Prototype_3/SH_27/SH_27-api/target/classes
  857.  /home/rcbandit/.m2/repository/junit/junit/3.8.1/junit-3.8.1.jar
  858.  /home/rcbandit/.m2/repository/org/apache/felix/org.osgi.core/1.0.0/org.osgi.core-1.0.0.jar
  859. Source roots:
  860.  /home/rcbandit/Desktop/NetBeans/Prototype_3/SH_27/SH_27-api/src/test/java
  861. Command line options:
  862. -d /home/rcbandit/Desktop/NetBeans/Prototype_3/SH_27/SH_27-api/target/test-classes -classpath /home/rcbandit/Desktop/NetBeans/Prototype_3/SH_27/SH_27-api/target/test-classes:/home/rcbandit/Desktop/NetBeans/Prototype_3/SH_27/SH_27-api/target/classes:/home/rcbandit/.m2/repository/junit/junit/3.8.1/junit-3.8.1.jar:/home/rcbandit/.m2/repository/org/apache/felix/org.osgi.core/1.0.0/org.osgi.core-1.0.0.jar: -sourcepath /home/rcbandit/Desktop/NetBeans/Prototype_3/SH_27/SH_27-api/src/test/java: /home/rcbandit/Desktop/NetBeans/Prototype_3/SH_27/SH_27-api/src/test/java/org/samples/osgi/service/AppTest.java -s /home/rcbandit/Desktop/NetBeans/Prototype_3/SH_27/SH_27-api/target/generated-sources/test-annotations -g -nowarn -target 1.7 -source 1.7
  863. File encoding has not been set, using platform encoding UTF-8, i.e. build is platform dependent!
  864. Compiling 1 source file to /home/rcbandit/Desktop/NetBeans/Prototype_3/SH_27/SH_27-api/target/test-classes
  865.  
  866. [surefire:test]
  867. org.apache.maven.plugins:maven-surefire-plugin:jar:2.11:
  868.    org.apache.maven:maven-plugin-api:jar:2.0.9:compile
  869.    org.apache.maven.surefire:surefire-booter:jar:2.11:compile
  870.       org.apache.maven.surefire:surefire-api:jar:2.11:compile
  871.    org.apache.maven.surefire:maven-surefire-common:jar:2.11:compile
  872.       org.apache.maven.shared:maven-common-artifact-filters:jar:1.3:compile
  873.    org.codehaus.plexus:plexus-utils:jar:2.1:compile
  874.    org.apache.maven:maven-artifact:jar:2.0.9:compile
  875.    org.apache.maven:maven-project:jar:2.0.9:compile
  876.       org.apache.maven:maven-settings:jar:2.0.9:compile
  877.       org.apache.maven:maven-profile:jar:2.0.9:compile
  878.       org.apache.maven:maven-model:jar:2.0.9:compile
  879.       org.apache.maven:maven-artifact-manager:jar:2.0.9:compile
  880.       org.apache.maven:maven-plugin-registry:jar:2.0.9:compile
  881.       org.codehaus.plexus:plexus-container-default:jar:1.0-alpha-9-stable-1:compile
  882.          junit:junit:jar:3.8.1:test (scope managed from compile)
  883.    org.apache.maven:maven-core:jar:2.0.9:compile
  884.       org.apache.maven:maven-plugin-parameter-documenter:jar:2.0.9:compile
  885.       org.apache.maven.reporting:maven-reporting-api:jar:2.0.9:compile
  886.       org.apache.maven:maven-repository-metadata:jar:2.0.9:compile
  887.       org.apache.maven:maven-error-diagnostics:jar:2.0.9:compile
  888.       org.apache.maven:maven-plugin-descriptor:jar:2.0.9:compile
  889.       org.apache.maven:maven-monitor:jar:2.0.9:compile
  890.       classworlds:classworlds:jar:1.1:compile
  891.    org.apache.maven:maven-toolchain:jar:2.0.9:compile
  892. Created new class realm plugin>org.apache.maven.plugins:maven-surefire-plugin:2.11
  893. Importing foreign packages into class realm plugin>org.apache.maven.plugins:maven-surefire-plugin:2.11
  894.   Imported:  < project>org.DX_57.osgi.SH_27:SH_27-api:1.0-SNAPSHOT
  895. Populating class realm plugin>org.apache.maven.plugins:maven-surefire-plugin:2.11
  896.   Included: org.apache.maven.plugins:maven-surefire-plugin:jar:2.11
  897.   Included: org.apache.maven.surefire:surefire-booter:jar:2.11
  898.   Included: org.apache.maven.surefire:surefire-api:jar:2.11
  899.   Included: org.apache.maven.surefire:maven-surefire-common:jar:2.11
  900.   Included: org.apache.maven.shared:maven-common-artifact-filters:jar:1.3
  901.   Included: org.codehaus.plexus:plexus-utils:jar:2.1
  902.   Included: org.apache.maven.reporting:maven-reporting-api:jar:2.0.9
  903.   Excluded: org.apache.maven:maven-plugin-api:jar:2.0.9
  904.   Excluded: org.apache.maven:maven-artifact:jar:2.0.9
  905.   Excluded: org.apache.maven:maven-project:jar:2.0.9
  906.   Excluded: org.apache.maven:maven-settings:jar:2.0.9
  907.   Excluded: org.apache.maven:maven-profile:jar:2.0.9
  908.   Excluded: org.apache.maven:maven-model:jar:2.0.9
  909.   Excluded: org.apache.maven:maven-artifact-manager:jar:2.0.9
  910.   Excluded: org.apache.maven:maven-plugin-registry:jar:2.0.9
  911.   Excluded: org.codehaus.plexus:plexus-container-default:jar:1.0-alpha-9-stable-1
  912.   Excluded: junit:junit:jar:3.8.1
  913.   Excluded: org.apache.maven:maven-core:jar:2.0.9
  914.   Excluded: org.apache.maven:maven-plugin-parameter-documenter:jar:2.0.9
  915.   Excluded: org.apache.maven:maven-repository-metadata:jar:2.0.9
  916.   Excluded: org.apache.maven:maven-error-diagnostics:jar:2.0.9
  917.   Excluded: org.apache.maven:maven-plugin-descriptor:jar:2.0.9
  918.   Excluded: org.apache.maven:maven-monitor:jar:2.0.9
  919.   Excluded: classworlds:classworlds:jar:1.1
  920.   Excluded: org.apache.maven:maven-toolchain:jar:2.0.9
  921. Configuring mojo org.apache.maven.plugins:maven-surefire-plugin:2.11:test from plugin realm ClassRealm[plugin>org.apache.maven.plugins:maven-surefire-plugin:2.11, parent: sun.misc.Launcher$AppClassLoader@397577f9]
  922. Configuring mojo 'org.apache.maven.plugins:maven-surefire-plugin:2.11:test' with basic configurator -->
  923.   (s) basedir = /home/rcbandit/Desktop/NetBeans/Prototype_3/SH_27/SH_27-api
  924.   (s) childDelegation = false
  925.   (s) classesDirectory = /home/rcbandit/Desktop/NetBeans/Prototype_3/SH_27/SH_27-api/target/classes
  926.   (s) disableXmlReport = false
  927.   (s) enableAssertions = true
  928.   (s) forkMode = once
  929.   (s) junitArtifactName = junit:junit
  930.   (s) localRepository =        id: local
  931.       url: file:///home/rcbandit/.m2/repository/
  932.    layout: none
  933.  
  934.   (f) parallelMavenExecution = false
  935.   (s) perCoreThreadCount = true
  936.   (s) pluginArtifactMap = {org.apache.maven.plugins:maven-surefire-plugin=org.apache.maven.plugins:maven-surefire-plugin:maven-plugin:2.11:, org.apache.maven.surefire:surefire-booter=org.apache.maven.surefire:surefire-booter:jar:2.11:compile, org.apache.maven.surefire:surefire-api=org.apache.maven.surefire:surefire-api:jar:2.11:compile, org.apache.maven.surefire:maven-surefire-common=org.apache.maven.surefire:maven-surefire-common:jar:2.11:compile, org.apache.maven.shared:maven-common-artifact-filters=org.apache.maven.shared:maven-common-artifact-filters:jar:1.3:compile, org.codehaus.plexus:plexus-utils=org.codehaus.plexus:plexus-utils:jar:2.1:compile, org.apache.maven.reporting:maven-reporting-api=org.apache.maven.reporting:maven-reporting-api:jar:2.0.9:compile}
  937.   (s) printSummary = true
  938.   (s) project = MavenProject: org.DX_57.osgi.SH_27:SH_27-api:1.0-SNAPSHOT @ /home/rcbandit/Desktop/NetBeans/Prototype_3/SH_27/SH_27-api/pom.xml
  939.   (s) projectArtifactMap = {junit:junit=junit:junit:jar:3.8.1:test, org.apache.felix:org.osgi.core=org.apache.felix:org.osgi.core:jar:1.0.0:compile}
  940.   (s) redirectTestOutputToFile = false
  941.   (s) remoteRepositories = [       id: central
  942.       url: http://repo1.maven.org/maven2
  943.    layout: default
  944. snapshots: [enabled => false, update => daily]
  945.  releases: [enabled => true, update => never]
  946. ]
  947.   (s) reportFormat = brief
  948.   (s) reportsDirectory = /home/rcbandit/Desktop/NetBeans/Prototype_3/SH_27/SH_27-api/target/surefire-reports
  949.   (s) runOrder = filesystem
  950.   (s) session = org.apache.maven.execution.MavenSession@65bd831f
  951.   (s) skip = false
  952.   (s) skipTests = false
  953.   (s) testClassesDirectory = /home/rcbandit/Desktop/NetBeans/Prototype_3/SH_27/SH_27-api/target/test-classes
  954.   (s) testFailureIgnore = false
  955.   (s) testNGArtifactName = org.testng:testng
  956.   (s) testSourceDirectory = /home/rcbandit/Desktop/NetBeans/Prototype_3/SH_27/SH_27-api/src/test/java
  957.   (s) trimStackTrace = true
  958.   (s) useFile = true
  959.   (s) useManifestOnlyJar = true
  960.   (s) useSystemClassLoader = true
  961.   (s) useUnlimitedThreads = false
  962.   (s) workingDirectory = /home/rcbandit/Desktop/NetBeans/Prototype_3/SH_27/SH_27-api
  963. -- end configuration --
  964. Surefire report directory: /home/rcbandit/Desktop/NetBeans/Prototype_3/SH_27/SH_27-api/target/surefire-reports
  965. dummy:dummy:jar:1.0 (selected for null)
  966.   org.apache.maven.surefire:surefire-booter:jar:2.11:compile (selected for compile)
  967.     org.apache.maven.surefire:surefire-api:jar:2.11:compile (selected for compile)
  968. Adding to surefire booter test classpath: /home/rcbandit/.m2/repository/org/apache/maven/surefire/surefire-booter/2.11/surefire-booter-2.11.jar Scope: compile
  969. Adding to surefire booter test classpath: /home/rcbandit/.m2/repository/org/apache/maven/surefire/surefire-api/2.11/surefire-api-2.11.jar Scope: compile
  970. Setting system property [user.dir]=[/home/rcbandit/Desktop/NetBeans/Prototype_3/SH_27/SH_27-api]
  971. Setting system property [localRepository]=[/home/rcbandit/.m2/repository]
  972. Setting system property [basedir]=[/home/rcbandit/Desktop/NetBeans/Prototype_3/SH_27/SH_27-api]
  973. Using JVM: /opt/jdk1.7.0_02/jre/bin/java
  974. dummy:dummy:jar:1.0 (selected for null)
  975.   org.apache.maven.surefire:surefire-junit3:jar:2.11:test (selected for test)
  976.     org.apache.maven.surefire:surefire-api:jar:2.11:test (selected for test)
  977. Adding to surefire test classpath: /home/rcbandit/.m2/repository/org/apache/maven/surefire/surefire-junit3/2.11/surefire-junit3-2.11.jar Scope: test
  978. Adding to surefire test classpath: /home/rcbandit/.m2/repository/org/apache/maven/surefire/surefire-api/2.11/surefire-api-2.11.jar Scope: test
  979. test classpath classpath:
  980.   /home/rcbandit/Desktop/NetBeans/Prototype_3/SH_27/SH_27-api/target/test-classes
  981.   /home/rcbandit/Desktop/NetBeans/Prototype_3/SH_27/SH_27-api/target/classes
  982.   /home/rcbandit/.m2/repository/junit/junit/3.8.1/junit-3.8.1.jar
  983.   /home/rcbandit/.m2/repository/org/apache/felix/org.osgi.core/1.0.0/org.osgi.core-1.0.0.jar
  984. provider classpath classpath:
  985.   /home/rcbandit/.m2/repository/org/apache/maven/surefire/surefire-junit3/2.11/surefire-junit3-2.11.jar
  986.   /home/rcbandit/.m2/repository/org/apache/maven/surefire/surefire-api/2.11/surefire-api-2.11.jar
  987.  
  988. -------------------------------------------------------
  989.  T E S T S
  990. -------------------------------------------------------
  991. Forking command line: /bin/sh -c cd /home/rcbandit/Desktop/NetBeans/Prototype_3/SH_27/SH_27-api && /opt/jdk1.7.0_02/jre/bin/java -jar /home/rcbandit/Desktop/NetBeans/Prototype_3/SH_27/SH_27-api/target/surefire/surefirebooter1717516304942702362.jar /home/rcbandit/Desktop/NetBeans/Prototype_3/SH_27/SH_27-api/target/surefire/surefire2796102907473373025tmp /home/rcbandit/Desktop/NetBeans/Prototype_3/SH_27/SH_27-api/target/surefire/surefire2515885854994602532tmp
  992. Running org.samples.osgi.service.AppTest
  993. Tests run: 1, Failures: 0, Errors: 0, Skipped: 0, Time elapsed: 0.023 sec
  994.  
  995. Results :
  996.  
  997. Tests run: 1, Failures: 0, Errors: 0, Skipped: 0
  998.  
  999.  
  1000. [bundle:bundle]
  1001. org.apache.felix:maven-bundle-plugin:jar:2.3.6:
  1002.    biz.aQute:bndlib:jar:1.50.0:compile
  1003.    org.apache.felix:org.apache.felix.bundlerepository:jar:1.6.6:compile
  1004.       org.osgi:org.osgi.core:jar:4.1.0:compile
  1005.       org.easymock:easymock:jar:2.4:compile
  1006.    org.apache.maven:maven-core:jar:2.0.7:compile
  1007.       org.apache.maven:maven-settings:jar:2.0.7:compile
  1008.       org.apache.maven:maven-plugin-parameter-documenter:jar:2.0.7:compile
  1009.       org.apache.maven.reporting:maven-reporting-api:jar:2.0.7:compile
  1010.          org.apache.maven.doxia:doxia-sink-api:jar:1.0-alpha-7:compile
  1011.       org.apache.maven:maven-profile:jar:2.0.7:compile
  1012.       org.apache.maven:maven-model:jar:2.0.7:compile
  1013.       org.apache.maven:maven-artifact:jar:2.0.7:compile
  1014.       org.codehaus.plexus:plexus-container-default:jar:1.0-alpha-9-stable-1:compile
  1015.          junit:junit:jar:3.8.1:compile
  1016.       org.apache.maven:maven-repository-metadata:jar:2.0.7:compile
  1017.       org.apache.maven:maven-error-diagnostics:jar:2.0.7:compile
  1018.       org.apache.maven:maven-project:jar:2.0.7:compile
  1019.          org.apache.maven:maven-plugin-registry:jar:2.0.7:compile
  1020.       commons-cli:commons-cli:jar:1.0:compile
  1021.       org.apache.maven:maven-plugin-api:jar:2.0.7:compile
  1022.       org.apache.maven:maven-plugin-descriptor:jar:2.0.7:compile
  1023.       org.codehaus.plexus:plexus-interactivity-api:jar:1.0-alpha-4:compile
  1024.       org.apache.maven:maven-artifact-manager:jar:2.0.7:compile
  1025.       org.apache.maven:maven-monitor:jar:2.0.7:compile
  1026.       classworlds:classworlds:jar:1.1:compile
  1027.    org.apache.maven:maven-archiver:jar:2.4.1:compile
  1028.       org.codehaus.plexus:plexus-archiver:jar:1.0:compile
  1029.          org.codehaus.plexus:plexus-io:jar:1.0:compile
  1030.       org.codehaus.plexus:plexus-interpolation:jar:1.13:compile
  1031.    org.apache.maven.shared:maven-dependency-tree:jar:1.2:compile
  1032.    org.codehaus.plexus:plexus-utils:jar:2.1:compile
  1033. Created new class realm plugin>org.apache.felix:maven-bundle-plugin:2.3.6
  1034. Importing foreign packages into class realm plugin>org.apache.felix:maven-bundle-plugin:2.3.6
  1035.   Imported:  < project>org.DX_57.osgi.SH_27:SH_27-api:1.0-SNAPSHOT
  1036. Populating class realm plugin>org.apache.felix:maven-bundle-plugin:2.3.6
  1037.   Included: org.apache.felix:maven-bundle-plugin:jar:2.3.6
  1038.   Included: biz.aQute:bndlib:jar:1.50.0
  1039.   Included: org.apache.felix:org.apache.felix.bundlerepository:jar:1.6.6
  1040.   Included: org.osgi:org.osgi.core:jar:4.1.0
  1041.   Included: org.easymock:easymock:jar:2.4
  1042.   Included: org.apache.maven.reporting:maven-reporting-api:jar:2.0.7
  1043.   Included: org.apache.maven.doxia:doxia-sink-api:jar:1.0-alpha-7
  1044.   Included: junit:junit:jar:3.8.1
  1045.   Included: commons-cli:commons-cli:jar:1.0
  1046.   Included: org.codehaus.plexus:plexus-interactivity-api:jar:1.0-alpha-4
  1047.   Included: org.apache.maven:maven-archiver:jar:2.4.1
  1048.   Included: org.codehaus.plexus:plexus-archiver:jar:1.0
  1049.   Included: org.codehaus.plexus:plexus-io:jar:1.0
  1050.   Included: org.codehaus.plexus:plexus-interpolation:jar:1.13
  1051.   Included: org.apache.maven.shared:maven-dependency-tree:jar:1.2
  1052.   Included: org.codehaus.plexus:plexus-utils:jar:2.1
  1053.   Excluded: org.apache.maven:maven-core:jar:2.0.7
  1054.   Excluded: org.apache.maven:maven-settings:jar:2.0.7
  1055.   Excluded: org.apache.maven:maven-plugin-parameter-documenter:jar:2.0.7
  1056.   Excluded: org.apache.maven:maven-profile:jar:2.0.7
  1057.   Excluded: org.apache.maven:maven-model:jar:2.0.7
  1058.   Excluded: org.apache.maven:maven-artifact:jar:2.0.7
  1059.   Excluded: org.codehaus.plexus:plexus-container-default:jar:1.0-alpha-9-stable-1
  1060.   Excluded: org.apache.maven:maven-repository-metadata:jar:2.0.7
  1061.   Excluded: org.apache.maven:maven-error-diagnostics:jar:2.0.7
  1062.   Excluded: org.apache.maven:maven-project:jar:2.0.7
  1063.   Excluded: org.apache.maven:maven-plugin-registry:jar:2.0.7
  1064.   Excluded: org.apache.maven:maven-plugin-api:jar:2.0.7
  1065.   Excluded: org.apache.maven:maven-plugin-descriptor:jar:2.0.7
  1066.   Excluded: org.apache.maven:maven-artifact-manager:jar:2.0.7
  1067.   Excluded: org.apache.maven:maven-monitor:jar:2.0.7
  1068.   Excluded: classworlds:classworlds:jar:1.1
  1069. Configuring mojo org.apache.felix:maven-bundle-plugin:2.3.6:bundle from plugin realm ClassRealm[plugin>org.apache.felix:maven-bundle-plugin:2.3.6, parent: sun.misc.Launcher$AppClassLoader@397577f9]
  1070. Configuring mojo 'org.apache.felix:maven-bundle-plugin:2.3.6:bundle' with basic configurator -->
  1071.   (f) buildDirectory = /home/rcbandit/Desktop/NetBeans/Prototype_3/SH_27/SH_27-api/target
  1072.   (f) instructions = {Bundle-SymbolicName=SH_27-api, Export-Package=org.DX_57.osgi.SH_27.api}
  1073.   (f) m_mavenSession = org.apache.maven.execution.MavenSession@65bd831f
  1074.   (f) manifestLocation = /home/rcbandit/Desktop/NetBeans/Prototype_3/SH_27/SH_27-api/target/classes/META-INF
  1075.   (f) outputDirectory = /home/rcbandit/Desktop/NetBeans/Prototype_3/SH_27/SH_27-api/target/classes
  1076.   (f) project = MavenProject: org.DX_57.osgi.SH_27:SH_27-api:1.0-SNAPSHOT @ /home/rcbandit/Desktop/NetBeans/Prototype_3/SH_27/SH_27-api/pom.xml
  1077. -- end configuration --
  1078. BND Instructions:
  1079. #-----------------------------------------------------------------------
  1080. #Sat Jan 28 22:06:18 EET 2012
  1081. pom.id=org.DX_57.osgi.SH_27\:SH_27-api\:bundle\:1.0-SNAPSHOT
  1082. env.DESKTOP_SESSION=gnome
  1083. env.OLDPWD=/home/rcbandit/Desktop/NetBeans/Prototype_3/SH_27
  1084. file.encoding.pkg=sun.io
  1085. java.home=/opt/jdk1.7.0_02/jre
  1086. env.DISPLAY=\:0.0
  1087. env.XDG_VTNR=1
  1088. pom.contributors=
  1089. project.build.developers=
  1090. classworlds.conf=/home/rcbandit/netbeans-7.0.1/java/maven/bin/m2.conf
  1091. env.XDG_SESSION_COOKIE=353e720329bb1813f71d8e5c0000000a-1327785405.693058-1237082549
  1092. pom.pomFile=/home/rcbandit/Desktop/NetBeans/Prototype_3/SH_27/SH_27-api/pom.xml
  1093. java.endorsed.dirs=/opt/jdk1.7.0_02/jre/lib/endorsed
  1094. project.build.groupId=org.DX_57.osgi.SH_27
  1095. env.LOGNAME=rcbandit
  1096. env.USERNAME=rcbandit
  1097. env.XDG_SEAT=seat0
  1098. env.SESSION_MANAGER=local/unix\:@/tmp/.ICE-unix/1343,unix/unix\:/tmp/.ICE-unix/1343
  1099. sun.os.patch.level=unknown
  1100. java.vendor.url=http\://java.oracle.com/
  1101. pom.profiles=
  1102. maven-symbolicname=org.DX_57.osgi.SH_27.api
  1103. java.version=1.7.0_02
  1104. project.build.contributors=
  1105. java.vendor.url.bug=http\://bugreport.sun.com/bugreport/
  1106. env.GNOME_KEYRING_CONTROL=/tmp/keyring-Yj3bRR
  1107. user.name=rcbandit
  1108. env.LANG=en_US.UTF-8
  1109. env.CVS_RSH=ssh
  1110. project.build.pomFile=/home/rcbandit/Desktop/NetBeans/Prototype_3/SH_27/SH_27-api/pom.xml
  1111. sun.io.unicode.encoding=UnicodeLittle
  1112. sun.jnu.encoding=UTF-8
  1113. env.DBUS_SESSION_BUS_ADDRESS=unix\:abstract\=/tmp/dbus-mFRjLQobMX,guid\=8ae9d800ce549290cbc92d550000001b
  1114. java.runtime.name=Java(TM) SE Runtime Environment
  1115. project.build.outputdirectory=/home/rcbandit/Desktop/NetBeans/Prototype_3/SH_27/SH_27-api/target/classes
  1116. project.version=1.0-SNAPSHOT
  1117. java.specification.name=Java Platform API Specification
  1118. user.timezone=Europe/Sofia
  1119. env.LESSOPEN=||/usr/bin/lesspipe.sh %s
  1120. env.GIO_LAUNCHED_DESKTOP_FILE=/home/rcbandit/.local/share/applications/netbeans-7.0.1.desktop
  1121. pom.mailingLists=
  1122. path.separator=\:
  1123. project.contributors=
  1124. pom.artifactId=SH_27-api
  1125. project.name=SH_27-api
  1126. env.XMODIFIERS=@im\=none
  1127. file.encoding=UTF-8
  1128. pom.url=http\://maven.apache.org
  1129. env.HOME=/home/rcbandit
  1130. sun.java.command=org.codehaus.plexus.classworlds.launcher.Launcher clean install -X
  1131. project.id=org.DX_57.osgi.SH_27\:SH_27-api\:bundle\:1.0-SNAPSHOT
  1132. env.HOSTNAME=Laptop
  1133. Export-Package=org.DX_57.osgi.SH_27.api
  1134. java.io.tmpdir=/tmp
  1135. project.build.mailingLists=
  1136. env.GNOME_KEYRING_PID=1339
  1137. user.language=en
  1138. env.HISTCONTROL=ignoredups
  1139. line.separator=\n
  1140. project.build.directory=/home/rcbandit/Desktop/NetBeans/Prototype_3/SH_27/SH_27-api/target
  1141. env.HISTSIZE=1000
  1142. java.vm.info=mixed mode
  1143. sun.desktop=gnome
  1144. java.vm.specification.name=Java Virtual Machine Specification
  1145. project.build.id=org.DX_57.osgi.SH_27\:SH_27-api\:bundle\:1.0-SNAPSHOT
  1146. project.build.licenses=
  1147. pom.modelVersion=4.0.0
  1148. project.licenses=
  1149. env.GDMSESSION=gnome
  1150. project.developers=
  1151. java.awt.printerjob=sun.print.PSPrinterJob
  1152. project.url=http\://maven.apache.org
  1153. -removeheaders=Include-Resource,Private-Package
  1154. pom.version=1.0-SNAPSHOT
  1155. -plugin=org.apache.felix.bundleplugin.BlueprintPlugin,aQute.lib.spring.SpringXMLType
  1156. project.mailingLists=
  1157. pom.packaging=bundle
  1158. project.build.parent=org.DX_57.osgi.SH_27\:SH_27\:pom\:1.0-SNAPSHOT
  1159. project.projectDirectory=/home/rcbandit/Desktop/NetBeans/Prototype_3/SH_27/SH_27-api
  1160. os.name=Linux
  1161. project.build.modelVersion=4.0.0
  1162. java.specification.vendor=Oracle Corporation
  1163. env.TERM=dumb
  1164. java.vm.name=Java HotSpot(TM) 64-Bit Server VM
  1165. env.QT_IM_MODULE=xim
  1166. java.library.path=/usr/java/packages/lib/amd64\:/usr/lib64\:/lib64\:/lib\:/usr/lib
  1167. project.build.build=org.apache.maven.model.Build@1277b490
  1168. env.PATH=/usr/lib64/ccache\:/usr/local/bin\:/usr/bin\:/bin\:/usr/local/sbin\:/usr/sbin\:/sbin\:/home/rcbandit/.local/bin\:/home/rcbandit/bin
  1169. pom.build=org.apache.maven.model.Build@1277b490
  1170. java.class.version=51.0
  1171. env.SHLVL=2
  1172. project.build.version=1.0-SNAPSHOT
  1173. pom.parent=org.DX_57.osgi.SH_27\:SH_27\:pom\:1.0-SNAPSHOT
  1174. pom.projectDirectory=/home/rcbandit/Desktop/NetBeans/Prototype_3/SH_27/SH_27-api
  1175. project.modelVersion=4.0.0
  1176. Bundle-SymbolicName=SH_27-api
  1177. sun.boot.library.path=/opt/jdk1.7.0_02/jre/lib/amd64
  1178. Private-Package=org.DX_57.osgi.SH_27.api;-split-package\:\=merge-first
  1179. project.build.artifactId=SH_27-api
  1180. sun.management.compiler=HotSpot 64-Bit Tiered Compilers
  1181. java.awt.graphicsenv=sun.awt.X11GraphicsEnvironment
  1182. pom.name=SH_27-api
  1183. env.USER=rcbandit
  1184. pom.developers=
  1185. project.build=org.apache.maven.model.Build@1277b490
  1186. project.baseDir=/home/rcbandit/Desktop/NetBeans/Prototype_3/SH_27/SH_27-api
  1187. project.build.name=SH_27-api
  1188. java.vm.specification.version=1.7
  1189. project.groupId=org.DX_57.osgi.SH_27
  1190. Bundle-Version=1.0.0.SNAPSHOT
  1191. env.NLSPATH=/usr/dt/lib/nls/msg/%L/%N.cat
  1192. awt.toolkit=sun.awt.X11.XToolkit
  1193. project.build.profiles=
  1194. sun.cpu.isalist=
  1195. project.profiles=
  1196. java.ext.dirs=/opt/jdk1.7.0_02/jre/lib/ext\:/usr/java/packages/lib/ext
  1197. Import-Package=*
  1198. os.version=3.2.2-1.fc16.x86_64
  1199. user.home=/home/rcbandit
  1200. java.vm.vendor=Oracle Corporation
  1201. env.JAVA_HOME=/opt/jdk1.7.0_02
  1202. env.XDG_SESSION_ID=2
  1203. env.XAUTHORITY=/var/run/gdm/auth-for-rcbandit-ZIWsIN/database
  1204. user.dir=/home/rcbandit/Desktop/NetBeans/Prototype_3/SH_27
  1205. env.XFILESEARCHPATH=/usr/dt/app-defaults/%L/Dt
  1206. env.WINDOWPATH=1
  1207. env.MAIL=/var/spool/mail/rcbandit
  1208. env.PWD=/home/rcbandit/Desktop/NetBeans/Prototype_3/SH_27
  1209. project.parent=org.DX_57.osgi.SH_27\:SH_27\:pom\:1.0-SNAPSHOT
  1210. sun.cpu.endian=little
  1211. env.NB_EXEC_MAVEN_PROCESS_UUID=5919535d-c3e3-4e9c-bbce-644b074a4a89
  1212. project.dir=/home/rcbandit/Desktop/NetBeans/Prototype_3/SH_27/SH_27-api
  1213. pom.licenses=
  1214. classifier=
  1215. java.vm.version=22.0-b10
  1216. java.class.path=/home/rcbandit/netbeans-7.0.1/java/maven/boot/plexus-classworlds-2.4.jar
  1217. os.arch=amd64
  1218. project.build.url=http\://maven.apache.org
  1219. project.build.projectDirectory=/home/rcbandit/Desktop/NetBeans/Prototype_3/SH_27/SH_27-api
  1220. env.GIO_LAUNCHED_DESKTOP_FILE_PID=3073
  1221. sun.java.launcher=SUN_STANDARD
  1222. env.IMSETTINGS_INTEGRATE_DESKTOP=yes
  1223. project.packaging=bundle
  1224. java.vm.specification.vendor=Oracle Corporation
  1225. file.separator=/
  1226. env.CCACHE_HASHDIR=
  1227. java.runtime.version=1.7.0_02-b13
  1228. project.pomFile=/home/rcbandit/Desktop/NetBeans/Prototype_3/SH_27/SH_27-api/pom.xml
  1229. env.SSH_AUTH_SOCK=/tmp/keyring-Yj3bRR/ssh
  1230. sun.boot.class.path=/opt/jdk1.7.0_02/jre/lib/resources.jar\:/opt/jdk1.7.0_02/jre/lib/rt.jar\:/opt/jdk1.7.0_02/jre/lib/sunrsasign.jar\:/opt/jdk1.7.0_02/jre/lib/jsse.jar\:/opt/jdk1.7.0_02/jre/lib/jce.jar\:/opt/jdk1.7.0_02/jre/lib/charsets.jar\:/opt/jdk1.7.0_02/jre/classes
  1231. project.build.packaging=bundle
  1232. env.XDG_RUNTIME_DIR=/run/user/rcbandit
  1233. project.artifactId=SH_27-api
  1234. user.country=US
  1235. env.J2D_PIXMAPS=shared
  1236. maven.home=/home/rcbandit/netbeans-7.0.1/java/maven
  1237. env.SHELL=/bin/bash
  1238. -sourcepath=/home/rcbandit/Desktop/NetBeans/Prototype_3/SH_27/SH_27-api/src/main/java
  1239. pom.groupId=org.DX_57.osgi.SH_27
  1240. java.vendor=Oracle Corporation
  1241. env.GPG_AGENT_INFO=/tmp/keyring-Yj3bRR/gpg\:0\:1
  1242. env.IMSETTINGS_MODULE=none
  1243. Bundle-Name=SH_27-api
  1244. java.specification.version=1.7
  1245. env.GNOME_DESKTOP_SESSION_ID=this-is-deprecated
  1246. sun.arch.data.model=64
  1247. #-----------------------------------------------------------------------
  1248.  
  1249. BND Classpath:
  1250. #-----------------------------------------------------------------------
  1251. -classpath:\
  1252.  /home/rcbandit/Desktop/NetBeans/Prototype_3/SH_27/SH_27-api/target/classes,\
  1253.  /home/rcbandit/.m2/repository/org/apache/felix/org.osgi.core/1.0.0/org.osgi.core-1.0.0.jar
  1254. #-----------------------------------------------------------------------
  1255.  
  1256. BND Manifest:
  1257. #-----------------------------------------------------------------------
  1258. Manifest-Version: 1.0
  1259. Bnd-LastModified: 1327781178546
  1260. Bundle-ManifestVersion: 2
  1261. Bundle-Name: SH_27-api
  1262. Bundle-SymbolicName: SH_27-api
  1263. Bundle-Version: 1.0.0.SNAPSHOT
  1264. Created-By: 1.7.0_02 (Oracle Corporation)
  1265. Export-Package: org.DX_57.osgi.SH_27.api;version="1.0.0.SNAPSHOT"
  1266. Tool: Bnd-1.50.0
  1267. #-----------------------------------------------------------------------
  1268.  
  1269. Final Manifest:
  1270. #-----------------------------------------------------------------------
  1271. Manifest-Version: 1.0
  1272. Bnd-LastModified: 1327781178546
  1273. Build-Jdk: 1.7.0_02
  1274. Built-By: rcbandit
  1275. Bundle-ManifestVersion: 2
  1276. Bundle-Name: SH_27-api
  1277. Bundle-SymbolicName: SH_27-api
  1278. Bundle-Version: 1.0.0.SNAPSHOT
  1279. Created-By: Apache Maven Bundle Plugin
  1280. Export-Package: org.DX_57.osgi.SH_27.api;version="1.0.0.SNAPSHOT"
  1281. Tool: Bnd-1.50.0
  1282. #-----------------------------------------------------------------------
  1283.  
  1284.  
  1285. [install:install]
  1286. org.apache.maven.plugins:maven-install-plugin:jar:2.3.1:
  1287.    org.apache.maven:maven-plugin-api:jar:2.0.6:compile
  1288.    org.apache.maven:maven-project:jar:2.0.6:compile
  1289.       org.apache.maven:maven-settings:jar:2.0.6:compile
  1290.       org.apache.maven:maven-profile:jar:2.0.6:compile
  1291.       org.apache.maven:maven-plugin-registry:jar:2.0.6:compile
  1292.       org.codehaus.plexus:plexus-container-default:jar:1.0-alpha-9-stable-1:compile
  1293.          junit:junit:jar:3.8.1:compile
  1294.          classworlds:classworlds:jar:1.1-alpha-2:compile
  1295.    org.apache.maven:maven-model:jar:2.0.6:compile
  1296.    org.apache.maven:maven-artifact-manager:jar:2.0.6:compile
  1297.       org.apache.maven:maven-repository-metadata:jar:2.0.6:compile
  1298.    org.apache.maven:maven-artifact:jar:2.0.6:compile
  1299.    org.codehaus.plexus:plexus-utils:jar:2.0.5:compile
  1300.    org.codehaus.plexus:plexus-digest:jar:1.0:compile
  1301. Created new class realm plugin>org.apache.maven.plugins:maven-install-plugin:2.3.1-134304554
  1302. Importing foreign packages into class realm plugin>org.apache.maven.plugins:maven-install-plugin:2.3.1-134304554
  1303.   Imported:  < project>org.DX_57.osgi.SH_27:SH_27-api:1.0-SNAPSHOT
  1304. Populating class realm plugin>org.apache.maven.plugins:maven-install-plugin:2.3.1-134304554
  1305.   Included: org.apache.maven.plugins:maven-install-plugin:jar:2.3.1
  1306.   Included: junit:junit:jar:3.8.1
  1307.   Included: org.codehaus.plexus:plexus-utils:jar:2.0.5
  1308.   Included: org.codehaus.plexus:plexus-digest:jar:1.0
  1309.   Excluded: org.apache.maven:maven-plugin-api:jar:2.0.6
  1310.   Excluded: org.apache.maven:maven-project:jar:2.0.6
  1311.   Excluded: org.apache.maven:maven-settings:jar:2.0.6
  1312.   Excluded: org.apache.maven:maven-profile:jar:2.0.6
  1313.   Excluded: org.apache.maven:maven-plugin-registry:jar:2.0.6
  1314.   Excluded: org.codehaus.plexus:plexus-container-default:jar:1.0-alpha-9-stable-1
  1315.   Excluded: classworlds:classworlds:jar:1.1-alpha-2
  1316.   Excluded: org.apache.maven:maven-model:jar:2.0.6
  1317.   Excluded: org.apache.maven:maven-artifact-manager:jar:2.0.6
  1318.   Excluded: org.apache.maven:maven-repository-metadata:jar:2.0.6
  1319.   Excluded: org.apache.maven:maven-artifact:jar:2.0.6
  1320. Configuring mojo org.apache.maven.plugins:maven-install-plugin:2.3.1:install from plugin realm ClassRealm[plugin>org.apache.maven.plugins:maven-install-plugin:2.3.1-134304554, parent: sun.misc.Launcher$AppClassLoader@397577f9]
  1321. Configuring mojo 'org.apache.maven.plugins:maven-install-plugin:2.3.1:install' with basic configurator -->
  1322.   (f) artifact = org.DX_57.osgi.SH_27:SH_27-api:bundle:1.0-SNAPSHOT
  1323.   (f) attachedArtifacts = []
  1324.   (f) createChecksum = false
  1325.   (f) localRepository =        id: local
  1326.       url: file:///home/rcbandit/.m2/repository/
  1327.    layout: none
  1328.  
  1329.   (f) packaging = bundle
  1330.   (f) pomFile = /home/rcbandit/Desktop/NetBeans/Prototype_3/SH_27/SH_27-api/pom.xml
  1331.   (f) updateReleaseInfo = false
  1332. -- end configuration --
  1333. Installing /home/rcbandit/Desktop/NetBeans/Prototype_3/SH_27/SH_27-api/target/SH_27-api-1.0-SNAPSHOT.jar to /home/rcbandit/.m2/repository/org/DX_57/osgi/SH_27/SH_27-api/1.0-SNAPSHOT/SH_27-api-1.0-SNAPSHOT.jar
  1334. Installing /home/rcbandit/Desktop/NetBeans/Prototype_3/SH_27/SH_27-api/pom.xml to /home/rcbandit/.m2/repository/org/DX_57/osgi/SH_27/SH_27-api/1.0-SNAPSHOT/SH_27-api-1.0-SNAPSHOT.pom
  1335. Installing org.DX_57.osgi.SH_27:SH_27-api:1.0-SNAPSHOT/maven-metadata.xml to /home/rcbandit/.m2/repository/org/DX_57/osgi/SH_27/SH_27-api/1.0-SNAPSHOT/maven-metadata-local.xml
  1336. Installing org.DX_57.osgi.SH_27:SH_27-api/maven-metadata.xml to /home/rcbandit/.m2/repository/org/DX_57/osgi/SH_27/SH_27-api/maven-metadata-local.xml
  1337.  
  1338. [bundle:install]
  1339. Configuring mojo org.apache.felix:maven-bundle-plugin:2.3.6:install from plugin realm ClassRealm[plugin>org.apache.felix:maven-bundle-plugin:2.3.6, parent: sun.misc.Launcher$AppClassLoader@397577f9]
  1340. Configuring mojo 'org.apache.felix:maven-bundle-plugin:2.3.6:install' with basic configurator -->
  1341.   (f) attachedArtifacts = []
  1342.   (f) localRepository =        id: local
  1343.       url: file:///home/rcbandit/.m2/repository/
  1344.    layout: none
  1345.  
  1346.   (f) project = MavenProject: org.DX_57.osgi.SH_27:SH_27-api:1.0-SNAPSHOT @ /home/rcbandit/Desktop/NetBeans/Prototype_3/SH_27/SH_27-api/pom.xml
  1347. -- end configuration --
  1348.  (f) repositoryXml = file:/home/rcbandit/.m2/repository/repository.xml
  1349.  (f) bundleJar = file:/home/rcbandit/.m2/repository/org/DX_57/osgi/SH_27/SH_27-api/1.0-SNAPSHOT/SH_27-api-1.0-SNAPSHOT.jar
  1350.  (f) sourceJar = null
  1351.  (f) docJar = null
  1352.  (f) obrXml = null
  1353. Installing org/DX_57/osgi/SH_27/SH_27-api/1.0-SNAPSHOT/SH_27-api-1.0-SNAPSHOT.jar
  1354. Writing OBR metadata
  1355.                                                                        
  1356. ------------------------------------------------------------------------
  1357. Building SH_27-impl 1.0-SNAPSHOT
  1358. ------------------------------------------------------------------------
  1359. Resolving plugin version for org.apache.maven.plugins:maven-install-plugin
  1360. Could not find metadata org.apache.maven.plugins:maven-install-plugin/maven-metadata.xml in local (/home/rcbandit/.m2/repository)
  1361. Skipped remote update check for org.apache.maven.plugins:maven-install-plugin/maven-metadata.xml, locally cached metadata up-to-date.
  1362. Resolved plugin version for org.apache.maven.plugins:maven-install-plugin to 2.3.1 from repository central (http://repo1.maven.org/maven2, releases)
  1363. Resolving plugin version for org.apache.maven.plugins:maven-resources-plugin
  1364. Could not find metadata org.apache.maven.plugins:maven-resources-plugin/maven-metadata.xml in local (/home/rcbandit/.m2/repository)
  1365. Skipped remote update check for org.apache.maven.plugins:maven-resources-plugin/maven-metadata.xml, locally cached metadata up-to-date.
  1366. Resolved plugin version for org.apache.maven.plugins:maven-resources-plugin to 2.5 from repository central (http://repo1.maven.org/maven2, releases)
  1367. Resolving plugin version for org.apache.maven.plugins:maven-surefire-plugin
  1368. Could not find metadata org.apache.maven.plugins:maven-surefire-plugin/maven-metadata.xml in local (/home/rcbandit/.m2/repository)
  1369. Skipped remote update check for org.apache.maven.plugins:maven-surefire-plugin/maven-metadata.xml, locally cached metadata up-to-date.
  1370. Resolved plugin version for org.apache.maven.plugins:maven-surefire-plugin to 2.11 from repository central (http://repo1.maven.org/maven2, releases)
  1371. Resolving plugin version for org.apache.maven.plugins:maven-deploy-plugin
  1372. Could not find metadata org.apache.maven.plugins:maven-deploy-plugin/maven-metadata.xml in local (/home/rcbandit/.m2/repository)
  1373. Skipped remote update check for org.apache.maven.plugins:maven-deploy-plugin/maven-metadata.xml, locally cached metadata up-to-date.
  1374. Resolved plugin version for org.apache.maven.plugins:maven-deploy-plugin to 2.7 from repository central (http://repo1.maven.org/maven2, releases)
  1375. Lifecycle default -> [validate, initialize, generate-sources, process-sources, generate-resources, process-resources, compile, process-classes, generate-test-sources, process-test-sources, generate-test-resources, process-test-resources, test-compile, process-test-classes, test, prepare-package, package, pre-integration-test, integration-test, post-integration-test, verify, install, deploy]
  1376. Lifecycle clean -> [pre-clean, clean, post-clean]
  1377. Lifecycle site -> [pre-site, site, post-site, site-deploy]
  1378. Lifecycle default -> [validate, initialize, generate-sources, process-sources, generate-resources, process-resources, compile, process-classes, generate-test-sources, process-test-sources, generate-test-resources, process-test-resources, test-compile, process-test-classes, test, prepare-package, package, pre-integration-test, integration-test, post-integration-test, verify, install, deploy]
  1379. Lifecycle clean -> [pre-clean, clean, post-clean]
  1380. Lifecycle site -> [pre-site, site, post-site, site-deploy]
  1381. Lifecycle default -> [validate, initialize, generate-sources, process-sources, generate-resources, process-resources, compile, process-classes, generate-test-sources, process-test-sources, generate-test-resources, process-test-resources, test-compile, process-test-classes, test, prepare-package, package, pre-integration-test, integration-test, post-integration-test, verify, install, deploy]
  1382. Lifecycle clean -> [pre-clean, clean, post-clean]
  1383. Lifecycle site -> [pre-site, site, post-site, site-deploy]
  1384. Lifecycle default -> [validate, initialize, generate-sources, process-sources, generate-resources, process-resources, compile, process-classes, generate-test-sources, process-test-sources, generate-test-resources, process-test-resources, test-compile, process-test-classes, test, prepare-package, package, pre-integration-test, integration-test, post-integration-test, verify, install, deploy]
  1385. Lifecycle clean -> [pre-clean, clean, post-clean]
  1386. Lifecycle site -> [pre-site, site, post-site, site-deploy]
  1387. Lifecycle default -> [validate, initialize, generate-sources, process-sources, generate-resources, process-resources, compile, process-classes, generate-test-sources, process-test-sources, generate-test-resources, process-test-resources, test-compile, process-test-classes, test, prepare-package, package, pre-integration-test, integration-test, post-integration-test, verify, install, deploy]
  1388. Lifecycle clean -> [pre-clean, clean, post-clean]
  1389. Lifecycle site -> [pre-site, site, post-site, site-deploy]
  1390. Lifecycle default -> [validate, initialize, generate-sources, process-sources, generate-resources, process-resources, compile, process-classes, generate-test-sources, process-test-sources, generate-test-resources, process-test-resources, test-compile, process-test-classes, test, prepare-package, package, pre-integration-test, integration-test, post-integration-test, verify, install, deploy]
  1391. Lifecycle clean -> [pre-clean, clean, post-clean]
  1392. Lifecycle site -> [pre-site, site, post-site, site-deploy]
  1393. Lifecycle default -> [validate, initialize, generate-sources, process-sources, generate-resources, process-resources, compile, process-classes, generate-test-sources, process-test-sources, generate-test-resources, process-test-resources, test-compile, process-test-classes, test, prepare-package, package, pre-integration-test, integration-test, post-integration-test, verify, install, deploy]
  1394. Lifecycle clean -> [pre-clean, clean, post-clean]
  1395. Lifecycle site -> [pre-site, site, post-site, site-deploy]
  1396. Lifecycle default -> [validate, initialize, generate-sources, process-sources, generate-resources, process-resources, compile, process-classes, generate-test-sources, process-test-sources, generate-test-resources, process-test-resources, test-compile, process-test-classes, test, prepare-package, package, pre-integration-test, integration-test, post-integration-test, verify, install, deploy]
  1397. Lifecycle clean -> [pre-clean, clean, post-clean]
  1398. Lifecycle site -> [pre-site, site, post-site, site-deploy]
  1399. Lifecycle default -> [validate, initialize, generate-sources, process-sources, generate-resources, process-resources, compile, process-classes, generate-test-sources, process-test-sources, generate-test-resources, process-test-resources, test-compile, process-test-classes, test, prepare-package, package, pre-integration-test, integration-test, post-integration-test, verify, install, deploy]
  1400. Lifecycle clean -> [pre-clean, clean, post-clean]
  1401. Lifecycle site -> [pre-site, site, post-site, site-deploy]
  1402. Lifecycle default -> [validate, initialize, generate-sources, process-sources, generate-resources, process-resources, compile, process-classes, generate-test-sources, process-test-sources, generate-test-resources, process-test-resources, test-compile, process-test-classes, test, prepare-package, package, pre-integration-test, integration-test, post-integration-test, verify, install, deploy]
  1403. Lifecycle clean -> [pre-clean, clean, post-clean]
  1404. Lifecycle site -> [pre-site, site, post-site, site-deploy]
  1405. === PROJECT BUILD PLAN ================================================
  1406. Project:       org.DX_57.osgi.SH_27:SH_27-impl:1.0-SNAPSHOT
  1407. Dependencies (collect): []
  1408. Dependencies (resolve): [compile, test]
  1409. Repositories (dependencies): [central (http://repo1.maven.org/maven2, releases)]
  1410. Repositories (plugins)     : [central (http://repo1.maven.org/maven2, releases)]
  1411. -----------------------------------------------------------------------
  1412. Goal:          org.apache.maven.plugins:maven-clean-plugin:2.4.1:clean (default-clean)
  1413. Style:         Regular
  1414. Configuration: <?xml version="1.0" encoding="UTF-8"?>
  1415. <configuration>
  1416.   <directory default-value="${project.build.directory}"/>
  1417.   <excludeDefaultDirectories default-value="false">${clean.excludeDefaultDirectories}</excludeDefaultDirectories>
  1418.   <failOnError default-value="true">${maven.clean.failOnError}</failOnError>
  1419.   <followSymLinks default-value="false">${clean.followSymLinks}</followSymLinks>
  1420.   <outputDirectory default-value="${project.build.outputDirectory}"/>
  1421.   <reportDirectory default-value="${project.reporting.outputDirectory}"/>
  1422.   <skip default-value="false">${clean.skip}</skip>
  1423.   <testOutputDirectory default-value="${project.build.testOutputDirectory}"/>
  1424.   <verbose>${clean.verbose}</verbose>
  1425. </configuration>
  1426. -----------------------------------------------------------------------
  1427. Goal:          org.apache.maven.plugins:maven-resources-plugin:2.5:resources (default-resources)
  1428. Style:         Regular
  1429. Configuration: <?xml version="1.0" encoding="UTF-8"?>
  1430. <configuration>
  1431.   <buildFilters default-value="${project.build.filters}"/>
  1432.   <encoding default-value="${project.build.sourceEncoding}">${encoding}</encoding>
  1433.   <escapeString>${maven.resources.escapeString}</escapeString>
  1434.   <escapeWindowsPaths default-value="true">${maven.resources.escapeWindowsPaths}</escapeWindowsPaths>
  1435.   <includeEmptyDirs default-value="false">${maven.resources.includeEmptyDirs}</includeEmptyDirs>
  1436.   <outputDirectory default-value="${project.build.outputDirectory}"/>
  1437.   <overwrite default-value="false">${maven.resources.overwrite}</overwrite>
  1438.   <project default-value="${project}"/>
  1439.   <resources default-value="${project.resources}"/>
  1440.   <session default-value="${session}"/>
  1441.   <supportMultiLineFiltering default-value="false">${maven.resources.supportMultiLineFiltering}</supportMultiLineFiltering>
  1442.   <useBuildFilters default-value="true"/>
  1443.   <useDefaultDelimiters default-value="true"/>
  1444. </configuration>
  1445. -----------------------------------------------------------------------
  1446. Goal:          org.apache.maven.plugins:maven-compiler-plugin:2.3.2:compile (default-compile)
  1447. Style:         Regular
  1448. Configuration: <?xml version="1.0" encoding="UTF-8"?>
  1449. <configuration>
  1450.   <basedir default-value="${basedir}"/>
  1451.   <buildDirectory default-value="${project.build.directory}"/>
  1452.   <classpathElements default-value="${project.compileClasspathElements}"/>
  1453.   <compileSourceRoots default-value="${project.compileSourceRoots}"/>
  1454.   <compilerId default-value="javac">${maven.compiler.compilerId}</compilerId>
  1455.   <compilerVersion>${maven.compiler.compilerVersion}</compilerVersion>
  1456.   <debug default-value="true">${maven.compiler.debug}</debug>
  1457.   <debuglevel>${maven.compiler.debuglevel}</debuglevel>
  1458.   <encoding default-value="${project.build.sourceEncoding}">${encoding}</encoding>
  1459.   <executable>${maven.compiler.executable}</executable>
  1460.   <failOnError default-value="true">${maven.compiler.failOnError}</failOnError>
  1461.   <fork default-value="false">${maven.compiler.fork}</fork>
  1462.   <generatedSourcesDirectory default-value="${project.build.directory}/generated-sources/annotations"/>
  1463.   <maxmem>${maven.compiler.maxmem}</maxmem>
  1464.   <meminitial>${maven.compiler.meminitial}</meminitial>
  1465.   <optimize default-value="false">${maven.compiler.optimize}</optimize>
  1466.   <outputDirectory default-value="${project.build.outputDirectory}"/>
  1467.   <outputFileName>${project.build.finalName}</outputFileName>
  1468.   <projectArtifact default-value="${project.artifact}"/>
  1469.   <session default-value="${session}"/>
  1470.   <showDeprecation default-value="false">${maven.compiler.showDeprecation}</showDeprecation>
  1471.   <showWarnings default-value="false">${maven.compiler.showWarnings}</showWarnings>
  1472.   <source default-value="1.5">1.7</source>
  1473.   <staleMillis default-value="0">${lastModGranularityMs}</staleMillis>
  1474.   <target default-value="1.5">1.7</target>
  1475.   <verbose default-value="false">${maven.compiler.verbose}</verbose>
  1476. </configuration>
  1477. -----------------------------------------------------------------------
  1478. Goal:          org.apache.maven.plugins:maven-resources-plugin:2.5:testResources (default-testResources)
  1479. Style:         Regular
  1480. Configuration: <?xml version="1.0" encoding="UTF-8"?>
  1481. <configuration>
  1482.   <buildFilters default-value="${project.build.filters}"/>
  1483.   <encoding default-value="${project.build.sourceEncoding}">${encoding}</encoding>
  1484.   <escapeString>${maven.resources.escapeString}</escapeString>
  1485.   <escapeWindowsPaths default-value="true">${maven.resources.escapeWindowsPaths}</escapeWindowsPaths>
  1486.   <includeEmptyDirs default-value="false">${maven.resources.includeEmptyDirs}</includeEmptyDirs>
  1487.   <outputDirectory>${project.build.testOutputDirectory}</outputDirectory>
  1488.   <overwrite default-value="false">${maven.resources.overwrite}</overwrite>
  1489.   <project default-value="${project}"/>
  1490.   <resources>${project.testResources}</resources>
  1491.   <session default-value="${session}"/>
  1492.   <supportMultiLineFiltering default-value="false">${maven.resources.supportMultiLineFiltering}</supportMultiLineFiltering>
  1493.   <useBuildFilters default-value="true"/>
  1494.   <useDefaultDelimiters default-value="true"/>
  1495. </configuration>
  1496. -----------------------------------------------------------------------
  1497. Goal:          org.apache.maven.plugins:maven-compiler-plugin:2.3.2:testCompile (default-testCompile)
  1498. Style:         Regular
  1499. Configuration: <?xml version="1.0" encoding="UTF-8"?>
  1500. <configuration>
  1501.   <basedir default-value="${basedir}"/>
  1502.   <buildDirectory default-value="${project.build.directory}"/>
  1503.   <classpathElements default-value="${project.testClasspathElements}"/>
  1504.   <compileSourceRoots default-value="${project.testCompileSourceRoots}"/>
  1505.   <compilerId default-value="javac">${maven.compiler.compilerId}</compilerId>
  1506.   <compilerVersion>${maven.compiler.compilerVersion}</compilerVersion>
  1507.   <debug default-value="true">${maven.compiler.debug}</debug>
  1508.   <debuglevel>${maven.compiler.debuglevel}</debuglevel>
  1509.   <encoding default-value="${project.build.sourceEncoding}">${encoding}</encoding>
  1510.   <executable>${maven.compiler.executable}</executable>
  1511.   <failOnError default-value="true">${maven.compiler.failOnError}</failOnError>
  1512.   <fork default-value="false">${maven.compiler.fork}</fork>
  1513.   <generatedTestSourcesDirectory default-value="${project.build.directory}/generated-sources/test-annotations"/>
  1514.   <maxmem>${maven.compiler.maxmem}</maxmem>
  1515.   <meminitial>${maven.compiler.meminitial}</meminitial>
  1516.   <optimize default-value="false">${maven.compiler.optimize}</optimize>
  1517.   <outputDirectory default-value="${project.build.testOutputDirectory}"/>
  1518.   <outputFileName>${project.build.finalName}</outputFileName>
  1519.   <session default-value="${session}"/>
  1520.   <showDeprecation default-value="false">${maven.compiler.showDeprecation}</showDeprecation>
  1521.   <showWarnings default-value="false">${maven.compiler.showWarnings}</showWarnings>
  1522.   <skip>${maven.test.skip}</skip>
  1523.   <source default-value="1.5">1.7</source>
  1524.   <staleMillis default-value="0">${lastModGranularityMs}</staleMillis>
  1525.   <target default-value="1.5">1.7</target>
  1526.   <testSource>${maven.compiler.testSource}</testSource>
  1527.   <testTarget>${maven.compiler.testTarget}</testTarget>
  1528.   <verbose default-value="false">${maven.compiler.verbose}</verbose>
  1529. </configuration>
  1530. -----------------------------------------------------------------------
  1531. Goal:          org.apache.maven.plugins:maven-surefire-plugin:2.11:test (default-test)
  1532. Style:         Regular
  1533. Configuration: <?xml version="1.0" encoding="UTF-8"?>
  1534. <configuration>
  1535.   <argLine>${argLine}</argLine>
  1536.   <basedir default-value="${basedir}"/>
  1537.   <childDelegation default-value="false">${childDelegation}</childDelegation>
  1538.   <classesDirectory default-value="${project.build.outputDirectory}"/>
  1539.   <debugForkedProcess>${maven.surefire.debug}</debugForkedProcess>
  1540.   <disableXmlReport default-value="false">${disableXmlReport}</disableXmlReport>
  1541.   <enableAssertions default-value="true">${enableAssertions}</enableAssertions>
  1542.   <excludedGroups>${excludedGroups}</excludedGroups>
  1543.   <failIfNoTests>${failIfNoTests}</failIfNoTests>
  1544.   <forkMode default-value="once">${forkMode}</forkMode>
  1545.   <forkedProcessTimeoutInSeconds>${surefire.timeout}</forkedProcessTimeoutInSeconds>
  1546.   <groups>${groups}</groups>
  1547.   <junitArtifactName default-value="junit:junit">${junitArtifactName}</junitArtifactName>
  1548.   <jvm>${jvm}</jvm>
  1549.   <localRepository>${localRepository}</localRepository>
  1550.   <objectFactory>${objectFactory}</objectFactory>
  1551.   <parallel>${parallel}</parallel>
  1552.   <parallelMavenExecution default-value="${session.parallel}"/>
  1553.   <perCoreThreadCount default-value="true">${perCoreThreadCount}</perCoreThreadCount>
  1554.   <pluginArtifactMap>${plugin.artifactMap}</pluginArtifactMap>
  1555.   <printSummary default-value="true">${surefire.printSummary}</printSummary>
  1556.   <project default-value="${project}"/>
  1557.   <projectArtifactMap>${project.artifactMap}</projectArtifactMap>
  1558.   <redirectTestOutputToFile default-value="false">${maven.test.redirectTestOutputToFile}</redirectTestOutputToFile>
  1559.   <remoteRepositories>${project.pluginArtifactRepositories}</remoteRepositories>
  1560.   <reportFormat default-value="brief">${surefire.reportFormat}</reportFormat>
  1561.   <reportNameSuffix default-value="">${surefire.reportNameSuffix}</reportNameSuffix>
  1562.   <reportsDirectory default-value="${project.build.directory}/surefire-reports"/>
  1563.   <runOrder default-value="filesystem"/>
  1564.   <session>${session}</session>
  1565.   <skip default-value="false">${maven.test.skip}</skip>
  1566.   <skipExec>${maven.test.skip.exec}</skipExec>
  1567.   <skipTests default-value="false">${skipTests}</skipTests>
  1568.   <test>${test}</test>
  1569.   <testClassesDirectory default-value="${project.build.testOutputDirectory}"/>
  1570.   <testFailureIgnore default-value="false">${maven.test.failure.ignore}</testFailureIgnore>
  1571.   <testNGArtifactName default-value="org.testng:testng">${testNGArtifactName}</testNGArtifactName>
  1572.   <testSourceDirectory default-value="${project.build.testSourceDirectory}"/>
  1573.   <threadCount>${threadCount}</threadCount>
  1574.   <trimStackTrace default-value="true">${trimStackTrace}</trimStackTrace>
  1575.   <useFile default-value="true">${surefire.useFile}</useFile>
  1576.   <useManifestOnlyJar default-value="true">${surefire.useManifestOnlyJar}</useManifestOnlyJar>
  1577.   <useSystemClassLoader default-value="true">${surefire.useSystemClassLoader}</useSystemClassLoader>
  1578.   <useUnlimitedThreads default-value="false">${useUnlimitedThreads}</useUnlimitedThreads>
  1579.   <workingDirectory>${basedir}</workingDirectory>
  1580. </configuration>
  1581. -----------------------------------------------------------------------
  1582. Goal:          org.apache.felix:maven-bundle-plugin:2.3.6:bundle (default-bundle)
  1583. Style:         Regular
  1584. Configuration: <?xml version="1.0" encoding="UTF-8"?>
  1585. <configuration>
  1586.   <buildDirectory>${project.build.directory}</buildDirectory>
  1587.   <dumpClasspath>${dumpClasspath}</dumpClasspath>
  1588.   <dumpInstructions>${dumpInstructions}</dumpInstructions>
  1589.   <excludeDependencies>${excludeDependencies}</excludeDependencies>
  1590.   <instructions>
  1591.     <Import-Package>org.DX_57.osgi.SH_27.api, org.osgi.framework</Import-Package>
  1592.     <Bundle-SymbolicName>SH_27-impl</Bundle-SymbolicName>
  1593.     <Bundle-Activator>org.DX_57.osgi.SH_27.impl.SessionHandleApp</Bundle-Activator>
  1594.   </instructions>
  1595.   <m_mavenSession default-value="${session}"/>
  1596.   <manifestLocation default-value="${project.build.outputDirectory}/META-INF">${manifestLocation}</manifestLocation>
  1597.   <outputDirectory>${project.build.outputDirectory}</outputDirectory>
  1598.   <project>${project}</project>
  1599.   <unpackBundle>${unpackBundle}</unpackBundle>
  1600. </configuration>
  1601. -----------------------------------------------------------------------
  1602. Goal:          org.apache.maven.plugins:maven-install-plugin:2.3.1:install (default-install)
  1603. Style:         Regular
  1604. Configuration: <?xml version="1.0" encoding="UTF-8"?>
  1605. <configuration>
  1606.   <artifact default-value="${project.artifact}"/>
  1607.   <attachedArtifacts default-value="${project.attachedArtifacts}"/>
  1608.   <createChecksum default-value="false">${createChecksum}</createChecksum>
  1609.   <localRepository>${localRepository}</localRepository>
  1610.   <packaging default-value="${project.packaging}"/>
  1611.   <pomFile default-value="${project.file}"/>
  1612.   <updateReleaseInfo default-value="false">${updateReleaseInfo}</updateReleaseInfo>
  1613. </configuration>
  1614. -----------------------------------------------------------------------
  1615. Goal:          org.apache.felix:maven-bundle-plugin:2.3.6:install (default-install)
  1616. Style:         Regular
  1617. Configuration: <?xml version="1.0" encoding="UTF-8"?>
  1618. <configuration>
  1619.   <attachedArtifacts>${project.attachedArtifacts}</attachedArtifacts>
  1620.   <localRepository>${localRepository}</localRepository>
  1621.   <obrRepository>${obrRepository}</obrRepository>
  1622.   <project>${project}</project>
  1623. </configuration>
  1624. =======================================================================
  1625. org.DX_57.osgi.SH_27:SH_27-impl:bundle:1.0-SNAPSHOT
  1626.    junit:junit:jar:3.8.1:test
  1627.    org.apache.felix:org.osgi.core:jar:1.0.0:compile
  1628.    org.DX_57.osgi.SH_27:SH_27-api:jar:1.0-SNAPSHOT:compile
  1629.  
  1630. [clean:clean]
  1631. Configuring mojo org.apache.maven.plugins:maven-clean-plugin:2.4.1:clean from plugin realm ClassRealm[plugin>org.apache.maven.plugins:maven-clean-plugin:2.4.1-1267324105, parent: sun.misc.Launcher$AppClassLoader@397577f9]
  1632. Configuring mojo 'org.apache.maven.plugins:maven-clean-plugin:2.4.1:clean' with basic configurator -->
  1633.   (f) directory = /home/rcbandit/Desktop/NetBeans/Prototype_3/SH_27/SH_27-impl/target
  1634.   (f) excludeDefaultDirectories = false
  1635.   (f) failOnError = true
  1636.   (f) followSymLinks = false
  1637.   (f) outputDirectory = /home/rcbandit/Desktop/NetBeans/Prototype_3/SH_27/SH_27-impl/target/classes
  1638.   (f) reportDirectory = /home/rcbandit/Desktop/NetBeans/Prototype_3/SH_27/SH_27-impl/target/site
  1639.   (f) skip = false
  1640.   (f) testOutputDirectory = /home/rcbandit/Desktop/NetBeans/Prototype_3/SH_27/SH_27-impl/target/test-classes
  1641. -- end configuration --
  1642. Deleting /home/rcbandit/Desktop/NetBeans/Prototype_3/SH_27/SH_27-impl/target
  1643. Deleting file /home/rcbandit/Desktop/NetBeans/Prototype_3/SH_27/SH_27-impl/target/surefire-reports/org.samples.osgi.service.AppTest.txt
  1644. Deleting file /home/rcbandit/Desktop/NetBeans/Prototype_3/SH_27/SH_27-impl/target/surefire-reports/TEST-org.samples.osgi.service.AppTest.xml
  1645. Deleting directory /home/rcbandit/Desktop/NetBeans/Prototype_3/SH_27/SH_27-impl/target/surefire-reports
  1646. Deleting file /home/rcbandit/Desktop/NetBeans/Prototype_3/SH_27/SH_27-impl/target/test-classes/org/samples/osgi/service/AppTest.class
  1647. Deleting directory /home/rcbandit/Desktop/NetBeans/Prototype_3/SH_27/SH_27-impl/target/test-classes/org/samples/osgi/service
  1648. Deleting directory /home/rcbandit/Desktop/NetBeans/Prototype_3/SH_27/SH_27-impl/target/test-classes/org/samples/osgi
  1649. Deleting directory /home/rcbandit/Desktop/NetBeans/Prototype_3/SH_27/SH_27-impl/target/test-classes/org/samples
  1650. Deleting directory /home/rcbandit/Desktop/NetBeans/Prototype_3/SH_27/SH_27-impl/target/test-classes/org
  1651. Deleting directory /home/rcbandit/Desktop/NetBeans/Prototype_3/SH_27/SH_27-impl/target/test-classes
  1652. Deleting directory /home/rcbandit/Desktop/NetBeans/Prototype_3/SH_27/SH_27-impl/target/generated-sources/annotations
  1653. Deleting directory /home/rcbandit/Desktop/NetBeans/Prototype_3/SH_27/SH_27-impl/target/generated-sources/test-annotations
  1654. Deleting directory /home/rcbandit/Desktop/NetBeans/Prototype_3/SH_27/SH_27-impl/target/generated-sources
  1655. Deleting file /home/rcbandit/Desktop/NetBeans/Prototype_3/SH_27/SH_27-impl/target/classes/org/DX_57/osgi/SH_27/impl/SessionHandleImpl.class
  1656. Deleting file /home/rcbandit/Desktop/NetBeans/Prototype_3/SH_27/SH_27-impl/target/classes/org/DX_57/osgi/SH_27/impl/SessionHandleApp.class
  1657. Deleting directory /home/rcbandit/Desktop/NetBeans/Prototype_3/SH_27/SH_27-impl/target/classes/org/DX_57/osgi/SH_27/impl
  1658. Deleting directory /home/rcbandit/Desktop/NetBeans/Prototype_3/SH_27/SH_27-impl/target/classes/org/DX_57/osgi/SH_27
  1659. Deleting directory /home/rcbandit/Desktop/NetBeans/Prototype_3/SH_27/SH_27-impl/target/classes/org/DX_57/osgi
  1660. Deleting directory /home/rcbandit/Desktop/NetBeans/Prototype_3/SH_27/SH_27-impl/target/classes/org/DX_57
  1661. Deleting directory /home/rcbandit/Desktop/NetBeans/Prototype_3/SH_27/SH_27-impl/target/classes/org
  1662. Deleting directory /home/rcbandit/Desktop/NetBeans/Prototype_3/SH_27/SH_27-impl/target/classes
  1663. Deleting file /home/rcbandit/Desktop/NetBeans/Prototype_3/SH_27/SH_27-impl/target/surefire/surefire8955905959864870962tmp
  1664. Deleting file /home/rcbandit/Desktop/NetBeans/Prototype_3/SH_27/SH_27-impl/target/surefire/surefirebooter5109032133655279396.jar
  1665. Deleting file /home/rcbandit/Desktop/NetBeans/Prototype_3/SH_27/SH_27-impl/target/surefire/surefire5298703160124224796tmp
  1666. Deleting directory /home/rcbandit/Desktop/NetBeans/Prototype_3/SH_27/SH_27-impl/target/surefire
  1667. Deleting directory /home/rcbandit/Desktop/NetBeans/Prototype_3/SH_27/SH_27-impl/target
  1668. Skipping non-existing directory /home/rcbandit/Desktop/NetBeans/Prototype_3/SH_27/SH_27-impl/target/classes
  1669. Skipping non-existing directory /home/rcbandit/Desktop/NetBeans/Prototype_3/SH_27/SH_27-impl/target/test-classes
  1670. Skipping non-existing directory /home/rcbandit/Desktop/NetBeans/Prototype_3/SH_27/SH_27-impl/target/site
  1671.  
  1672. [resources:resources]
  1673. Configuring mojo org.apache.maven.plugins:maven-resources-plugin:2.5:resources from plugin realm ClassRealm[plugin>org.apache.maven.plugins:maven-resources-plugin:2.5, parent: sun.misc.Launcher$AppClassLoader@397577f9]
  1674. [debug] execute contextualize
  1675. Configuring mojo 'org.apache.maven.plugins:maven-resources-plugin:2.5:resources' with basic configurator -->
  1676.   (f) buildFilters = []
  1677.   (f) escapeWindowsPaths = true
  1678.   (s) includeEmptyDirs = false
  1679.   (s) outputDirectory = /home/rcbandit/Desktop/NetBeans/Prototype_3/SH_27/SH_27-impl/target/classes
  1680.   (s) overwrite = false
  1681.   (f) project = MavenProject: org.DX_57.osgi.SH_27:SH_27-impl:1.0-SNAPSHOT @ /home/rcbandit/Desktop/NetBeans/Prototype_3/SH_27/SH_27-impl/pom.xml
  1682.   (s) resources = [Resource {targetPath: null, filtering: false, FileSet {directory: /home/rcbandit/Desktop/NetBeans/Prototype_3/SH_27/SH_27-impl/src/main/resources, PatternSet [includes: {}, excludes: {}]}}]
  1683.   (f) session = org.apache.maven.execution.MavenSession@65bd831f
  1684.   (f) supportMultiLineFiltering = false
  1685.   (f) useBuildFilters = true
  1686.   (s) useDefaultDelimiters = true
  1687. -- end configuration --
  1688. properties used {java.vendor=Oracle Corporation, env.SESSION_MANAGER=local/unix:@/tmp/.ICE-unix/1343,unix/unix:/tmp/.ICE-unix/1343, env.LESSOPEN=||/usr/bin/lesspipe.sh %s, sun.java.launcher=SUN_STANDARD, env.QT_IM_MODULE=xim, sun.management.compiler=HotSpot 64-Bit Tiered Compilers, os.name=Linux, sun.boot.class.path=/opt/jdk1.7.0_02/jre/lib/resources.jar:/opt/jdk1.7.0_02/jre/lib/rt.jar:/opt/jdk1.7.0_02/jre/lib/sunrsasign.jar:/opt/jdk1.7.0_02/jre/lib/jsse.jar:/opt/jdk1.7.0_02/jre/lib/jce.jar:/opt/jdk1.7.0_02/jre/lib/charsets.jar:/opt/jdk1.7.0_02/jre/classes, env.PWD=/home/rcbandit/Desktop/NetBeans/Prototype_3/SH_27, env.XDG_SESSION_COOKIE=353e720329bb1813f71d8e5c0000000a-1327785405.693058-1237082549, sun.desktop=gnome, env.LANG=en_US.UTF-8, java.vm.specification.vendor=Oracle Corporation, java.runtime.version=1.7.0_02-b13, env.HISTSIZE=1000, env.XDG_VTNR=1, env.DISPLAY=:0.0, user.name=rcbandit, env.USER=rcbandit, env.HISTCONTROL=ignoredups, env.SHELL=/bin/bash, env.DESKTOP_SESSION=gnome, env.NLSPATH=/usr/dt/lib/nls/msg/%L/%N.cat, env.PATH=/usr/lib64/ccache:/usr/local/bin:/usr/bin:/bin:/usr/local/sbin:/usr/sbin:/sbin:/home/rcbandit/.local/bin:/home/rcbandit/bin, user.language=en, env.IMSETTINGS_MODULE=none, sun.boot.library.path=/opt/jdk1.7.0_02/jre/lib/amd64, classworlds.conf=/home/rcbandit/netbeans-7.0.1/java/maven/bin/m2.conf, java.version=1.7.0_02, user.timezone=Europe/Sofia, env.DBUS_SESSION_BUS_ADDRESS=unix:abstract=/tmp/dbus-mFRjLQobMX,guid=8ae9d800ce549290cbc92d550000001b, sun.arch.data.model=64, java.endorsed.dirs=/opt/jdk1.7.0_02/jre/lib/endorsed, sun.cpu.isalist=, sun.jnu.encoding=UTF-8, file.encoding.pkg=sun.io, env.SHLVL=2, file.separator=/, env.HOSTNAME=Laptop, java.specification.name=Java Platform API Specification, env.IMSETTINGS_INTEGRATE_DESKTOP=yes, env.GNOME_DESKTOP_SESSION_ID=this-is-deprecated, java.class.version=51.0, env.GDMSESSION=gnome, user.country=US, env.GNOME_KEYRING_PID=1339, java.home=/opt/jdk1.7.0_02/jre, java.vm.info=mixed mode, env.LOGNAME=rcbandit, os.version=3.2.2-1.fc16.x86_64, path.separator=:, java.vm.version=22.0-b10, env.JAVA_HOME=/opt/jdk1.7.0_02, java.awt.printerjob=sun.print.PSPrinterJob, env.TERM=dumb, env.WINDOWPATH=1, sun.io.unicode.encoding=UnicodeLittle, awt.toolkit=sun.awt.X11.XToolkit, env.XMODIFIERS=@im=none, user.home=/home/rcbandit, env.NB_EXEC_MAVEN_PROCESS_UUID=5919535d-c3e3-4e9c-bbce-644b074a4a89, env.OLDPWD=/home/rcbandit/Desktop/NetBeans/Prototype_3/SH_27, java.specification.vendor=Oracle Corporation, java.library.path=/usr/java/packages/lib/amd64:/usr/lib64:/lib64:/lib:/usr/lib, java.vendor.url=http://java.oracle.com/, env.GIO_LAUNCHED_DESKTOP_FILE=/home/rcbandit/.local/share/applications/netbeans-7.0.1.desktop, env.XDG_SEAT=seat0, java.vm.vendor=Oracle Corporation, maven.home=/home/rcbandit/netbeans-7.0.1/java/maven, java.runtime.name=Java(TM) SE Runtime Environment, sun.java.command=org.codehaus.plexus.classworlds.launcher.Launcher clean install -X, java.class.path=/home/rcbandit/netbeans-7.0.1/java/maven/boot/plexus-classworlds-2.4.jar, env.XDG_SESSION_ID=2, env.CVS_RSH=ssh, env.XFILESEARCHPATH=/usr/dt/app-defaults/%L/Dt, java.vm.specification.name=Java Virtual Machine Specification, java.vm.specification.version=1.7, sun.cpu.endian=little, sun.os.patch.level=unknown, env.HOME=/home/rcbandit, java.io.tmpdir=/tmp, java.vendor.url.bug=http://bugreport.sun.com/bugreport/, env.SSH_AUTH_SOCK=/tmp/keyring-Yj3bRR/ssh, os.arch=amd64, java.awt.graphicsenv=sun.awt.X11GraphicsEnvironment, java.ext.dirs=/opt/jdk1.7.0_02/jre/lib/ext:/usr/java/packages/lib/ext, env.XDG_RUNTIME_DIR=/run/user/rcbandit, env.XAUTHORITY=/var/run/gdm/auth-for-rcbandit-ZIWsIN/database, user.dir=/home/rcbandit/Desktop/NetBeans/Prototype_3/SH_27, env.J2D_PIXMAPS=shared, line.separator=
  1689. , java.vm.name=Java HotSpot(TM) 64-Bit Server VM, env.CCACHE_HASHDIR=, env.USERNAME=rcbandit, file.encoding=UTF-8, env.MAIL=/var/spool/mail/rcbandit, env.GPG_AGENT_INFO=/tmp/keyring-Yj3bRR/gpg:0:1, env.GIO_LAUNCHED_DESKTOP_FILE_PID=3073, java.specification.version=1.7, env.GNOME_KEYRING_CONTROL=/tmp/keyring-Yj3bRR}
  1690. Using platform encoding (UTF-8 actually) to copy filtered resources, i.e. build is platform dependent!
  1691. resource with targetPath null
  1692. directory /home/rcbandit/Desktop/NetBeans/Prototype_3/SH_27/SH_27-impl/src/main/resources
  1693. excludes []
  1694. includes []
  1695. ignoreDelta true
  1696. Copying 0 resource
  1697. no use filter components
  1698.  
  1699. [compiler:compile]
  1700. Configuring mojo org.apache.maven.plugins:maven-compiler-plugin:2.3.2:compile from plugin realm ClassRealm[plugin>org.apache.maven.plugins:maven-compiler-plugin:2.3.2, parent: sun.misc.Launcher$AppClassLoader@397577f9]
  1701. Configuring mojo 'org.apache.maven.plugins:maven-compiler-plugin:2.3.2:compile' with basic configurator -->
  1702.   (f) basedir = /home/rcbandit/Desktop/NetBeans/Prototype_3/SH_27/SH_27-impl
  1703.   (f) buildDirectory = /home/rcbandit/Desktop/NetBeans/Prototype_3/SH_27/SH_27-impl/target
  1704.   (f) classpathElements = [/home/rcbandit/Desktop/NetBeans/Prototype_3/SH_27/SH_27-impl/target/classes, /home/rcbandit/.m2/repository/org/apache/felix/org.osgi.core/1.0.0/org.osgi.core-1.0.0.jar, /home/rcbandit/Desktop/NetBeans/Prototype_3/SH_27/SH_27-api/target/SH_27-api-1.0-SNAPSHOT.jar]
  1705.   (f) compileSourceRoots = [/home/rcbandit/Desktop/NetBeans/Prototype_3/SH_27/SH_27-impl/src/main/java]
  1706.   (f) compilerId = javac
  1707.   (f) debug = true
  1708.   (f) failOnError = true
  1709.   (f) fork = false
  1710.   (f) generatedSourcesDirectory = /home/rcbandit/Desktop/NetBeans/Prototype_3/SH_27/SH_27-impl/target/generated-sources/annotations
  1711.   (f) optimize = false
  1712.   (f) outputDirectory = /home/rcbandit/Desktop/NetBeans/Prototype_3/SH_27/SH_27-impl/target/classes
  1713.   (f) outputFileName = SH_27-impl-1.0-SNAPSHOT
  1714.   (f) projectArtifact = org.DX_57.osgi.SH_27:SH_27-impl:bundle:1.0-SNAPSHOT
  1715.   (f) session = org.apache.maven.execution.MavenSession@65bd831f
  1716.   (f) showDeprecation = false
  1717.   (f) showWarnings = false
  1718.   (f) source = 1.7
  1719.   (f) staleMillis = 0
  1720.   (f) target = 1.7
  1721.   (f) verbose = false
  1722. -- end configuration --
  1723. Using compiler 'javac'.
  1724. Source directories: [/home/rcbandit/Desktop/NetBeans/Prototype_3/SH_27/SH_27-impl/src/main/java]
  1725. Classpath: [/home/rcbandit/Desktop/NetBeans/Prototype_3/SH_27/SH_27-impl/target/classes
  1726.  /home/rcbandit/.m2/repository/org/apache/felix/org.osgi.core/1.0.0/org.osgi.core-1.0.0.jar
  1727.  /home/rcbandit/Desktop/NetBeans/Prototype_3/SH_27/SH_27-api/target/SH_27-api-1.0-SNAPSHOT.jar]
  1728. Output directory: /home/rcbandit/Desktop/NetBeans/Prototype_3/SH_27/SH_27-impl/target/classes
  1729. Classpath:
  1730.  /home/rcbandit/Desktop/NetBeans/Prototype_3/SH_27/SH_27-impl/target/classes
  1731.  /home/rcbandit/.m2/repository/org/apache/felix/org.osgi.core/1.0.0/org.osgi.core-1.0.0.jar
  1732.  /home/rcbandit/Desktop/NetBeans/Prototype_3/SH_27/SH_27-api/target/SH_27-api-1.0-SNAPSHOT.jar
  1733. Source roots:
  1734.  /home/rcbandit/Desktop/NetBeans/Prototype_3/SH_27/SH_27-impl/src/main/java
  1735. Command line options:
  1736. -d /home/rcbandit/Desktop/NetBeans/Prototype_3/SH_27/SH_27-impl/target/classes -classpath /home/rcbandit/Desktop/NetBeans/Prototype_3/SH_27/SH_27-impl/target/classes:/home/rcbandit/.m2/repository/org/apache/felix/org.osgi.core/1.0.0/org.osgi.core-1.0.0.jar:/home/rcbandit/Desktop/NetBeans/Prototype_3/SH_27/SH_27-api/target/SH_27-api-1.0-SNAPSHOT.jar: -sourcepath /home/rcbandit/Desktop/NetBeans/Prototype_3/SH_27/SH_27-impl/src/main/java: /home/rcbandit/Desktop/NetBeans/Prototype_3/SH_27/SH_27-impl/src/main/java/org/DX_57/osgi/SH_27/impl/SessionHandleImpl.java /home/rcbandit/Desktop/NetBeans/Prototype_3/SH_27/SH_27-impl/src/main/java/org/DX_57/osgi/SH_27/impl/SessionHandleApp.java -s /home/rcbandit/Desktop/NetBeans/Prototype_3/SH_27/SH_27-impl/target/generated-sources/annotations -g -nowarn -target 1.7 -source 1.7
  1737. File encoding has not been set, using platform encoding UTF-8, i.e. build is platform dependent!
  1738. Compiling 2 source files to /home/rcbandit/Desktop/NetBeans/Prototype_3/SH_27/SH_27-impl/target/classes
  1739.  
  1740. [resources:testResources]
  1741. Configuring mojo org.apache.maven.plugins:maven-resources-plugin:2.5:testResources from plugin realm ClassRealm[plugin>org.apache.maven.plugins:maven-resources-plugin:2.5, parent: sun.misc.Launcher$AppClassLoader@397577f9]
  1742. [debug] execute contextualize
  1743. Configuring mojo 'org.apache.maven.plugins:maven-resources-plugin:2.5:testResources' with basic configurator -->
  1744.   (f) buildFilters = []
  1745.   (f) escapeWindowsPaths = true
  1746.   (s) includeEmptyDirs = false
  1747.   (s) outputDirectory = /home/rcbandit/Desktop/NetBeans/Prototype_3/SH_27/SH_27-impl/target/test-classes
  1748.   (s) overwrite = false
  1749.   (f) project = MavenProject: org.DX_57.osgi.SH_27:SH_27-impl:1.0-SNAPSHOT @ /home/rcbandit/Desktop/NetBeans/Prototype_3/SH_27/SH_27-impl/pom.xml
  1750.   (s) resources = [Resource {targetPath: null, filtering: false, FileSet {directory: /home/rcbandit/Desktop/NetBeans/Prototype_3/SH_27/SH_27-impl/src/test/resources, PatternSet [includes: {}, excludes: {}]}}]
  1751.   (f) session = org.apache.maven.execution.MavenSession@65bd831f
  1752.   (f) supportMultiLineFiltering = false
  1753.   (f) useBuildFilters = true
  1754.   (s) useDefaultDelimiters = true
  1755. -- end configuration --
  1756. properties used {java.vendor=Oracle Corporation, env.SESSION_MANAGER=local/unix:@/tmp/.ICE-unix/1343,unix/unix:/tmp/.ICE-unix/1343, env.LESSOPEN=||/usr/bin/lesspipe.sh %s, sun.java.launcher=SUN_STANDARD, env.QT_IM_MODULE=xim, sun.management.compiler=HotSpot 64-Bit Tiered Compilers, os.name=Linux, sun.boot.class.path=/opt/jdk1.7.0_02/jre/lib/resources.jar:/opt/jdk1.7.0_02/jre/lib/rt.jar:/opt/jdk1.7.0_02/jre/lib/sunrsasign.jar:/opt/jdk1.7.0_02/jre/lib/jsse.jar:/opt/jdk1.7.0_02/jre/lib/jce.jar:/opt/jdk1.7.0_02/jre/lib/charsets.jar:/opt/jdk1.7.0_02/jre/classes, env.PWD=/home/rcbandit/Desktop/NetBeans/Prototype_3/SH_27, env.XDG_SESSION_COOKIE=353e720329bb1813f71d8e5c0000000a-1327785405.693058-1237082549, sun.desktop=gnome, env.LANG=en_US.UTF-8, java.vm.specification.vendor=Oracle Corporation, java.runtime.version=1.7.0_02-b13, env.HISTSIZE=1000, env.XDG_VTNR=1, env.DISPLAY=:0.0, user.name=rcbandit, env.USER=rcbandit, env.HISTCONTROL=ignoredups, env.SHELL=/bin/bash, env.DESKTOP_SESSION=gnome, env.NLSPATH=/usr/dt/lib/nls/msg/%L/%N.cat, env.PATH=/usr/lib64/ccache:/usr/local/bin:/usr/bin:/bin:/usr/local/sbin:/usr/sbin:/sbin:/home/rcbandit/.local/bin:/home/rcbandit/bin, user.language=en, env.IMSETTINGS_MODULE=none, sun.boot.library.path=/opt/jdk1.7.0_02/jre/lib/amd64, classworlds.conf=/home/rcbandit/netbeans-7.0.1/java/maven/bin/m2.conf, java.version=1.7.0_02, user.timezone=Europe/Sofia, env.DBUS_SESSION_BUS_ADDRESS=unix:abstract=/tmp/dbus-mFRjLQobMX,guid=8ae9d800ce549290cbc92d550000001b, sun.arch.data.model=64, java.endorsed.dirs=/opt/jdk1.7.0_02/jre/lib/endorsed, sun.cpu.isalist=, sun.jnu.encoding=UTF-8, file.encoding.pkg=sun.io, env.SHLVL=2, file.separator=/, env.HOSTNAME=Laptop, java.specification.name=Java Platform API Specification, env.IMSETTINGS_INTEGRATE_DESKTOP=yes, env.GNOME_DESKTOP_SESSION_ID=this-is-deprecated, java.class.version=51.0, env.GDMSESSION=gnome, user.country=US, env.GNOME_KEYRING_PID=1339, java.home=/opt/jdk1.7.0_02/jre, java.vm.info=mixed mode, env.LOGNAME=rcbandit, os.version=3.2.2-1.fc16.x86_64, path.separator=:, java.vm.version=22.0-b10, env.JAVA_HOME=/opt/jdk1.7.0_02, java.awt.printerjob=sun.print.PSPrinterJob, env.TERM=dumb, env.WINDOWPATH=1, sun.io.unicode.encoding=UnicodeLittle, awt.toolkit=sun.awt.X11.XToolkit, env.XMODIFIERS=@im=none, user.home=/home/rcbandit, env.NB_EXEC_MAVEN_PROCESS_UUID=5919535d-c3e3-4e9c-bbce-644b074a4a89, env.OLDPWD=/home/rcbandit/Desktop/NetBeans/Prototype_3/SH_27, java.specification.vendor=Oracle Corporation, java.library.path=/usr/java/packages/lib/amd64:/usr/lib64:/lib64:/lib:/usr/lib, java.vendor.url=http://java.oracle.com/, env.GIO_LAUNCHED_DESKTOP_FILE=/home/rcbandit/.local/share/applications/netbeans-7.0.1.desktop, env.XDG_SEAT=seat0, java.vm.vendor=Oracle Corporation, maven.home=/home/rcbandit/netbeans-7.0.1/java/maven, java.runtime.name=Java(TM) SE Runtime Environment, sun.java.command=org.codehaus.plexus.classworlds.launcher.Launcher clean install -X, java.class.path=/home/rcbandit/netbeans-7.0.1/java/maven/boot/plexus-classworlds-2.4.jar, env.XDG_SESSION_ID=2, env.CVS_RSH=ssh, env.XFILESEARCHPATH=/usr/dt/app-defaults/%L/Dt, java.vm.specification.name=Java Virtual Machine Specification, java.vm.specification.version=1.7, sun.cpu.endian=little, sun.os.patch.level=unknown, env.HOME=/home/rcbandit, java.io.tmpdir=/tmp, java.vendor.url.bug=http://bugreport.sun.com/bugreport/, env.SSH_AUTH_SOCK=/tmp/keyring-Yj3bRR/ssh, os.arch=amd64, java.awt.graphicsenv=sun.awt.X11GraphicsEnvironment, java.ext.dirs=/opt/jdk1.7.0_02/jre/lib/ext:/usr/java/packages/lib/ext, env.XDG_RUNTIME_DIR=/run/user/rcbandit, env.XAUTHORITY=/var/run/gdm/auth-for-rcbandit-ZIWsIN/database, user.dir=/home/rcbandit/Desktop/NetBeans/Prototype_3/SH_27, env.J2D_PIXMAPS=shared, line.separator=
  1757. , java.vm.name=Java HotSpot(TM) 64-Bit Server VM, env.CCACHE_HASHDIR=, env.USERNAME=rcbandit, file.encoding=UTF-8, env.MAIL=/var/spool/mail/rcbandit, env.GPG_AGENT_INFO=/tmp/keyring-Yj3bRR/gpg:0:1, env.GIO_LAUNCHED_DESKTOP_FILE_PID=3073, java.specification.version=1.7, env.GNOME_KEYRING_CONTROL=/tmp/keyring-Yj3bRR}
  1758. Using platform encoding (UTF-8 actually) to copy filtered resources, i.e. build is platform dependent!
  1759. resource with targetPath null
  1760. directory /home/rcbandit/Desktop/NetBeans/Prototype_3/SH_27/SH_27-impl/src/test/resources
  1761. excludes []
  1762. includes []
  1763. skip non existing resourceDirectory /home/rcbandit/Desktop/NetBeans/Prototype_3/SH_27/SH_27-impl/src/test/resources
  1764. no use filter components
  1765.  
  1766. [compiler:testCompile]
  1767. Configuring mojo org.apache.maven.plugins:maven-compiler-plugin:2.3.2:testCompile from plugin realm ClassRealm[plugin>org.apache.maven.plugins:maven-compiler-plugin:2.3.2, parent: sun.misc.Launcher$AppClassLoader@397577f9]
  1768. Configuring mojo 'org.apache.maven.plugins:maven-compiler-plugin:2.3.2:testCompile' with basic configurator -->
  1769.   (f) basedir = /home/rcbandit/Desktop/NetBeans/Prototype_3/SH_27/SH_27-impl
  1770.   (f) buildDirectory = /home/rcbandit/Desktop/NetBeans/Prototype_3/SH_27/SH_27-impl/target
  1771.   (f) classpathElements = [/home/rcbandit/Desktop/NetBeans/Prototype_3/SH_27/SH_27-impl/target/test-classes, /home/rcbandit/Desktop/NetBeans/Prototype_3/SH_27/SH_27-impl/target/classes, /home/rcbandit/.m2/repository/junit/junit/3.8.1/junit-3.8.1.jar, /home/rcbandit/.m2/repository/org/apache/felix/org.osgi.core/1.0.0/org.osgi.core-1.0.0.jar, /home/rcbandit/Desktop/NetBeans/Prototype_3/SH_27/SH_27-api/target/SH_27-api-1.0-SNAPSHOT.jar]
  1772.   (f) compileSourceRoots = [/home/rcbandit/Desktop/NetBeans/Prototype_3/SH_27/SH_27-impl/src/test/java]
  1773.   (f) compilerId = javac
  1774.   (f) debug = true
  1775.   (f) failOnError = true
  1776.   (f) fork = false
  1777.   (f) generatedTestSourcesDirectory = /home/rcbandit/Desktop/NetBeans/Prototype_3/SH_27/SH_27-impl/target/generated-sources/test-annotations
  1778.   (f) optimize = false
  1779.   (f) outputDirectory = /home/rcbandit/Desktop/NetBeans/Prototype_3/SH_27/SH_27-impl/target/test-classes
  1780.   (f) outputFileName = SH_27-impl-1.0-SNAPSHOT
  1781.   (f) session = org.apache.maven.execution.MavenSession@65bd831f
  1782.   (f) showDeprecation = false
  1783.   (f) showWarnings = false
  1784.   (f) source = 1.7
  1785.   (f) staleMillis = 0
  1786.   (f) target = 1.7
  1787.   (f) verbose = false
  1788. -- end configuration --
  1789. Using compiler 'javac'.
  1790. Source directories: [/home/rcbandit/Desktop/NetBeans/Prototype_3/SH_27/SH_27-impl/src/test/java]
  1791. Classpath: [/home/rcbandit/Desktop/NetBeans/Prototype_3/SH_27/SH_27-impl/target/test-classes
  1792.  /home/rcbandit/Desktop/NetBeans/Prototype_3/SH_27/SH_27-impl/target/classes
  1793.  /home/rcbandit/.m2/repository/junit/junit/3.8.1/junit-3.8.1.jar
  1794.  /home/rcbandit/.m2/repository/org/apache/felix/org.osgi.core/1.0.0/org.osgi.core-1.0.0.jar
  1795.  /home/rcbandit/Desktop/NetBeans/Prototype_3/SH_27/SH_27-api/target/SH_27-api-1.0-SNAPSHOT.jar]
  1796. Output directory: /home/rcbandit/Desktop/NetBeans/Prototype_3/SH_27/SH_27-impl/target/test-classes
  1797. Classpath:
  1798.  /home/rcbandit/Desktop/NetBeans/Prototype_3/SH_27/SH_27-impl/target/test-classes
  1799.  /home/rcbandit/Desktop/NetBeans/Prototype_3/SH_27/SH_27-impl/target/classes
  1800.  /home/rcbandit/.m2/repository/junit/junit/3.8.1/junit-3.8.1.jar
  1801.  /home/rcbandit/.m2/repository/org/apache/felix/org.osgi.core/1.0.0/org.osgi.core-1.0.0.jar
  1802.  /home/rcbandit/Desktop/NetBeans/Prototype_3/SH_27/SH_27-api/target/SH_27-api-1.0-SNAPSHOT.jar
  1803. Source roots:
  1804.  /home/rcbandit/Desktop/NetBeans/Prototype_3/SH_27/SH_27-impl/src/test/java
  1805. Command line options:
  1806. -d /home/rcbandit/Desktop/NetBeans/Prototype_3/SH_27/SH_27-impl/target/test-classes -classpath /home/rcbandit/Desktop/NetBeans/Prototype_3/SH_27/SH_27-impl/target/test-classes:/home/rcbandit/Desktop/NetBeans/Prototype_3/SH_27/SH_27-impl/target/classes:/home/rcbandit/.m2/repository/junit/junit/3.8.1/junit-3.8.1.jar:/home/rcbandit/.m2/repository/org/apache/felix/org.osgi.core/1.0.0/org.osgi.core-1.0.0.jar:/home/rcbandit/Desktop/NetBeans/Prototype_3/SH_27/SH_27-api/target/SH_27-api-1.0-SNAPSHOT.jar: -sourcepath /home/rcbandit/Desktop/NetBeans/Prototype_3/SH_27/SH_27-impl/src/test/java: /home/rcbandit/Desktop/NetBeans/Prototype_3/SH_27/SH_27-impl/src/test/java/org/samples/osgi/service/AppTest.java -s /home/rcbandit/Desktop/NetBeans/Prototype_3/SH_27/SH_27-impl/target/generated-sources/test-annotations -g -nowarn -target 1.7 -source 1.7
  1807. File encoding has not been set, using platform encoding UTF-8, i.e. build is platform dependent!
  1808. Compiling 1 source file to /home/rcbandit/Desktop/NetBeans/Prototype_3/SH_27/SH_27-impl/target/test-classes
  1809.  
  1810. [surefire:test]
  1811. Configuring mojo org.apache.maven.plugins:maven-surefire-plugin:2.11:test from plugin realm ClassRealm[plugin>org.apache.maven.plugins:maven-surefire-plugin:2.11, parent: sun.misc.Launcher$AppClassLoader@397577f9]
  1812. Configuring mojo 'org.apache.maven.plugins:maven-surefire-plugin:2.11:test' with basic configurator -->
  1813.   (s) basedir = /home/rcbandit/Desktop/NetBeans/Prototype_3/SH_27/SH_27-impl
  1814.   (s) childDelegation = false
  1815.   (s) classesDirectory = /home/rcbandit/Desktop/NetBeans/Prototype_3/SH_27/SH_27-impl/target/classes
  1816.   (s) disableXmlReport = false
  1817.   (s) enableAssertions = true
  1818.   (s) forkMode = once
  1819.   (s) junitArtifactName = junit:junit
  1820.   (s) localRepository =        id: local
  1821.       url: file:///home/rcbandit/.m2/repository/
  1822.    layout: none
  1823.  
  1824.   (f) parallelMavenExecution = false
  1825.   (s) perCoreThreadCount = true
  1826.   (s) pluginArtifactMap = {org.apache.maven.plugins:maven-surefire-plugin=org.apache.maven.plugins:maven-surefire-plugin:maven-plugin:2.11:, org.apache.maven.surefire:surefire-booter=org.apache.maven.surefire:surefire-booter:jar:2.11:compile, org.apache.maven.surefire:surefire-api=org.apache.maven.surefire:surefire-api:jar:2.11:compile, org.apache.maven.surefire:maven-surefire-common=org.apache.maven.surefire:maven-surefire-common:jar:2.11:compile, org.apache.maven.shared:maven-common-artifact-filters=org.apache.maven.shared:maven-common-artifact-filters:jar:1.3:compile, org.codehaus.plexus:plexus-utils=org.codehaus.plexus:plexus-utils:jar:2.1:compile, org.apache.maven.reporting:maven-reporting-api=org.apache.maven.reporting:maven-reporting-api:jar:2.0.9:compile}
  1827.   (s) printSummary = true
  1828.   (s) project = MavenProject: org.DX_57.osgi.SH_27:SH_27-impl:1.0-SNAPSHOT @ /home/rcbandit/Desktop/NetBeans/Prototype_3/SH_27/SH_27-impl/pom.xml
  1829.   (s) projectArtifactMap = {junit:junit=junit:junit:jar:3.8.1:test, org.apache.felix:org.osgi.core=org.apache.felix:org.osgi.core:jar:1.0.0:compile, org.DX_57.osgi.SH_27:SH_27-api=org.DX_57.osgi.SH_27:SH_27-api:jar:1.0-SNAPSHOT:compile}
  1830.   (s) redirectTestOutputToFile = false
  1831.   (s) remoteRepositories = [       id: central
  1832.       url: http://repo1.maven.org/maven2
  1833.    layout: default
  1834. snapshots: [enabled => false, update => daily]
  1835.  releases: [enabled => true, update => never]
  1836. ]
  1837.   (s) reportFormat = brief
  1838.   (s) reportsDirectory = /home/rcbandit/Desktop/NetBeans/Prototype_3/SH_27/SH_27-impl/target/surefire-reports
  1839.   (s) runOrder = filesystem
  1840.   (s) session = org.apache.maven.execution.MavenSession@65bd831f
  1841.   (s) skip = false
  1842.   (s) skipTests = false
  1843.   (s) testClassesDirectory = /home/rcbandit/Desktop/NetBeans/Prototype_3/SH_27/SH_27-impl/target/test-classes
  1844.   (s) testFailureIgnore = false
  1845.   (s) testNGArtifactName = org.testng:testng
  1846.   (s) testSourceDirectory = /home/rcbandit/Desktop/NetBeans/Prototype_3/SH_27/SH_27-impl/src/test/java
  1847.   (s) trimStackTrace = true
  1848.   (s) useFile = true
  1849.   (s) useManifestOnlyJar = true
  1850.   (s) useSystemClassLoader = true
  1851.   (s) useUnlimitedThreads = false
  1852.   (s) workingDirectory = /home/rcbandit/Desktop/NetBeans/Prototype_3/SH_27/SH_27-impl
  1853. -- end configuration --
  1854. Surefire report directory: /home/rcbandit/Desktop/NetBeans/Prototype_3/SH_27/SH_27-impl/target/surefire-reports
  1855. dummy:dummy:jar:1.0 (selected for null)
  1856.   org.apache.maven.surefire:surefire-booter:jar:2.11:compile (selected for compile)
  1857.     org.apache.maven.surefire:surefire-api:jar:2.11:compile (selected for compile)
  1858. Adding to surefire booter test classpath: /home/rcbandit/.m2/repository/org/apache/maven/surefire/surefire-booter/2.11/surefire-booter-2.11.jar Scope: compile
  1859. Adding to surefire booter test classpath: /home/rcbandit/.m2/repository/org/apache/maven/surefire/surefire-api/2.11/surefire-api-2.11.jar Scope: compile
  1860. Setting system property [user.dir]=[/home/rcbandit/Desktop/NetBeans/Prototype_3/SH_27/SH_27-impl]
  1861. Setting system property [localRepository]=[/home/rcbandit/.m2/repository]
  1862. Setting system property [basedir]=[/home/rcbandit/Desktop/NetBeans/Prototype_3/SH_27/SH_27-impl]
  1863. Using JVM: /opt/jdk1.7.0_02/jre/bin/java
  1864. dummy:dummy:jar:1.0 (selected for null)
  1865.   org.apache.maven.surefire:surefire-junit3:jar:2.11:test (selected for test)
  1866.     org.apache.maven.surefire:surefire-api:jar:2.11:test (selected for test)
  1867. Adding to surefire test classpath: /home/rcbandit/.m2/repository/org/apache/maven/surefire/surefire-junit3/2.11/surefire-junit3-2.11.jar Scope: test
  1868. Adding to surefire test classpath: /home/rcbandit/.m2/repository/org/apache/maven/surefire/surefire-api/2.11/surefire-api-2.11.jar Scope: test
  1869. test classpath classpath:
  1870.   /home/rcbandit/Desktop/NetBeans/Prototype_3/SH_27/SH_27-impl/target/test-classes
  1871.   /home/rcbandit/Desktop/NetBeans/Prototype_3/SH_27/SH_27-impl/target/classes
  1872.   /home/rcbandit/.m2/repository/junit/junit/3.8.1/junit-3.8.1.jar
  1873.   /home/rcbandit/.m2/repository/org/apache/felix/org.osgi.core/1.0.0/org.osgi.core-1.0.0.jar
  1874.   /home/rcbandit/Desktop/NetBeans/Prototype_3/SH_27/SH_27-api/target/SH_27-api-1.0-SNAPSHOT.jar
  1875. provider classpath classpath:
  1876.   /home/rcbandit/.m2/repository/org/apache/maven/surefire/surefire-junit3/2.11/surefire-junit3-2.11.jar
  1877.   /home/rcbandit/.m2/repository/org/apache/maven/surefire/surefire-api/2.11/surefire-api-2.11.jar
  1878.  
  1879. -------------------------------------------------------
  1880.  T E S T S
  1881. -------------------------------------------------------
  1882. Forking command line: /bin/sh -c cd /home/rcbandit/Desktop/NetBeans/Prototype_3/SH_27/SH_27-impl && /opt/jdk1.7.0_02/jre/bin/java -jar /home/rcbandit/Desktop/NetBeans/Prototype_3/SH_27/SH_27-impl/target/surefire/surefirebooter8167725554885225415.jar /home/rcbandit/Desktop/NetBeans/Prototype_3/SH_27/SH_27-impl/target/surefire/surefire8379335023847932230tmp /home/rcbandit/Desktop/NetBeans/Prototype_3/SH_27/SH_27-impl/target/surefire/surefire2187865416793323361tmp
  1883. Running org.samples.osgi.service.AppTest
  1884. Tests run: 1, Failures: 0, Errors: 0, Skipped: 0, Time elapsed: 0.015 sec
  1885.  
  1886. Results :
  1887.  
  1888. Tests run: 1, Failures: 0, Errors: 0, Skipped: 0
  1889.  
  1890.  
  1891. [bundle:bundle]
  1892. Configuring mojo org.apache.felix:maven-bundle-plugin:2.3.6:bundle from plugin realm ClassRealm[plugin>org.apache.felix:maven-bundle-plugin:2.3.6, parent: sun.misc.Launcher$AppClassLoader@397577f9]
  1893. Configuring mojo 'org.apache.felix:maven-bundle-plugin:2.3.6:bundle' with basic configurator -->
  1894.   (f) buildDirectory = /home/rcbandit/Desktop/NetBeans/Prototype_3/SH_27/SH_27-impl/target
  1895.   (f) instructions = {Bundle-Activator=org.DX_57.osgi.SH_27.impl.SessionHandleApp, Bundle-SymbolicName=SH_27-impl, Import-Package=org.DX_57.osgi.SH_27.api, org.osgi.framework}
  1896.   (f) m_mavenSession = org.apache.maven.execution.MavenSession@65bd831f
  1897.   (f) manifestLocation = /home/rcbandit/Desktop/NetBeans/Prototype_3/SH_27/SH_27-impl/target/classes/META-INF
  1898.   (f) outputDirectory = /home/rcbandit/Desktop/NetBeans/Prototype_3/SH_27/SH_27-impl/target/classes
  1899.   (f) project = MavenProject: org.DX_57.osgi.SH_27:SH_27-impl:1.0-SNAPSHOT @ /home/rcbandit/Desktop/NetBeans/Prototype_3/SH_27/SH_27-impl/pom.xml
  1900. -- end configuration --
  1901. BND Instructions:
  1902. #-----------------------------------------------------------------------
  1903. #Sat Jan 28 22:06:20 EET 2012
  1904. pom.id=org.DX_57.osgi.SH_27\:SH_27-impl\:bundle\:1.0-SNAPSHOT
  1905. env.DESKTOP_SESSION=gnome
  1906. env.OLDPWD=/home/rcbandit/Desktop/NetBeans/Prototype_3/SH_27
  1907. file.encoding.pkg=sun.io
  1908. java.home=/opt/jdk1.7.0_02/jre
  1909. env.DISPLAY=\:0.0
  1910. env.XDG_VTNR=1
  1911. pom.contributors=
  1912. project.build.developers=
  1913. classworlds.conf=/home/rcbandit/netbeans-7.0.1/java/maven/bin/m2.conf
  1914. env.XDG_SESSION_COOKIE=353e720329bb1813f71d8e5c0000000a-1327785405.693058-1237082549
  1915. pom.pomFile=/home/rcbandit/Desktop/NetBeans/Prototype_3/SH_27/SH_27-impl/pom.xml
  1916. java.endorsed.dirs=/opt/jdk1.7.0_02/jre/lib/endorsed
  1917. project.build.groupId=org.DX_57.osgi.SH_27
  1918. env.LOGNAME=rcbandit
  1919. env.USERNAME=rcbandit
  1920. env.XDG_SEAT=seat0
  1921. env.SESSION_MANAGER=local/unix\:@/tmp/.ICE-unix/1343,unix/unix\:/tmp/.ICE-unix/1343
  1922. sun.os.patch.level=unknown
  1923. java.vendor.url=http\://java.oracle.com/
  1924. pom.profiles=
  1925. maven-symbolicname=org.DX_57.osgi.SH_27.impl
  1926. java.version=1.7.0_02
  1927. project.build.contributors=
  1928. java.vendor.url.bug=http\://bugreport.sun.com/bugreport/
  1929. env.GNOME_KEYRING_CONTROL=/tmp/keyring-Yj3bRR
  1930. user.name=rcbandit
  1931. env.LANG=en_US.UTF-8
  1932. env.CVS_RSH=ssh
  1933. project.build.pomFile=/home/rcbandit/Desktop/NetBeans/Prototype_3/SH_27/SH_27-impl/pom.xml
  1934. sun.io.unicode.encoding=UnicodeLittle
  1935. sun.jnu.encoding=UTF-8
  1936. env.DBUS_SESSION_BUS_ADDRESS=unix\:abstract\=/tmp/dbus-mFRjLQobMX,guid\=8ae9d800ce549290cbc92d550000001b
  1937. java.runtime.name=Java(TM) SE Runtime Environment
  1938. project.build.outputdirectory=/home/rcbandit/Desktop/NetBeans/Prototype_3/SH_27/SH_27-impl/target/classes
  1939. project.version=1.0-SNAPSHOT
  1940. java.specification.name=Java Platform API Specification
  1941. user.timezone=Europe/Sofia
  1942. env.LESSOPEN=||/usr/bin/lesspipe.sh %s
  1943. env.GIO_LAUNCHED_DESKTOP_FILE=/home/rcbandit/.local/share/applications/netbeans-7.0.1.desktop
  1944. pom.mailingLists=
  1945. path.separator=\:
  1946. project.contributors=
  1947. pom.artifactId=SH_27-impl
  1948. project.name=SH_27-impl
  1949. env.XMODIFIERS=@im\=none
  1950. file.encoding=UTF-8
  1951. pom.url=http\://maven.apache.org
  1952. env.HOME=/home/rcbandit
  1953. sun.java.command=org.codehaus.plexus.classworlds.launcher.Launcher clean install -X
  1954. project.id=org.DX_57.osgi.SH_27\:SH_27-impl\:bundle\:1.0-SNAPSHOT
  1955. env.HOSTNAME=Laptop
  1956. Bundle-Activator=org.DX_57.osgi.SH_27.impl.SessionHandleApp
  1957. Export-Package=;-split-package\:\=merge-first
  1958. java.io.tmpdir=/tmp
  1959. project.build.mailingLists=
  1960. env.GNOME_KEYRING_PID=1339
  1961. user.language=en
  1962. env.HISTCONTROL=ignoredups
  1963. line.separator=\n
  1964. project.build.directory=/home/rcbandit/Desktop/NetBeans/Prototype_3/SH_27/SH_27-impl/target
  1965. env.HISTSIZE=1000
  1966. java.vm.info=mixed mode
  1967. sun.desktop=gnome
  1968. java.vm.specification.name=Java Virtual Machine Specification
  1969. project.build.id=org.DX_57.osgi.SH_27\:SH_27-impl\:bundle\:1.0-SNAPSHOT
  1970. project.build.licenses=
  1971. pom.modelVersion=4.0.0
  1972. project.licenses=
  1973. env.GDMSESSION=gnome
  1974. project.developers=
  1975. java.awt.printerjob=sun.print.PSPrinterJob
  1976. project.url=http\://maven.apache.org
  1977. -removeheaders=Include-Resource,Private-Package
  1978. pom.version=1.0-SNAPSHOT
  1979. -plugin=org.apache.felix.bundleplugin.BlueprintPlugin,aQute.lib.spring.SpringXMLType
  1980. project.mailingLists=
  1981. pom.packaging=bundle
  1982. project.build.parent=org.DX_57.osgi.SH_27\:SH_27\:pom\:1.0-SNAPSHOT
  1983. project.projectDirectory=/home/rcbandit/Desktop/NetBeans/Prototype_3/SH_27/SH_27-impl
  1984. os.name=Linux
  1985. project.build.modelVersion=4.0.0
  1986. java.specification.vendor=Oracle Corporation
  1987. env.TERM=dumb
  1988. java.vm.name=Java HotSpot(TM) 64-Bit Server VM
  1989. env.QT_IM_MODULE=xim
  1990. java.library.path=/usr/java/packages/lib/amd64\:/usr/lib64\:/lib64\:/lib\:/usr/lib
  1991. project.build.build=org.apache.maven.model.Build@32d9b0d2
  1992. env.PATH=/usr/lib64/ccache\:/usr/local/bin\:/usr/bin\:/bin\:/usr/local/sbin\:/usr/sbin\:/sbin\:/home/rcbandit/.local/bin\:/home/rcbandit/bin
  1993. pom.build=org.apache.maven.model.Build@32d9b0d2
  1994. java.class.version=51.0
  1995. env.SHLVL=2
  1996. project.build.version=1.0-SNAPSHOT
  1997. pom.parent=org.DX_57.osgi.SH_27\:SH_27\:pom\:1.0-SNAPSHOT
  1998. pom.projectDirectory=/home/rcbandit/Desktop/NetBeans/Prototype_3/SH_27/SH_27-impl
  1999. project.modelVersion=4.0.0
  2000. Bundle-SymbolicName=SH_27-impl
  2001. sun.boot.library.path=/opt/jdk1.7.0_02/jre/lib/amd64
  2002. Private-Package=org.DX_57.osgi.SH_27.impl;-split-package\:\=merge-first
  2003. project.build.artifactId=SH_27-impl
  2004. sun.management.compiler=HotSpot 64-Bit Tiered Compilers
  2005. java.awt.graphicsenv=sun.awt.X11GraphicsEnvironment
  2006. pom.name=SH_27-impl
  2007. env.USER=rcbandit
  2008. pom.developers=
  2009. project.build=org.apache.maven.model.Build@32d9b0d2
  2010. project.baseDir=/home/rcbandit/Desktop/NetBeans/Prototype_3/SH_27/SH_27-impl
  2011. project.build.name=SH_27-impl
  2012. java.vm.specification.version=1.7
  2013. project.groupId=org.DX_57.osgi.SH_27
  2014. Bundle-Version=1.0.0.SNAPSHOT
  2015. env.NLSPATH=/usr/dt/lib/nls/msg/%L/%N.cat
  2016. awt.toolkit=sun.awt.X11.XToolkit
  2017. project.build.profiles=
  2018. sun.cpu.isalist=
  2019. project.profiles=
  2020. java.ext.dirs=/opt/jdk1.7.0_02/jre/lib/ext\:/usr/java/packages/lib/ext
  2021. Import-Package=org.DX_57.osgi.SH_27.api, org.osgi.framework
  2022. os.version=3.2.2-1.fc16.x86_64
  2023. user.home=/home/rcbandit
  2024. java.vm.vendor=Oracle Corporation
  2025. env.JAVA_HOME=/opt/jdk1.7.0_02
  2026. env.XDG_SESSION_ID=2
  2027. env.XAUTHORITY=/var/run/gdm/auth-for-rcbandit-ZIWsIN/database
  2028. user.dir=/home/rcbandit/Desktop/NetBeans/Prototype_3/SH_27
  2029. env.XFILESEARCHPATH=/usr/dt/app-defaults/%L/Dt
  2030. env.WINDOWPATH=1
  2031. env.MAIL=/var/spool/mail/rcbandit
  2032. env.PWD=/home/rcbandit/Desktop/NetBeans/Prototype_3/SH_27
  2033. project.parent=org.DX_57.osgi.SH_27\:SH_27\:pom\:1.0-SNAPSHOT
  2034. sun.cpu.endian=little
  2035. env.NB_EXEC_MAVEN_PROCESS_UUID=5919535d-c3e3-4e9c-bbce-644b074a4a89
  2036. project.dir=/home/rcbandit/Desktop/NetBeans/Prototype_3/SH_27/SH_27-impl
  2037. pom.licenses=
  2038. classifier=
  2039. java.vm.version=22.0-b10
  2040. java.class.path=/home/rcbandit/netbeans-7.0.1/java/maven/boot/plexus-classworlds-2.4.jar
  2041. os.arch=amd64
  2042. project.build.url=http\://maven.apache.org
  2043. project.build.projectDirectory=/home/rcbandit/Desktop/NetBeans/Prototype_3/SH_27/SH_27-impl
  2044. env.GIO_LAUNCHED_DESKTOP_FILE_PID=3073
  2045. sun.java.launcher=SUN_STANDARD
  2046. env.IMSETTINGS_INTEGRATE_DESKTOP=yes
  2047. project.packaging=bundle
  2048. java.vm.specification.vendor=Oracle Corporation
  2049. file.separator=/
  2050. env.CCACHE_HASHDIR=
  2051. java.runtime.version=1.7.0_02-b13
  2052. project.pomFile=/home/rcbandit/Desktop/NetBeans/Prototype_3/SH_27/SH_27-impl/pom.xml
  2053. env.SSH_AUTH_SOCK=/tmp/keyring-Yj3bRR/ssh
  2054. sun.boot.class.path=/opt/jdk1.7.0_02/jre/lib/resources.jar\:/opt/jdk1.7.0_02/jre/lib/rt.jar\:/opt/jdk1.7.0_02/jre/lib/sunrsasign.jar\:/opt/jdk1.7.0_02/jre/lib/jsse.jar\:/opt/jdk1.7.0_02/jre/lib/jce.jar\:/opt/jdk1.7.0_02/jre/lib/charsets.jar\:/opt/jdk1.7.0_02/jre/classes
  2055. project.build.packaging=bundle
  2056. env.XDG_RUNTIME_DIR=/run/user/rcbandit
  2057. project.artifactId=SH_27-impl
  2058. user.country=US
  2059. env.J2D_PIXMAPS=shared
  2060. maven.home=/home/rcbandit/netbeans-7.0.1/java/maven
  2061. env.SHELL=/bin/bash
  2062. -sourcepath=/home/rcbandit/Desktop/NetBeans/Prototype_3/SH_27/SH_27-impl/src/main/java
  2063. pom.groupId=org.DX_57.osgi.SH_27
  2064. java.vendor=Oracle Corporation
  2065. env.GPG_AGENT_INFO=/tmp/keyring-Yj3bRR/gpg\:0\:1
  2066. env.IMSETTINGS_MODULE=none
  2067. Bundle-Name=SH_27-impl
  2068. java.specification.version=1.7
  2069. env.GNOME_DESKTOP_SESSION_ID=this-is-deprecated
  2070. sun.arch.data.model=64
  2071. #-----------------------------------------------------------------------
  2072.  
  2073. BND Classpath:
  2074. #-----------------------------------------------------------------------
  2075. -classpath:\
  2076.  /home/rcbandit/Desktop/NetBeans/Prototype_3/SH_27/SH_27-impl/target/classes,\
  2077.  /home/rcbandit/.m2/repository/org/apache/felix/org.osgi.core/1.0.0/org.osgi.core-1.0.0.jar,\
  2078.  /home/rcbandit/Desktop/NetBeans/Prototype_3/SH_27/SH_27-api/target/SH_27-api-1.0-SNAPSHOT.jar
  2079. #-----------------------------------------------------------------------
  2080.  
  2081. BND Manifest:
  2082. #-----------------------------------------------------------------------
  2083. Manifest-Version: 1.0
  2084. Bnd-LastModified: 1327781180566
  2085. Bundle-Activator: org.DX_57.osgi.SH_27.impl.SessionHandleApp
  2086. Bundle-ManifestVersion: 2
  2087. Bundle-Name: SH_27-impl
  2088. Bundle-SymbolicName: SH_27-impl
  2089. Bundle-Version: 1.0.0.SNAPSHOT
  2090. Created-By: 1.7.0_02 (Oracle Corporation)
  2091. Import-Package: org.DX_57.osgi.SH_27.api;version="[1.0,2)",org.osgi.fram
  2092.  ework;version="[1.3,2)"
  2093. Tool: Bnd-1.50.0
  2094. #-----------------------------------------------------------------------
  2095.  
  2096. Final Manifest:
  2097. #-----------------------------------------------------------------------
  2098. Manifest-Version: 1.0
  2099. Bnd-LastModified: 1327781180566
  2100. Build-Jdk: 1.7.0_02
  2101. Built-By: rcbandit
  2102. Bundle-Activator: org.DX_57.osgi.SH_27.impl.SessionHandleApp
  2103. Bundle-ManifestVersion: 2
  2104. Bundle-Name: SH_27-impl
  2105. Bundle-SymbolicName: SH_27-impl
  2106. Bundle-Version: 1.0.0.SNAPSHOT
  2107. Created-By: Apache Maven Bundle Plugin
  2108. Import-Package: org.DX_57.osgi.SH_27.api;version="[1.0,2)",org.osgi.fram
  2109.  ework;version="[1.3,2)"
  2110. Tool: Bnd-1.50.0
  2111. #-----------------------------------------------------------------------
  2112.  
  2113. Bundle org.DX_57.osgi.SH_27:SH_27-impl:bundle:1.0-SNAPSHOT : Unresolved references to [javax.activation, javax.annotation] by class(es) on the Bundle-Classpath[Jar:dot]: [org/DX_57/osgi/SH_27/impl/SessionHandleImpl.class]
  2114. Error(s) found in bundle configuration
  2115. ------------------------------------------------------------------------
  2116. Reactor Summary:
  2117.  
  2118. SH_27 ............................................. SUCCESS [0.355s]
  2119. SH_27-api ......................................... SUCCESS [3.410s]
  2120. SH_27-impl ........................................ FAILURE [1.778s]
  2121. ------------------------------------------------------------------------
  2122. BUILD FAILURE
  2123. ------------------------------------------------------------------------
  2124. Total time: 6.722s
  2125. Finished at: Sat Jan 28 22:06:20 EET 2012
  2126. Final Memory: 26M/171M
  2127. ------------------------------------------------------------------------
  2128. Failed to execute goal org.apache.felix:maven-bundle-plugin:2.3.6:bundle (default-bundle) on project SH_27-impl: Error(s) found in bundle configuration -> [Help 1]
  2129. org.apache.maven.lifecycle.LifecycleExecutionException: Failed to execute goal org.apache.felix:maven-bundle-plugin:2.3.6:bundle (default-bundle) on project SH_27-impl: Error(s) found in bundle configuration
  2130.         at org.apache.maven.lifecycle.internal.MojoExecutor.execute(MojoExecutor.java:217)
  2131.         at org.apache.maven.lifecycle.internal.MojoExecutor.execute(MojoExecutor.java:153)
  2132.         at org.apache.maven.lifecycle.internal.MojoExecutor.execute(MojoExecutor.java:145)
  2133.         at org.apache.maven.lifecycle.internal.LifecycleModuleBuilder.buildProject(LifecycleModuleBuilder.java:84)
  2134.         at org.apache.maven.lifecycle.internal.LifecycleModuleBuilder.buildProject(LifecycleModuleBuilder.java:59)
  2135.         at org.apache.maven.lifecycle.internal.LifecycleStarter.singleThreadedBuild(LifecycleStarter.java:183)
  2136.         at org.apache.maven.lifecycle.internal.LifecycleStarter.execute(LifecycleStarter.java:161)
  2137.         at org.apache.maven.DefaultMaven.doExecute(DefaultMaven.java:319)
  2138.         at org.apache.maven.DefaultMaven.execute(DefaultMaven.java:156)
  2139.         at org.apache.maven.cli.MavenCli.execute(MavenCli.java:537)
  2140.         at org.apache.maven.cli.MavenCli.doMain(MavenCli.java:196)
  2141.         at org.apache.maven.cli.MavenCli.main(MavenCli.java:141)
  2142.         at sun.reflect.NativeMethodAccessorImpl.invoke0(Native Method)
  2143.         at sun.reflect.NativeMethodAccessorImpl.invoke(NativeMethodAccessorImpl.java:57)
  2144.         at sun.reflect.DelegatingMethodAccessorImpl.invoke(DelegatingMethodAccessorImpl.java:43)
  2145.         at java.lang.reflect.Method.invoke(Method.java:601)
  2146.         at org.codehaus.plexus.classworlds.launcher.Launcher.launchEnhanced(Launcher.java:290)
  2147.         at org.codehaus.plexus.classworlds.launcher.Launcher.launch(Launcher.java:230)
  2148.         at org.codehaus.plexus.classworlds.launcher.Launcher.mainWithExitCode(Launcher.java:409)
  2149.         at org.codehaus.plexus.classworlds.launcher.Launcher.main(Launcher.java:352)
  2150. Caused by: org.apache.maven.plugin.MojoExecutionException: Error(s) found in bundle configuration
  2151.         at org.apache.felix.bundleplugin.BundlePlugin.execute(BundlePlugin.java:406)
  2152.         at org.apache.felix.bundleplugin.BundlePlugin.execute(BundlePlugin.java:263)
  2153.         at org.apache.felix.bundleplugin.BundlePlugin.execute(BundlePlugin.java:254)
  2154.         at org.apache.maven.plugin.DefaultBuildPluginManager.executeMojo(DefaultBuildPluginManager.java:101)
  2155.         at org.apache.maven.lifecycle.internal.MojoExecutor.execute(MojoExecutor.java:209)
  2156.         ... 19 more
  2157. Caused by: org.apache.maven.plugin.MojoFailureException: Error(s) found in bundle configuration
  2158.         at org.apache.felix.bundleplugin.BundlePlugin.execute(BundlePlugin.java:355)
  2159.         ... 23 more
  2160.  
  2161.  
  2162. For more information about the errors and possible solutions, please read the following articles:
  2163. [Help 1] http://cwiki.apache.org/confluence/display/MAVEN/MojoExecutionException
  2164.  
  2165. After correcting the problems, you can resume the build with the command
  2166.   mvn <goals> -rf :SH_27-impl