Guest User

Untitled

a guest
Oct 29th, 2014
262
0
Never
Not a member of Pastebin yet? Sign Up, it unlocks many cool features!
text 1.36 KB | None | 0 0
  1. CC fs/proc/cmdline.o
  2. fs/proc/cmdline.c: In function 'cmdline_proc_show':
  3. fs/proc/cmdline.c:9:2: error: implicit declaration of function 'current_uid' [-Werror=implicit-function-declaration]
  4. if (uid_eq(current_uid(), GLOBAL_ROOT_UID) ||
  5. ^
  6. fs/proc/cmdline.c:9:6: error: incompatible type for argument 1 of 'uid_eq'
  7. if (uid_eq(current_uid(), GLOBAL_ROOT_UID) ||
  8. ^
  9. In file included from include/linux/stat.h:19:0,
  10. from include/linux/fs.h:10,
  11. from fs/proc/cmdline.c:1:
  12. include/linux/uidgid.h:48:20: note: expected 'kuid_t' but argument is of type 'int'
  13. static inline bool uid_eq(kuid_t left, kuid_t right)
  14. ^
  15. fs/proc/cmdline.c:11:3: error: implicit declaration of function 'in_group_p' [-Werror=implicit-function-declaration]
  16. in_group_p(grsec_proc_gid)
  17. ^
  18. fs/proc/cmdline.c:11:14: error: 'grsec_proc_gid' undeclared (first use in this function)
  19. in_group_p(grsec_proc_gid)
  20. ^
  21. fs/proc/cmdline.c:11:14: note: each undeclared identifier is reported only once for each function it appears in
  22. cc1: some warnings being treated as errors
  23. scripts/Makefile.build:257: recipe for target 'fs/proc/cmdline.o' failed
  24. make[4]: *** [fs/proc/cmdline.o] Error 1
  25. scripts/Makefile.build:404: recipe for target 'fs/proc' failed
  26. make[3]: *** [fs/proc] Error 2
  27. make[3]: *** Waiting for unfinished jobs....
Advertisement
Add Comment
Please, Sign In to add comment