Pastebin launched a little side project called VERYVIRAL.com, check it out ;-) Want more features on Pastebin? Sign Up, it's FREE!
Guest

Untitled

By: a guest on Sep 22nd, 2012  |  syntax: C++  |  size: 14.10 KB  |  views: 4  |  expires: Never
download  |  raw  |  embed  |  report abuse  |  print
Text below is selected. Please press Ctrl+C to copy to your clipboard. (⌘+C on Mac)
  1. +\include\cairo/cairosdl.h:139:42: warning: character constant too long fo
  2. type [enabled by default]
  3. +\include\cairo/cairosdl.h:140:10: warning: multi-character character cons
  4. -Wmultichar]
  5. +\include\cairo/cairosdl.h:140:18: warning: multi-character character cons
  6. -Wmultichar]
  7. +\include\cairo/cairosdl.h:140:30: warning: multi-character character cons
  8. -Wmultichar]
  9. +\include\cairo/cairosdl.h:140:42: warning: character constant too long fo
  10. type [enabled by default]
  11. +\include\cairo/cairosdl.h:141:10: warning: multi-character character cons
  12. -Wmultichar]
  13. +\include\cairo/cairosdl.h:141:18: warning: multi-character character cons
  14. -Wmultichar]
  15. +\include\cairo/cairosdl.h:141:30: warning: multi-character character cons
  16. -Wmultichar]
  17. +\include\cairo/cairosdl.h:141:42: warning: character constant too long fo
  18. type [enabled by default]
  19. +\include\cairo/cairosdl.h:142:10: warning: multi-character character cons
  20. -Wmultichar]
  21. +\include\cairo/cairosdl.h:142:18: warning: multi-character character cons
  22. -Wmultichar]
  23. +\include\cairo/cairosdl.h:142:30: warning: multi-character character cons
  24. -Wmultichar]
  25. +\include\cairo/cairosdl.h:142:42: warning: character constant too long fo
  26. type [enabled by default]
  27. +\include\cairo/cairosdl.h:143:10: warning: multi-character character cons
  28. -Wmultichar]
  29. +\include\cairo/cairosdl.h:143:18: warning: multi-character character cons
  30. -Wmultichar]
  31. +\include\cairo/cairosdl.h:143:30: warning: multi-character character cons
  32. -Wmultichar]
  33. +\include\cairo/cairosdl.h:143:42: warning: character constant too long fo
  34. type [enabled by default]
  35. +\include\cairo/cairosdl.h:144:10: warning: multi-character character cons
  36. -Wmultichar]
  37. +\include\cairo/cairosdl.h:144:18: warning: multi-character character cons
  38. -Wmultichar]
  39. +\include\cairo/cairosdl.h:144:30: warning: multi-character character cons
  40. -Wmultichar]
  41. +\include\cairo/cairosdl.h:144:42: warning: character constant too long fo
  42. type [enabled by default]
  43. +\include\cairo/cairosdl.h:145:10: warning: multi-character character cons
  44. -Wmultichar]
  45. +\include\cairo/cairosdl.h:145:18: warning: multi-character character cons
  46. -Wmultichar]
  47. +\include\cairo/cairosdl.h:145:30: warning: multi-character character cons
  48. -Wmultichar]
  49. +\include\cairo/cairosdl.h:145:42: warning: character constant too long fo
  50. type [enabled by default]
  51. +\include\cairo/cairosdl.h:146:10: warning: multi-character character cons
  52. -Wmultichar]
  53. +\include\cairo/cairosdl.h:146:18: warning: multi-character character cons
  54. -Wmultichar]
  55. +\include\cairo/cairosdl.h:146:30: warning: multi-character character cons
  56. -Wmultichar]
  57. +\include\cairo/cairosdl.h:146:42: warning: character constant too long fo
  58. type [enabled by default]
  59. +\include\cairo/cairosdl.h:147:10: warning: multi-character character cons
  60. -Wmultichar]
  61. +\include\cairo/cairosdl.h:147:18: warning: multi-character character cons
  62. -Wmultichar]
  63. +\include\cairo/cairosdl.h:147:30: warning: multi-character character cons
  64. -Wmultichar]
  65. +\include\cairo/cairosdl.h:147:42: warning: character constant too long fo
  66. type [enabled by default]
  67. +\include\cairo/cairosdl.h:148:10: warning: multi-character character cons
  68. -Wmultichar]
  69. +\include\cairo/cairosdl.h:148:18: warning: multi-character character cons
  70. -Wmultichar]
  71. +\include\cairo/cairosdl.h:148:30: warning: multi-character character cons
  72. -Wmultichar]
  73. +\include\cairo/cairosdl.h:148:42: warning: character constant too long fo
  74. type [enabled by default]
  75. +\include\cairo/cairosdl.h:149:10: warning: multi-character character cons
  76. -Wmultichar]
  77. +\include\cairo/cairosdl.h:149:18: warning: multi-character character cons
  78. -Wmultichar]
  79. +\include\cairo/cairosdl.h:149:30: warning: multi-character character cons
  80. -Wmultichar]
  81. +\include\cairo/cairosdl.h:149:42: warning: character constant too long fo
  82. type [enabled by default]
  83. +\include\cairo/cairosdl.h:150:10: warning: multi-character character cons
  84. -Wmultichar]
  85. +\include\cairo/cairosdl.h:150:18: warning: multi-character character cons
  86. -Wmultichar]
  87. +\include\cairo/cairosdl.h:150:30: warning: multi-character character cons
  88. -Wmultichar]
  89. +\include\cairo/cairosdl.h:150:42: warning: character constant too long fo
  90. type [enabled by default]
  91. +\include\cairo/cairosdl.h:151:10: warning: multi-character character cons
  92. -Wmultichar]
  93. +\include\cairo/cairosdl.h:151:18: warning: multi-character character cons
  94. -Wmultichar]
  95. +\include\cairo/cairosdl.h:151:30: warning: multi-character character cons
  96. -Wmultichar]
  97. +\include\cairo/cairosdl.h:151:42: warning: character constant too long fo
  98. type [enabled by default]
  99. +\include\cairo/cairosdl.h:152:10: warning: multi-character character cons
  100. -Wmultichar]
  101. +\include\cairo/cairosdl.h:152:18: warning: multi-character character cons
  102. -Wmultichar]
  103. +\include\cairo/cairosdl.h:152:30: warning: multi-character character cons
  104. -Wmultichar]
  105. +\include\cairo/cairosdl.h:152:42: warning: character constant too long fo
  106. type [enabled by default]
  107. +\include\cairo/cairosdl.h:153:10: warning: multi-character character cons
  108. -Wmultichar]
  109. +\include\cairo/cairosdl.h:153:18: warning: multi-character character cons
  110. -Wmultichar]
  111. +\include\cairo/cairosdl.h:153:30: warning: multi-character character cons
  112. -Wmultichar]
  113. +\include\cairo/cairosdl.h:153:42: warning: character constant too long fo
  114. type [enabled by default]
  115. +\include\cairo/cairosdl.h:155:11: warning: character constant too long fo
  116. type [enabled by default]
  117. +\include\cairo/cairosdl.h:155:1: error: stray '#' in program
  118. +\include\cairo/cairosdl.h:181:10: error: #include expects "FILENAME" or <
  119. ME>
  120. +\include\cairo/cairosdl.h:182:10: error: #include expects "FILENAME" or <
  121. ME>
  122. +\include\cairo/cairosdl.h:273:2: error: #endif without #if
  123. +\include\cairo/cairosdl.h:276:12: warning: character constant too long fo
  124. type [enabled by default]
  125. +\include\cairo/cairosdl.h:276:42: error: too many decimal points in numbe
  126.  
  127. +\include\cairo/cairosdl.h:276:65: error: invalid digit "9" in octal const
  128.  
  129. e included from main.cpp:21:0:
  130. +\include\cairo/cairosdl.h:1:1: error: expected unqualified-id before '<'
  131.  
  132. e included from main.cpp:21:0:
  133. +\include\cairo/cairosdl.h:274:1: error: expected unqualified-id before '<
  134. n
  135. e included from c:\mingw\bin\../lib/gcc/mingw32/4.6.1/include/c++/ios:41:0
  136.  
  137.           from c:\mingw\bin\../lib/gcc/mingw32/4.6.1/include/c++/ostream:
  138.  
  139.           from c:\mingw\bin\../lib/gcc/mingw32/4.6.1/include/c++/iostream
  140.  
  141.           from main.cpp:22:
  142. gw\bin\../lib/gcc/mingw32/4.6.1/include/c++/bits/char_traits.h:106:66: err
  143. td::size_t' has not been declared
  144. gw\bin\../lib/gcc/mingw32/4.6.1/include/c++/bits/char_traits.h:108:14: err
  145. ize_t' in namespace 'std' does not name a type
  146. gw\bin\../lib/gcc/mingw32/4.6.1/include/c++/bits/char_traits.h:112:39: err
  147. td::size_t' has not been declared
  148. gw\bin\../lib/gcc/mingw32/4.6.1/include/c++/bits/char_traits.h:115:57: err
  149. td::size_t' has not been declared
  150. gw\bin\../lib/gcc/mingw32/4.6.1/include/c++/bits/char_traits.h:118:57: err
  151. td::size_t' has not been declared
  152. gw\bin\../lib/gcc/mingw32/4.6.1/include/c++/bits/char_traits.h:121:35: err
  153. td::size_t' has not been declared
  154. gw\bin\../lib/gcc/mingw32/4.6.1/include/c++/bits/char_traits.h:147:64: err
  155. td::size_t' has not been declared
  156. gw\bin\../lib/gcc/mingw32/4.6.1/include/c++/bits/char_traits.h: In static
  157.  function 'static int __gnu_cxx::char_traits<_CharT>::compare(const char_t
  158. const char_type*, int)':
  159. gw\bin\../lib/gcc/mingw32/4.6.1/include/c++/bits/char_traits.h:149:12: err
  160. ize_t' is not a member of 'std'
  161. gw\bin\../lib/gcc/mingw32/4.6.1/include/c++/bits/char_traits.h:149:12: not
  162. gested alternative:
  163. gw\bin\../lib/gcc/mingw32/4.6.1/include/stddef.h:212:23: note:   'size_t'
  164. gw\bin\../lib/gcc/mingw32/4.6.1/include/c++/bits/char_traits.h:149:24: err
  165. pected ';' before '__i'
  166. gw\bin\../lib/gcc/mingw32/4.6.1/include/c++/bits/char_traits.h:149:33: err
  167. _i' was not declared in this scope
  168. gw\bin\../lib/gcc/mingw32/4.6.1/include/c++/bits/char_traits.h: At global
  169.  
  170. gw\bin\../lib/gcc/mingw32/4.6.1/include/c++/bits/char_traits.h:158:5: erro
  171. ze_t' in namespace 'std' does not name a type
  172. gw\bin\../lib/gcc/mingw32/4.6.1/include/c++/bits/char_traits.h:171:37: err
  173. td::size_t' has not been declared
  174. gw\bin\../lib/gcc/mingw32/4.6.1/include/c++/bits/char_traits.h: In static
  175.  function 'static const char_type* __gnu_cxx::char_traits<_CharT>::find(co
  176. ar_type*, int, const char_type&)':
  177. gw\bin\../lib/gcc/mingw32/4.6.1/include/c++/bits/char_traits.h:173:12: err
  178. ize_t' is not a member of 'std'
  179. gw\bin\../lib/gcc/mingw32/4.6.1/include/c++/bits/char_traits.h:173:12: not
  180. gested alternative:
  181. gw\bin\../lib/gcc/mingw32/4.6.1/include/stddef.h:212:23: note:   'size_t'
  182. gw\bin\../lib/gcc/mingw32/4.6.1/include/c++/bits/char_traits.h:173:24: err
  183. pected ';' before '__i'
  184. gw\bin\../lib/gcc/mingw32/4.6.1/include/c++/bits/char_traits.h:173:33: err
  185. _i' was not declared in this scope
  186. gw\bin\../lib/gcc/mingw32/4.6.1/include/c++/bits/char_traits.h: At global
  187.  
  188. gw\bin\../lib/gcc/mingw32/4.6.1/include/c++/bits/char_traits.h:182:55: err
  189. td::size_t' has not been declared
  190. gw\bin\../lib/gcc/mingw32/4.6.1/include/c++/bits/char_traits.h:191:55: err
  191. td::size_t' has not been declared
  192. gw\bin\../lib/gcc/mingw32/4.6.1/include/c++/bits/char_traits.h:201:33: err
  193. td::size_t' has not been declared
  194. e included from c:\mingw\bin\../lib/gcc/mingw32/4.6.1/include/c++/ext/new_
  195. tor.h:34:0,
  196.           from c:\mingw\bin\../lib/gcc/mingw32/4.6.1/include/c++/mingw32/
  197. ++allocator.h:34,
  198.           from c:\mingw\bin\../lib/gcc/mingw32/4.6.1/include/c++/bits/all
  199. .h:48,
  200.           from c:\mingw\bin\../lib/gcc/mingw32/4.6.1/include/c++/string:4
  201.  
  202.           from c:\mingw\bin\../lib/gcc/mingw32/4.6.1/include/c++/bits/loc
  203. asses.h:42,
  204.           from c:\mingw\bin\../lib/gcc/mingw32/4.6.1/include/c++/bits/ios
  205. h:43,
  206.           from c:\mingw\bin\../lib/gcc/mingw32/4.6.1/include/c++/ios:43,
  207.           from c:\mingw\bin\../lib/gcc/mingw32/4.6.1/include/c++/ostream:
  208.  
  209.           from c:\mingw\bin\../lib/gcc/mingw32/4.6.1/include/c++/iostream
  210.  
  211.           from main.cpp:22:
  212. gw\bin\../lib/gcc/mingw32/4.6.1/include/c++/new:93:31: error: declaration
  213. erator new' as non-function
  214. gw\bin\../lib/gcc/mingw32/4.6.1/include/c++/new:93:20: error: 'size_t' is
  215. member of 'std'
  216. gw\bin\../lib/gcc/mingw32/4.6.1/include/c++/new:93:20: note: suggested alt
  217. ve:
  218. gw\bin\../lib/gcc/mingw32/4.6.1/include/stddef.h:212:23: note:   'size_t'
  219. gw\bin\../lib/gcc/mingw32/4.6.1/include/c++/new:94:33: error: declaration
  220. erator new []' as non-function
  221. gw\bin\../lib/gcc/mingw32/4.6.1/include/c++/new:94:22: error: 'size_t' is
  222. member of 'std'
  223. gw\bin\../lib/gcc/mingw32/4.6.1/include/c++/new:94:22: note: suggested alt
  224. ve:
  225. gw\bin\../lib/gcc/mingw32/4.6.1/include/stddef.h:212:23: note:   'size_t'
  226. gw\bin\../lib/gcc/mingw32/4.6.1/include/c++/new:97:25: error: declaration
  227. erator new' as non-function
  228. gw\bin\../lib/gcc/mingw32/4.6.1/include/c++/new:97:20: error: 'size_t' is
  229. member of 'std'
  230. gw\bin\../lib/gcc/mingw32/4.6.1/include/c++/new:97:20: note: suggested alt
  231. ve:
  232. gw\bin\../lib/gcc/mingw32/4.6.1/include/stddef.h:212:23: note:   'size_t'
  233. gw\bin\../lib/gcc/mingw32/4.6.1/include/c++/new:97:33: error: expected pri
  234. xpression before 'const'
  235. gw\bin\../lib/gcc/mingw32/4.6.1/include/c++/new:98:27: error: declaration
  236. erator new []' as non-function
  237. gw\bin\../lib/gcc/mingw32/4.6.1/include/c++/new:98:22: error: 'size_t' is
  238. member of 'std'
  239. gw\bin\../lib/gcc/mingw32/4.6.1/include/c++/new:98:22: note: suggested alt
  240. ve:
  241. gw\bin\../lib/gcc/mingw32/4.6.1/include/stddef.h:212:23: note:   'size_t'
  242. gw\bin\../lib/gcc/mingw32/4.6.1/include/c++/new:98:35: error: expected pri
  243. xpression before 'const'
  244. gw\bin\../lib/gcc/mingw32/4.6.1/include/c++/new:103:32: error: declaration
  245. perator new' as non-function
  246. gw\bin\../lib/gcc/mingw32/4.6.1/include/c++/new:103:27: error: 'size_t' is
  247.  member of 'std'
  248. gw\bin\../lib/gcc/mingw32/4.6.1/include/c++/new:103:27: note: suggested al
  249. ive:
  250. gw\bin\../lib/gcc/mingw32/4.6.1/include/stddef.h:212:23: note:   'size_t'
  251. gw\bin\../lib/gcc/mingw32/4.6.1/include/c++/new:103:40: error: expected pr
  252. expression before 'void'
  253. gw\bin\../lib/gcc/mingw32/4.6.1/include/c++/new:104:34: error: declaration
  254. perator new []' as non-function
  255. gw\bin\../lib/gcc/mingw32/4.6.1/include/c++/new:104:29: error: 'size_t' is
  256. member of 'std'
  257. gw\bin\../lib/gcc/mingw32/4.6.1/include/c++/new:104:29: note: suggested al
  258. ive:
  259. gw\bin\../lib/gcc/mingw32/4.6.1/include/stddef.h:212:23: note:   'size_t'
  260. gw\bin\../lib/gcc/mingw32/4.6.1/include/c++/new:104:42: error: expected pr
  261. expression before 'void'
  262. e included from c:\mingw\bin\../lib/gcc/mingw32/4.6.1/include/c++/mingw32/
  263. ++allocator.h:34:0,
  264.           from c:\mingw\bin\../lib/gcc/mingw32/4.6.1/include/c++/bits/all
  265. .h:48,
  266.           from c:\mingw\bin\../lib/gcc/mingw32/4.6.1/include/c++/string:4
  267.  
  268.           from c:\mingw\bin\../lib/gcc/mingw32/4.6.1/include/c++/bits/loc
  269. asses.h:42,
  270.           from c:\mingw\bin\../lib/gcc/mingw32/4.6.1/include/c++/bits/ios
  271. h:43,
  272.           from c:\mingw\bin\../lib/gcc/mingw32/4.6.1/include/c++/ios:43,
  273.           from c:\mingw\bin\../lib/gcc/mingw32/4.6.1/include/c++/ostream:
  274.  
  275.           from c:\mingw\bin\../lib/gcc/mingw32/4.6.1/include/c++/iostream
  276.  
  277.           from main.cpp:22:
  278. gw\bin\../lib/gcc/mingw32/4.6.1/include/c++/ext/new_allocator.h:42:14: err
  279. td::size_t' has not been declared
  280. gw\bin\../lib/gcc/mingw32/4.6.1/include/c++/ext/new_allocator.h:43:14: err
  281. td::ptrdiff_t' has not been declared
  282. pp: In function 'int main(int, char**)':
  283. pp:175:39: error: 'cairosdl_create' was not declared in this scope
  284. pp:181:21: error: 'cairosdl_destroy' was not declared in this scope
  285. pp:192:19: error: 'surface' was not declared in this scope
  286. 2-make: *** [ChocoboRacer] Error 1
  287.  
  288. rs\NoobMachine\My Documents\programs\Games\Chocobo Racer>mingw32-make -f m
  289. e
  290. 2-g++ main.cpp  -o CR -lmingw32 -lwinmm -lSDLmain -lSDL -lcairo -lSDL_imag
  291. L_ttf -lSDL_Mixer -I"C:\gtk+\include\cairo" -I"C:\\SDL-1.2.14\\include"  -
  292. DL-1.2.14\\lib" -L"C:\gtk+\lib"
  293. pp: In function 'int main(int, char**)':
  294. pp:174:48: error: 'cairosdl_surface_create' was not declared in this scope
  295.  
  296. pp:180:21: error: 'cairosdl_destroy' was not declared in this scope
  297. pp:191:19: error: 'surface' was not declared in this scope
  298. 2-make: *** [ChocoboRacer] Error 1
  299.  
  300. rs\NoobMachine\My Documents\programs\Games\Chocobo Racer>
clone this paste RAW Paste Data