Not a member of Pastebin yet?
Sign Up,
it unlocks many cool features!
- Started by user User Name
- Building in workspace /opt/bitnami/apps/jenkins/jenkins_home/jobs/fivhter/workspace
- > /opt/bitnami/git/bin/git rev-parse --is-inside-work-tree # timeout=10
- Fetching changes from the remote Git repository
- > /opt/bitnami/git/bin/git config remote.origin.url https://lucasimonetti.projecthut.com/git/Fivhter-v2.git # timeout=10
- Fetching upstream changes from https://lucasimonetti.projecthut.com/git/Fivhter-v2.git
- > /opt/bitnami/git/bin/git --version # timeout=10
- using .gitcredentials to set credentials
- > /opt/bitnami/git/bin/git config --local credential.helper store --file=/opt/bitnami/apache-tomcat/temp/git6771161596569802148.credentials # timeout=10
- > /opt/bitnami/git/bin/git fetch --tags --progress https://lucasimonetti.projecthut.com/git/Fivhter-v2.git +refs/heads/*:refs/remotes/origin/*
- > /opt/bitnami/git/bin/git config --local --remove-section credential # timeout=10
- > /opt/bitnami/git/bin/git rev-parse refs/remotes/origin/master^{commit} # timeout=10
- > /opt/bitnami/git/bin/git rev-parse refs/remotes/origin/origin/master^{commit} # timeout=10
- Checking out Revision 101a2fc6167b2ce2e3d9be5c38b5d43c89093abe (refs/remotes/origin/master)
- > /opt/bitnami/git/bin/git config core.sparsecheckout # timeout=10
- > /opt/bitnami/git/bin/git checkout -f 101a2fc6167b2ce2e3d9be5c38b5d43c89093abe
- > /opt/bitnami/git/bin/git rev-list 101a2fc6167b2ce2e3d9be5c38b5d43c89093abe # timeout=10
- [Gradle] - Launching build.
- [workspace] $ /opt/bitnami/gradle/bin/gradle
- Could not load Logmanager "org.apache.juli.ClassLoaderLogManager"
- java.lang.ClassNotFoundException: org.apache.juli.ClassLoaderLogManager
- at java.net.URLClassLoader$1.run(Unknown Source)
- at java.net.URLClassLoader$1.run(Unknown Source)
- at java.security.AccessController.doPrivileged(Native Method)
- at java.net.URLClassLoader.findClass(Unknown Source)
- at java.lang.ClassLoader.loadClass(Unknown Source)
- at java.lang.ClassLoader.loadClass(Unknown Source)
- at java.util.logging.LogManager$1.run(Unknown Source)
- at java.security.AccessController.doPrivileged(Native Method)
- at java.util.logging.LogManager.<clinit>(Unknown Source)
- at org.gradle.logging.internal.JavaUtilLoggingConfigurer.configure(JavaUtilLoggingConfigurer.java:36)
- at org.gradle.logging.internal.DefaultLoggingConfigurer.configure(DefaultLoggingConfigurer.java:34)
- at org.gradle.logging.internal.LoggingSystemAdapter.setLevel(LoggingSystemAdapter.java:55)
- at org.gradle.logging.internal.LoggingSystemAdapter.on(LoggingSystemAdapter.java:42)
- at org.gradle.logging.internal.DefaultLoggingManager$StartableLoggingSystem.start(DefaultLoggingManager.java:173)
- at org.gradle.logging.internal.DefaultLoggingManager.start(DefaultLoggingManager.java:58)
- at org.gradle.logging.internal.DefaultLoggingManager.start(DefaultLoggingManager.java:29)
- at org.gradle.launcher.cli.CommandLineActionFactory$WithLogging.execute(CommandLineActionFactory.java:201)
- at org.gradle.launcher.cli.CommandLineActionFactory$WithLogging.execute(CommandLineActionFactory.java:169)
- at org.gradle.launcher.cli.ExceptionReportingAction.execute(ExceptionReportingAction.java:33)
- at org.gradle.launcher.cli.ExceptionReportingAction.execute(ExceptionReportingAction.java:22)
- at org.gradle.launcher.Main.doAction(Main.java:33)
- at org.gradle.launcher.bootstrap.EntryPoint.run(EntryPoint.java:45)
- at sun.reflect.NativeMethodAccessorImpl.invoke0(Native Method)
- at sun.reflect.NativeMethodAccessorImpl.invoke(Unknown Source)
- at sun.reflect.DelegatingMethodAccessorImpl.invoke(Unknown Source)
- at java.lang.reflect.Method.invoke(Unknown Source)
- at org.gradle.launcher.bootstrap.ProcessBootstrap.runNoExit(ProcessBootstrap.java:54)
- at org.gradle.launcher.bootstrap.ProcessBootstrap.run(ProcessBootstrap.java:35)
- at org.gradle.launcher.GradleMain.main(GradleMain.java:23)
- :help
- Welcome to Gradle 2.2.1.
- To run a build, run gradle <task> ...
- To see a list of available tasks, run gradle tasks
- To see a list of command-line options, run gradle --help
- BUILD SUCCESSFUL
- Total time: 36.003 secs
- Build step 'Invoke Gradle script' changed build result to SUCCESS
- [workspace] $ /bin/sh -xe /opt/bitnami/apache-tomcat/temp/hudson6366764591617063929.sh
- + gradle build --stacktrace --info --debug
- Could not load Logmanager "org.apache.juli.ClassLoaderLogManager"
- java.lang.ClassNotFoundException: org.apache.juli.ClassLoaderLogManager
- at java.net.URLClassLoader$1.run(Unknown Source)
- at java.net.URLClassLoader$1.run(Unknown Source)
- at java.security.AccessController.doPrivileged(Native Method)
- at java.net.URLClassLoader.findClass(Unknown Source)
- at java.lang.ClassLoader.loadClass(Unknown Source)
- at java.lang.ClassLoader.loadClass(Unknown Source)
- at java.util.logging.LogManager$1.run(Unknown Source)
- at java.security.AccessController.doPrivileged(Native Method)
- at java.util.logging.LogManager.<clinit>(Unknown Source)
- at org.gradle.logging.internal.JavaUtilLoggingConfigurer.configure(JavaUtilLoggingConfigurer.java:36)
- at org.gradle.logging.internal.DefaultLoggingConfigurer.configure(DefaultLoggingConfigurer.java:34)
- at org.gradle.logging.internal.LoggingSystemAdapter.setLevel(LoggingSystemAdapter.java:55)
- at org.gradle.logging.internal.LoggingSystemAdapter.on(LoggingSystemAdapter.java:42)
- at org.gradle.logging.internal.DefaultLoggingManager$StartableLoggingSystem.start(DefaultLoggingManager.java:173)
- at org.gradle.logging.internal.DefaultLoggingManager.start(DefaultLoggingManager.java:58)
- at org.gradle.logging.internal.DefaultLoggingManager.start(DefaultLoggingManager.java:29)
- at org.gradle.launcher.cli.CommandLineActionFactory$WithLogging.execute(CommandLineActionFactory.java:201)
- at org.gradle.launcher.cli.CommandLineActionFactory$WithLogging.execute(CommandLineActionFactory.java:169)
- at org.gradle.launcher.cli.ExceptionReportingAction.execute(ExceptionReportingAction.java:33)
- at org.gradle.launcher.cli.ExceptionReportingAction.execute(ExceptionReportingAction.java:22)
- at org.gradle.launcher.Main.doAction(Main.java:33)
- at org.gradle.launcher.bootstrap.EntryPoint.run(EntryPoint.java:45)
- at sun.reflect.NativeMethodAccessorImpl.invoke0(Native Method)
- at sun.reflect.NativeMethodAccessorImpl.invoke(Unknown Source)
- at sun.reflect.DelegatingMethodAccessorImpl.invoke(Unknown Source)
- at java.lang.reflect.Method.invoke(Unknown Source)
- at org.gradle.launcher.bootstrap.ProcessBootstrap.runNoExit(ProcessBootstrap.java:54)
- at org.gradle.launcher.bootstrap.ProcessBootstrap.run(ProcessBootstrap.java:35)
- at org.gradle.launcher.GradleMain.main(GradleMain.java:23)
- 10:17:00.056 [DEBUG] [org.gradle.internal.nativeintegration.services.NativeServices] Unable to initialize native-platform. Failure: net.rubygrapefruit.platform.NativeException: Failed to load native library 'libnative-platform.so' for Linux amd64.
- caused by: java.io.IOException: No such file or directory
- 10:17:03.257 [ERROR] [org.gradle.BuildExceptionReporter]
- 10:17:03.260 [ERROR] [org.gradle.BuildExceptionReporter] FAILURE: Build failed with an exception.
- 10:17:03.261 [ERROR] [org.gradle.BuildExceptionReporter]
- 10:17:03.261 [ERROR] [org.gradle.BuildExceptionReporter] * What went wrong:
- 10:17:03.262 [ERROR] [org.gradle.BuildExceptionReporter] Could not create an instance of type org.gradle.invocation.DefaultGradle_Decorated.
- 10:17:03.262 [ERROR] [org.gradle.BuildExceptionReporter]
- 10:17:03.263 [ERROR] [org.gradle.BuildExceptionReporter] * Exception is:
- 10:17:03.265 [ERROR] [org.gradle.BuildExceptionReporter] org.gradle.internal.reflect.ObjectInstantiationException: Could not create an instance of type org.gradle.invocation.DefaultGradle_Decorated.
- 10:17:03.265 [ERROR] [org.gradle.BuildExceptionReporter] at org.gradle.internal.reflect.DirectInstantiator.newInstance(DirectInstantiator.java:41)
- 10:17:03.266 [ERROR] [org.gradle.BuildExceptionReporter] at org.gradle.api.internal.ClassGeneratorBackedInstantiator.newInstance(ClassGeneratorBackedInstantiator.java:36)
- 10:17:03.266 [ERROR] [org.gradle.BuildExceptionReporter] at org.gradle.initialization.DefaultGradleLauncherFactory.doNewInstance(DefaultGradleLauncherFactory.java:116)
- 10:17:03.267 [ERROR] [org.gradle.BuildExceptionReporter] at org.gradle.initialization.DefaultGradleLauncherFactory.newInstance(DefaultGradleLauncherFactory.java:85)
- 10:17:03.267 [ERROR] [org.gradle.BuildExceptionReporter] at org.gradle.initialization.DefaultGradleLauncherFactory.newInstance(DefaultGradleLauncherFactory.java:48)
- 10:17:03.268 [ERROR] [org.gradle.BuildExceptionReporter] at org.gradle.launcher.exec.InProcessBuildActionExecuter$DefaultBuildController.getLauncher(InProcessBuildActionExecuter.java:69)
- 10:17:03.268 [ERROR] [org.gradle.BuildExceptionReporter] at org.gradle.launcher.exec.InProcessBuildActionExecuter$DefaultBuildController.run(InProcessBuildActionExecuter.java:80)
- 10:17:03.269 [ERROR] [org.gradle.BuildExceptionReporter] at org.gradle.launcher.cli.ExecuteBuildAction.run(ExecuteBuildAction.java:33)
- 10:17:03.269 [ERROR] [org.gradle.BuildExceptionReporter] at org.gradle.launcher.cli.ExecuteBuildAction.run(ExecuteBuildAction.java:24)
- 10:17:03.270 [ERROR] [org.gradle.BuildExceptionReporter] at org.gradle.launcher.exec.InProcessBuildActionExecuter.execute(InProcessBuildActionExecuter.java:36)
- 10:17:03.270 [ERROR] [org.gradle.BuildExceptionReporter] at org.gradle.launcher.exec.InProcessBuildActionExecuter.execute(InProcessBuildActionExecuter.java:26)
- 10:17:03.271 [ERROR] [org.gradle.BuildExceptionReporter] at org.gradle.launcher.cli.RunBuildAction.run(RunBuildAction.java:51)
- 10:17:03.271 [ERROR] [org.gradle.BuildExceptionReporter] at org.gradle.internal.Actions$RunnableActionAdapter.execute(Actions.java:171)
- 10:17:03.272 [ERROR] [org.gradle.BuildExceptionReporter] at org.gradle.launcher.cli.CommandLineActionFactory$ParseAndBuildAction.execute(CommandLineActionFactory.java:237)
- 10:17:03.272 [ERROR] [org.gradle.BuildExceptionReporter] at org.gradle.launcher.cli.CommandLineActionFactory$ParseAndBuildAction.execute(CommandLineActionFactory.java:210)
- 10:17:03.273 [ERROR] [org.gradle.BuildExceptionReporter] at org.gradle.launcher.cli.JavaRuntimeValidationAction.execute(JavaRuntimeValidationAction.java:35)
- 10:17:03.273 [ERROR] [org.gradle.BuildExceptionReporter] at org.gradle.launcher.cli.JavaRuntimeValidationAction.execute(JavaRuntimeValidationAction.java:24)
- 10:17:03.273 [ERROR] [org.gradle.BuildExceptionReporter] at org.gradle.launcher.cli.CommandLineActionFactory$WithLogging.execute(CommandLineActionFactory.java:206)
- 10:17:03.274 [ERROR] [org.gradle.BuildExceptionReporter] at org.gradle.launcher.cli.CommandLineActionFactory$WithLogging.execute(CommandLineActionFactory.java:169)
- 10:17:03.274 [ERROR] [org.gradle.BuildExceptionReporter] at org.gradle.launcher.cli.ExceptionReportingAction.execute(ExceptionReportingAction.java:33)
- 10:17:03.275 [ERROR] [org.gradle.BuildExceptionReporter] at org.gradle.launcher.cli.ExceptionReportingAction.execute(ExceptionReportingAction.java:22)
- 10:17:03.275 [ERROR] [org.gradle.BuildExceptionReporter] at org.gradle.launcher.Main.doAction(Main.java:33)
- 10:17:03.276 [ERROR] [org.gradle.BuildExceptionReporter] at org.gradle.launcher.bootstrap.EntryPoint.run(EntryPoint.java:45)
- 10:17:03.276 [ERROR] [org.gradle.BuildExceptionReporter] at sun.reflect.NativeMethodAccessorImpl.invoke0(Native Method)
- 10:17:03.277 [ERROR] [org.gradle.BuildExceptionReporter] at sun.reflect.NativeMethodAccessorImpl.invoke(Unknown Source)
- 10:17:03.277 [ERROR] [org.gradle.BuildExceptionReporter] at sun.reflect.DelegatingMethodAccessorImpl.invoke(Unknown Source)
- 10:17:03.278 [ERROR] [org.gradle.BuildExceptionReporter] at java.lang.reflect.Method.invoke(Unknown Source)
- 10:17:03.278 [ERROR] [org.gradle.BuildExceptionReporter] at org.gradle.launcher.bootstrap.ProcessBootstrap.runNoExit(ProcessBootstrap.java:54)
- 10:17:03.279 [ERROR] [org.gradle.BuildExceptionReporter] at org.gradle.launcher.bootstrap.ProcessBootstrap.run(ProcessBootstrap.java:35)
- 10:17:03.279 [ERROR] [org.gradle.BuildExceptionReporter] at org.gradle.launcher.GradleMain.main(GradleMain.java:23)
- 10:17:03.280 [ERROR] [org.gradle.BuildExceptionReporter] Caused by: org.gradle.internal.service.ServiceCreationException: Could not create service of type ScriptPluginFactory using BuildScopeServices.createScriptObjectConfigurerFactory().
- 10:17:03.280 [ERROR] [org.gradle.BuildExceptionReporter] at org.gradle.internal.service.DefaultServiceRegistry$FactoryMethodService.invokeMethod(DefaultServiceRegistry.java:643)
- 10:17:03.281 [ERROR] [org.gradle.BuildExceptionReporter] at org.gradle.internal.service.DefaultServiceRegistry$FactoryService.create(DefaultServiceRegistry.java:597)
- 10:17:03.281 [ERROR] [org.gradle.BuildExceptionReporter] at org.gradle.internal.service.DefaultServiceRegistry$ManagedObjectProvider.getInstance(DefaultServiceRegistry.java:439)
- 10:17:03.282 [ERROR] [org.gradle.BuildExceptionReporter] at org.gradle.internal.service.DefaultServiceRegistry$SingletonService.get(DefaultServiceRegistry.java:479)
- 10:17:03.282 [ERROR] [org.gradle.BuildExceptionReporter] at org.gradle.internal.service.DefaultServiceRegistry.doGet(DefaultServiceRegistry.java:300)
- 10:17:03.283 [ERROR] [org.gradle.BuildExceptionReporter] at org.gradle.internal.service.DefaultServiceRegistry.get(DefaultServiceRegistry.java:288)
- 10:17:03.283 [ERROR] [org.gradle.BuildExceptionReporter] at org.gradle.internal.service.DefaultServiceRegistry$ParentServices.getService(DefaultServiceRegistry.java:851)
- 10:17:03.284 [ERROR] [org.gradle.BuildExceptionReporter] at org.gradle.internal.service.DefaultServiceRegistry$CompositeProvider.getService(DefaultServiceRegistry.java:796)
- 10:17:03.284 [ERROR] [org.gradle.BuildExceptionReporter] at org.gradle.internal.service.DefaultServiceRegistry$CompositeProvider.getService(DefaultServiceRegistry.java:796)
- 10:17:03.284 [ERROR] [org.gradle.BuildExceptionReporter] at org.gradle.internal.service.DefaultServiceRegistry$DefaultLookupContext.find(DefaultServiceRegistry.java:986)
- 10:17:03.285 [ERROR] [org.gradle.BuildExceptionReporter] at org.gradle.internal.service.DefaultServiceRegistry.doGet(DefaultServiceRegistry.java:298)
- 10:17:03.285 [ERROR] [org.gradle.BuildExceptionReporter] at org.gradle.internal.service.DefaultServiceRegistry.get(DefaultServiceRegistry.java:284)
- 10:17:03.286 [ERROR] [org.gradle.BuildExceptionReporter] at org.gradle.invocation.DefaultGradle.<init>(DefaultGradle.java:79)
- 10:17:03.286 [ERROR] [org.gradle.BuildExceptionReporter] at org.gradle.invocation.DefaultGradle_Decorated.<init>(Unknown Source)
- 10:17:03.287 [ERROR] [org.gradle.BuildExceptionReporter] at sun.reflect.NativeConstructorAccessorImpl.newInstance0(Native Method)
- 10:17:03.287 [ERROR] [org.gradle.BuildExceptionReporter] at sun.reflect.NativeConstructorAccessorImpl.newInstance(Unknown Source)
- 10:17:03.288 [ERROR] [org.gradle.BuildExceptionReporter] at sun.reflect.DelegatingConstructorAccessorImpl.newInstance(Unknown Source)
- 10:17:03.288 [ERROR] [org.gradle.BuildExceptionReporter] at java.lang.reflect.Constructor.newInstance(Unknown Source)
- 10:17:03.289 [ERROR] [org.gradle.BuildExceptionReporter] at org.gradle.internal.reflect.DirectInstantiator.newInstance(DirectInstantiator.java:39)
- 10:17:03.289 [ERROR] [org.gradle.BuildExceptionReporter] ... 29 more
- 10:17:03.290 [ERROR] [org.gradle.BuildExceptionReporter] Caused by: org.gradle.internal.service.ServiceCreationException: Could not create service of type PluginResolutionServiceClient using BuildScopeServices.createPluginResolutionServiceClient().
- 10:17:03.290 [ERROR] [org.gradle.BuildExceptionReporter] at org.gradle.internal.service.DefaultServiceRegistry$FactoryMethodService.invokeMethod(DefaultServiceRegistry.java:643)
- 10:17:03.291 [ERROR] [org.gradle.BuildExceptionReporter] at org.gradle.internal.service.DefaultServiceRegistry$FactoryService.create(DefaultServiceRegistry.java:597)
- 10:17:03.291 [ERROR] [org.gradle.BuildExceptionReporter] at org.gradle.internal.service.DefaultServiceRegistry$ManagedObjectProvider.getInstance(DefaultServiceRegistry.java:439)
- 10:17:03.292 [ERROR] [org.gradle.BuildExceptionReporter] at org.gradle.internal.service.DefaultServiceRegistry$SingletonService.get(DefaultServiceRegistry.java:479)
- 10:17:03.292 [ERROR] [org.gradle.BuildExceptionReporter] at org.gradle.internal.service.DefaultServiceRegistry$FactoryService.assembleParameters(DefaultServiceRegistry.java:607)
- 10:17:03.293 [ERROR] [org.gradle.BuildExceptionReporter] at org.gradle.internal.service.DefaultServiceRegistry$FactoryService.create(DefaultServiceRegistry.java:596)
- 10:17:03.293 [ERROR] [org.gradle.BuildExceptionReporter] at org.gradle.internal.service.DefaultServiceRegistry$ManagedObjectProvider.getInstance(DefaultServiceRegistry.java:439)
- 10:17:03.294 [ERROR] [org.gradle.BuildExceptionReporter] at org.gradle.internal.service.DefaultServiceRegistry$SingletonService.get(DefaultServiceRegistry.java:479)
- 10:17:03.295 [ERROR] [org.gradle.BuildExceptionReporter] at org.gradle.internal.service.DefaultServiceRegistry$FactoryService.assembleParameters(DefaultServiceRegistry.java:607)
- 10:17:03.295 [ERROR] [org.gradle.BuildExceptionReporter] at org.gradle.internal.service.DefaultServiceRegistry$FactoryService.create(DefaultServiceRegistry.java:596)
- 10:17:03.296 [ERROR] [org.gradle.BuildExceptionReporter] at org.gradle.internal.service.DefaultServiceRegistry$ManagedObjectProvider.getInstance(DefaultServiceRegistry.java:439)
- 10:17:03.297 [ERROR] [org.gradle.BuildExceptionReporter] at org.gradle.internal.service.DefaultServiceRegistry$SingletonService.get(DefaultServiceRegistry.java:479)
- 10:17:03.298 [ERROR] [org.gradle.BuildExceptionReporter] at org.gradle.internal.service.DefaultServiceRegistry$FactoryService.assembleParameters(DefaultServiceRegistry.java:607)
- 10:17:03.299 [ERROR] [org.gradle.BuildExceptionReporter] at org.gradle.internal.service.DefaultServiceRegistry$FactoryService.create(DefaultServiceRegistry.java:596)
- 10:17:03.299 [ERROR] [org.gradle.BuildExceptionReporter] at org.gradle.internal.service.DefaultServiceRegistry$ManagedObjectProvider.getInstance(DefaultServiceRegistry.java:439)
- 10:17:03.300 [ERROR] [org.gradle.BuildExceptionReporter] at org.gradle.internal.service.DefaultServiceRegistry$SingletonService.get(DefaultServiceRegistry.java:479)
- 10:17:03.300 [ERROR] [org.gradle.BuildExceptionReporter] at org.gradle.internal.service.DefaultServiceRegistry.doGet(DefaultServiceRegistry.java:300)
- 10:17:03.301 [ERROR] [org.gradle.BuildExceptionReporter] at org.gradle.internal.service.DefaultServiceRegistry.get(DefaultServiceRegistry.java:284)
- 10:17:03.301 [ERROR] [org.gradle.BuildExceptionReporter] at org.gradle.internal.service.scopes.BuildScopeServices.createScriptObjectConfigurerFactory(BuildScopeServices.java:212)
- 10:17:03.302 [ERROR] [org.gradle.BuildExceptionReporter] at sun.reflect.NativeMethodAccessorImpl.invoke0(Native Method)
- 10:17:03.302 [ERROR] [org.gradle.BuildExceptionReporter] at sun.reflect.NativeMethodAccessorImpl.invoke(Unknown Source)
- 10:17:03.303 [ERROR] [org.gradle.BuildExceptionReporter] at sun.reflect.DelegatingMethodAccessorImpl.invoke(Unknown Source)
- 10:17:03.303 [ERROR] [org.gradle.BuildExceptionReporter] at java.lang.reflect.Method.invoke(Unknown Source)
- 10:17:03.305 [ERROR] [org.gradle.BuildExceptionReporter] at org.gradle.internal.reflect.JavaMethod.invoke(JavaMethod.java:63)
- 10:17:03.305 [ERROR] [org.gradle.BuildExceptionReporter] at org.gradle.internal.service.DefaultServiceRegistry.invoke(DefaultServiceRegistry.java:328)
- 10:17:03.310 [ERROR] [org.gradle.BuildExceptionReporter] at org.gradle.internal.service.DefaultServiceRegistry.access$1200(DefaultServiceRegistry.java:58)
- 10:17:03.310 [ERROR] [org.gradle.BuildExceptionReporter] at org.gradle.internal.service.DefaultServiceRegistry$FactoryMethodService.invokeMethod(DefaultServiceRegistry.java:641)
- 10:17:03.311 [ERROR] [org.gradle.BuildExceptionReporter] ... 47 more
- 10:17:03.314 [ERROR] [org.gradle.BuildExceptionReporter] Caused by: org.gradle.api.UncheckedIOException: Failed to create parent directory '/opt/bitnami/.gradle' when creating directory '/opt/bitnami/.gradle/caches/2.2.1/plugin-resolution'
- 10:17:03.315 [ERROR] [org.gradle.BuildExceptionReporter] at org.gradle.util.GFileUtils.mkdirs(GFileUtils.java:283)
- 10:17:03.316 [ERROR] [org.gradle.BuildExceptionReporter] at org.gradle.cache.internal.DefaultPersistentDirectoryStore.open(DefaultPersistentDirectoryStore.java:43)
- 10:17:03.316 [ERROR] [org.gradle.BuildExceptionReporter] at org.gradle.cache.internal.DefaultPersistentDirectoryStore.open(DefaultPersistentDirectoryStore.java:28)
- 10:17:03.317 [ERROR] [org.gradle.BuildExceptionReporter] at org.gradle.cache.internal.DefaultCacheFactory.doOpen(DefaultCacheFactory.java:80)
- 10:17:03.318 [ERROR] [org.gradle.BuildExceptionReporter] at org.gradle.cache.internal.DefaultCacheFactory.open(DefaultCacheFactory.java:50)
- 10:17:03.319 [ERROR] [org.gradle.BuildExceptionReporter] at org.gradle.cache.internal.DefaultCacheRepository$PersistentCacheBuilder.doOpen(DefaultCacheRepository.java:138)
- 10:17:03.322 [ERROR] [org.gradle.BuildExceptionReporter] at org.gradle.cache.internal.DefaultCacheRepository$AbstractCacheBuilder.open(DefaultCacheRepository.java:121)
- 10:17:03.323 [ERROR] [org.gradle.BuildExceptionReporter] at org.gradle.plugin.use.internal.PluginUsePluginServiceRegistry$BuildScopeServices.createPluginResolutionServiceClient(PluginUsePluginServiceRegistry.java:69)
- 10:17:03.323 [ERROR] [org.gradle.BuildExceptionReporter] at sun.reflect.NativeMethodAccessorImpl.invoke0(Native Method)
- 10:17:03.324 [ERROR] [org.gradle.BuildExceptionReporter] at sun.reflect.NativeMethodAccessorImpl.invoke(Unknown Source)
- 10:17:03.324 [ERROR] [org.gradle.BuildExceptionReporter] at sun.reflect.DelegatingMethodAccessorImpl.invoke(Unknown Source)
- 10:17:03.325 [ERROR] [org.gradle.BuildExceptionReporter] at java.lang.reflect.Method.invoke(Unknown Source)
- 10:17:03.326 [ERROR] [org.gradle.BuildExceptionReporter] at org.gradle.internal.reflect.JavaMethod.invoke(JavaMethod.java:63)
- 10:17:03.331 [ERROR] [org.gradle.BuildExceptionReporter] at org.gradle.internal.service.DefaultServiceRegistry.invoke(DefaultServiceRegistry.java:328)
- 10:17:03.331 [ERROR] [org.gradle.BuildExceptionReporter] at org.gradle.internal.service.DefaultServiceRegistry.access$1200(DefaultServiceRegistry.java:58)
- 10:17:03.332 [ERROR] [org.gradle.BuildExceptionReporter] at org.gradle.internal.service.DefaultServiceRegistry$FactoryMethodService.invokeMethod(DefaultServiceRegistry.java:641)
- 10:17:03.332 [ERROR] [org.gradle.BuildExceptionReporter] ... 73 more
- 10:17:03.333 [ERROR] [org.gradle.BuildExceptionReporter]
- Build step 'Execute shell' marked build as failure
- Finished: FAILURE
Advertisement
Add Comment
Please, Sign In to add comment