ftraian

libboost-bitcoin-error

Jun 17th, 2014
379
0
Never
Not a member of Pastebin yet? Sign Up, it unlocks many cool features!
Bash 101.38 KB | None | 0 0
  1. This file contains any messages produced by compilers while
  2. running configure, to aid debugging if configure makes a mistake.
  3.  
  4. It was created by Bitcoin Core configure 0.9.0, which was
  5. generated by GNU Autoconf 2.69.  Invocation command line was
  6.  
  7.   $ ./configure --enable-logging --enable-debug --enable-dht --with-boost-libdir=/home/<username>/Downloads/boost_1_53_0/stage/lib
  8.  
  9. ## --------- ##
  10. ## Platform. ##
  11. ## --------- ##
  12.  
  13. hostname = U36SG
  14. uname -m = x86_64
  15. uname -r = 3.5.0-44-generic
  16. uname -s = Linux
  17. uname -v = #67-Ubuntu SMP Tue Nov 12 19:36:14 UTC 2013
  18.  
  19. /usr/bin/uname -p = unknown
  20. /bin/uname -X     = unknown
  21.  
  22. /bin/arch              = unknown
  23. /usr/bin/arch -k       = unknown
  24. /usr/convex/getsysinfo = unknown
  25. /usr/bin/hostinfo      = unknown
  26. /bin/machine           = unknown
  27. /usr/bin/oslevel       = unknown
  28. /bin/universe          = unknown
  29.  
  30. PATH: /usr/local/heroku/bin
  31. PATH: /home/<username>/tools/java/play-2.2.2
  32. PATH: /home/<username>/tools/apache-maven-3.2.1/bin
  33. PATH: /home/<username>/tools/adt-bundle-linux-x86_64-20130917/sdk/platform-tools
  34. PATH: /home/<username>/tools/adt-bundle-linux-x86_64-20130917/sdk/tools
  35. PATH: /home/<username>/tools/js/Sublime Text 2
  36. PATH: /home/<username>/bin
  37. PATH: /usr/local/sbin
  38. PATH: /usr/local/bin
  39. PATH: /usr/sbin
  40. PATH: /usr/bin
  41. PATH: /sbin
  42. PATH: /bin
  43. PATH: /usr/games
  44. PATH: /usr/local/games
  45.  
  46.  
  47. ## ----------- ##
  48. ## Core tests. ##
  49. ## ----------- ##
  50.  
  51. configure:2605: checking build system type
  52. configure:2619: result: x86_64-unknown-linux-gnu
  53. configure:2639: checking host system type
  54. configure:2652: result: x86_64-unknown-linux-gnu
  55. configure:2793: checking for a BSD-compatible install
  56. configure:2861: result: /usr/bin/install -c
  57. configure:2872: checking whether build environment is sane
  58. configure:2922: result: yes
  59. configure:3063: checking for a thread-safe mkdir -p
  60. configure:3102: result: /bin/mkdir -p
  61. configure:3115: checking for gawk
  62. configure:3131: found /usr/bin/gawk
  63. configure:3142: result: gawk
  64. configure:3153: checking whether make sets $(MAKE)
  65. configure:3175: result: yes
  66. configure:3248: checking whether to enable maintainer-specific portions of Makefiles
  67. configure:3257: result: yes
  68. configure:3282: checking whether make supports nested variables
  69. configure:3299: result: yes
  70. configure:3473: checking for g++
  71. configure:3489: found /usr/bin/g++
  72. configure:3500: result: g++
  73. configure:3527: checking for C++ compiler version
  74. configure:3536: g++ --version >&5
  75. g++ (Ubuntu/Linaro 4.7.2-2ubuntu1) 4.7.2
  76. Copyright (C) 2012 Free Software Foundation, Inc.
  77. This is free software; see the source for copying conditions.  There is NO
  78. warranty; not even for MERCHANTABILITY or FITNESS FOR A PARTICULAR PURPOSE.
  79.  
  80. configure:3547: $? = 0
  81. configure:3536: g++ -v >&5
  82. Using built-in specs.
  83. COLLECT_GCC=g++
  84. COLLECT_LTO_WRAPPER=/usr/lib/gcc/x86_64-linux-gnu/4.7/lto-wrapper
  85. Target: x86_64-linux-gnu
  86. Configured with: ../src/configure -v --with-pkgversion='Ubuntu/Linaro 4.7.2-2ubuntu1' --with-bugurl=file:///usr/share/doc/gcc-4.7/README.Bugs --enable-languages=c,c++,go,fortran,objc,obj-c++ --prefix=/usr --program-suffix=-4.7 --enable-shared --enable-linker-build-id --with-system-zlib --libexecdir=/usr/lib --without-included-gettext --enable-threads=posix --with-gxx-include-dir=/usr/include/c++/4.7 --libdir=/usr/lib --enable-nls --with-sysroot=/ --enable-clocale=gnu --enable-libstdcxx-debug --enable-libstdcxx-time=yes --enable-gnu-unique-object --enable-plugin --enable-objc-gc --disable-werror --with-arch-32=i686 --with-tune=generic --enable-checking=release --build=x86_64-linux-gnu --host=x86_64-linux-gnu --target=x86_64-linux-gnu
  87. Thread model: posix
  88. gcc version 4.7.2 (Ubuntu/Linaro 4.7.2-2ubuntu1)
  89. configure:3547: $? = 0
  90. configure:3536: g++ -V >&5
  91. g++: error: unrecognized command line option '-V'
  92. g++: fatal error: no input files
  93. compilation terminated.
  94. configure:3547: $? = 4
  95. configure:3536: g++ -qversion >&5
  96. g++: error: unrecognized command line option '-qversion'
  97. g++: fatal error: no input files
  98. compilation terminated.
  99. configure:3547: $? = 4
  100. configure:3567: checking whether the C++ compiler works
  101. configure:3589: g++    conftest.cpp  >&5
  102. configure:3593: $? = 0
  103. configure:3641: result: yes
  104. configure:3644: checking for C++ compiler default output file name
  105. configure:3646: result: a.out
  106. configure:3652: checking for suffix of executables
  107. configure:3659: g++ -o conftest    conftest.cpp  >&5
  108. configure:3663: $? = 0
  109. configure:3685: result:
  110. configure:3707: checking whether we are cross compiling
  111. configure:3715: g++ -o conftest    conftest.cpp  >&5
  112. configure:3719: $? = 0
  113. configure:3726: ./conftest
  114. configure:3730: $? = 0
  115. configure:3745: result: no
  116. configure:3750: checking for suffix of object files
  117. configure:3772: g++ -c   conftest.cpp >&5
  118. configure:3776: $? = 0
  119. configure:3797: result: o
  120. configure:3801: checking whether we are using the GNU C++ compiler
  121. configure:3820: g++ -c   conftest.cpp >&5
  122. configure:3820: $? = 0
  123. configure:3829: result: yes
  124. configure:3838: checking whether g++ accepts -g
  125. configure:3858: g++ -c -g  conftest.cpp >&5
  126. configure:3858: $? = 0
  127. configure:3899: result: yes
  128. configure:3933: checking for style of include used by make
  129. configure:3961: result: GNU
  130. configure:3987: checking dependency style of g++
  131. configure:4098: result: gcc3
  132. configure:4161: checking for gcc
  133. configure:4177: found /usr/bin/gcc
  134. configure:4188: result: gcc
  135. configure:4417: checking for C compiler version
  136. configure:4426: gcc --version >&5
  137. gcc (Ubuntu/Linaro 4.7.2-2ubuntu1) 4.7.2
  138. Copyright (C) 2012 Free Software Foundation, Inc.
  139. This is free software; see the source for copying conditions.  There is NO
  140. warranty; not even for MERCHANTABILITY or FITNESS FOR A PARTICULAR PURPOSE.
  141.  
  142. configure:4437: $? = 0
  143. configure:4426: gcc -v >&5
  144. Using built-in specs.
  145. COLLECT_GCC=gcc
  146. COLLECT_LTO_WRAPPER=/usr/lib/gcc/x86_64-linux-gnu/4.7/lto-wrapper
  147. Target: x86_64-linux-gnu
  148. Configured with: ../src/configure -v --with-pkgversion='Ubuntu/Linaro 4.7.2-2ubuntu1' --with-bugurl=file:///usr/share/doc/gcc-4.7/README.Bugs --enable-languages=c,c++,go,fortran,objc,obj-c++ --prefix=/usr --program-suffix=-4.7 --enable-shared --enable-linker-build-id --with-system-zlib --libexecdir=/usr/lib --without-included-gettext --enable-threads=posix --with-gxx-include-dir=/usr/include/c++/4.7 --libdir=/usr/lib --enable-nls --with-sysroot=/ --enable-clocale=gnu --enable-libstdcxx-debug --enable-libstdcxx-time=yes --enable-gnu-unique-object --enable-plugin --enable-objc-gc --disable-werror --with-arch-32=i686 --with-tune=generic --enable-checking=release --build=x86_64-linux-gnu --host=x86_64-linux-gnu --target=x86_64-linux-gnu
  149. Thread model: posix
  150. gcc version 4.7.2 (Ubuntu/Linaro 4.7.2-2ubuntu1)
  151. configure:4437: $? = 0
  152. configure:4426: gcc -V >&5
  153. gcc: error: unrecognized command line option '-V'
  154. gcc: fatal error: no input files
  155. compilation terminated.
  156. configure:4437: $? = 4
  157. configure:4426: gcc -qversion >&5
  158. gcc: error: unrecognized command line option '-qversion'
  159. gcc: fatal error: no input files
  160. compilation terminated.
  161. configure:4437: $? = 4
  162. configure:4441: checking whether we are using the GNU C compiler
  163. configure:4460: gcc -c   conftest.c >&5
  164. configure:4460: $? = 0
  165. configure:4469: result: yes
  166. configure:4478: checking whether gcc accepts -g
  167. configure:4498: gcc -c -g  conftest.c >&5
  168. configure:4498: $? = 0
  169. configure:4539: result: yes
  170. configure:4556: checking for gcc option to accept ISO C89
  171. configure:4619: gcc  -c -g -O2  conftest.c >&5
  172. configure:4619: $? = 0
  173. configure:4632: result: none needed
  174. configure:4654: checking dependency style of gcc
  175. configure:4765: result: gcc3
  176. configure:4785: checking how to run the C preprocessor
  177. configure:4816: gcc -E  conftest.c
  178. configure:4816: $? = 0
  179. configure:4830: gcc -E  conftest.c
  180. conftest.c:9:28: fatal error: ac_nonexistent.h: No such file or directory
  181. compilation terminated.
  182. configure:4830: $? = 1
  183. configure: failed program was:
  184. | /* confdefs.h */
  185. | #define PACKAGE_NAME "Bitcoin Core"
  186. | #define PACKAGE_TARNAME "bitcoin"
  187. | #define PACKAGE_VERSION "0.9.0"
  188. | #define PACKAGE_STRING "Bitcoin Core 0.9.0"
  189. | #define PACKAGE_BUGREPORT "[email protected]"
  190. | #define PACKAGE_URL ""
  191. | /* end confdefs.h.  */
  192. | #include <ac_nonexistent.h>
  193. configure:4855: result: gcc -E
  194. configure:4875: gcc -E  conftest.c
  195. configure:4875: $? = 0
  196. configure:4889: gcc -E  conftest.c
  197. conftest.c:9:28: fatal error: ac_nonexistent.h: No such file or directory
  198. compilation terminated.
  199. configure:4889: $? = 1
  200. configure: failed program was:
  201. | /* confdefs.h */
  202. | #define PACKAGE_NAME "Bitcoin Core"
  203. | #define PACKAGE_TARNAME "bitcoin"
  204. | #define PACKAGE_VERSION "0.9.0"
  205. | #define PACKAGE_STRING "Bitcoin Core 0.9.0"
  206. | #define PACKAGE_BUGREPORT "[email protected]"
  207. | #define PACKAGE_URL ""
  208. | /* end confdefs.h.  */
  209. | #include <ac_nonexistent.h>
  210. configure:4922: checking how to run the C++ preprocessor
  211. configure:4949: g++ -E  conftest.cpp
  212. configure:4949: $? = 0
  213. configure:4963: g++ -E  conftest.cpp
  214. conftest.cpp:9:28: fatal error: ac_nonexistent.h: No such file or directory
  215. compilation terminated.
  216. configure:4963: $? = 1
  217. configure: failed program was:
  218. | /* confdefs.h */
  219. | #define PACKAGE_NAME "Bitcoin Core"
  220. | #define PACKAGE_TARNAME "bitcoin"
  221. | #define PACKAGE_VERSION "0.9.0"
  222. | #define PACKAGE_STRING "Bitcoin Core 0.9.0"
  223. | #define PACKAGE_BUGREPORT "[email protected]"
  224. | #define PACKAGE_URL ""
  225. | /* end confdefs.h.  */
  226. | #include <ac_nonexistent.h>
  227. configure:4988: result: g++ -E
  228. configure:5008: g++ -E  conftest.cpp
  229. configure:5008: $? = 0
  230. configure:5022: g++ -E  conftest.cpp
  231. conftest.cpp:9:28: fatal error: ac_nonexistent.h: No such file or directory
  232. compilation terminated.
  233. configure:5022: $? = 1
  234. configure: failed program was:
  235. | /* confdefs.h */
  236. | #define PACKAGE_NAME "Bitcoin Core"
  237. | #define PACKAGE_TARNAME "bitcoin"
  238. | #define PACKAGE_VERSION "0.9.0"
  239. | #define PACKAGE_STRING "Bitcoin Core 0.9.0"
  240. | #define PACKAGE_BUGREPORT "[email protected]"
  241. | #define PACKAGE_URL ""
  242. | /* end confdefs.h.  */
  243. | #include <ac_nonexistent.h>
  244. configure:5105: checking for gcc
  245. configure:5121: found /usr/bin/gcc
  246. configure:5132: result: gcc
  247. configure:5157: checking for Objective C compiler version
  248. configure:5166: gcc --version >&5
  249. gcc (Ubuntu/Linaro 4.7.2-2ubuntu1) 4.7.2
  250. Copyright (C) 2012 Free Software Foundation, Inc.
  251. This is free software; see the source for copying conditions.  There is NO
  252. warranty; not even for MERCHANTABILITY or FITNESS FOR A PARTICULAR PURPOSE.
  253.  
  254. configure:5177: $? = 0
  255. configure:5166: gcc -v >&5
  256. Using built-in specs.
  257. COLLECT_GCC=gcc
  258. COLLECT_LTO_WRAPPER=/usr/lib/gcc/x86_64-linux-gnu/4.7/lto-wrapper
  259. Target: x86_64-linux-gnu
  260. Configured with: ../src/configure -v --with-pkgversion='Ubuntu/Linaro 4.7.2-2ubuntu1' --with-bugurl=file:///usr/share/doc/gcc-4.7/README.Bugs --enable-languages=c,c++,go,fortran,objc,obj-c++ --prefix=/usr --program-suffix=-4.7 --enable-shared --enable-linker-build-id --with-system-zlib --libexecdir=/usr/lib --without-included-gettext --enable-threads=posix --with-gxx-include-dir=/usr/include/c++/4.7 --libdir=/usr/lib --enable-nls --with-sysroot=/ --enable-clocale=gnu --enable-libstdcxx-debug --enable-libstdcxx-time=yes --enable-gnu-unique-object --enable-plugin --enable-objc-gc --disable-werror --with-arch-32=i686 --with-tune=generic --enable-checking=release --build=x86_64-linux-gnu --host=x86_64-linux-gnu --target=x86_64-linux-gnu
  261. Thread model: posix
  262. gcc version 4.7.2 (Ubuntu/Linaro 4.7.2-2ubuntu1)
  263. configure:5177: $? = 0
  264. configure:5166: gcc -V >&5
  265. gcc: error: unrecognized command line option '-V'
  266. gcc: fatal error: no input files
  267. compilation terminated.
  268. configure:5177: $? = 4
  269. configure:5166: gcc -qversion >&5
  270. gcc: error: unrecognized command line option '-qversion'
  271. gcc: fatal error: no input files
  272. compilation terminated.
  273. configure:5177: $? = 4
  274. configure:5181: checking whether we are using the GNU Objective C compiler
  275. configure:5200: gcc -c   conftest.m >&5
  276. gcc: error trying to exec 'cc1obj': execvp: No such file or directory
  277. configure:5200: $? = 1
  278. configure: failed program was:
  279. | /* confdefs.h */
  280. | #define PACKAGE_NAME "Bitcoin Core"
  281. | #define PACKAGE_TARNAME "bitcoin"
  282. | #define PACKAGE_VERSION "0.9.0"
  283. | #define PACKAGE_STRING "Bitcoin Core 0.9.0"
  284. | #define PACKAGE_BUGREPORT "[email protected]"
  285. | #define PACKAGE_URL ""
  286. | /* end confdefs.h.  */
  287. |
  288. | int
  289. | main ()
  290. | {
  291. | #ifndef __GNUC__
  292. |        choke me
  293. | #endif
  294. |
  295. |   ;
  296. |   return 0;
  297. | }
  298. configure:5209: result: no
  299. configure:5218: checking whether gcc accepts -g
  300. configure:5238: gcc -c -g  conftest.m >&5
  301. gcc: error trying to exec 'cc1obj': execvp: No such file or directory
  302. configure:5238: $? = 1
  303. configure: failed program was:
  304. | /* confdefs.h */
  305. | #define PACKAGE_NAME "Bitcoin Core"
  306. | #define PACKAGE_TARNAME "bitcoin"
  307. | #define PACKAGE_VERSION "0.9.0"
  308. | #define PACKAGE_STRING "Bitcoin Core 0.9.0"
  309. | #define PACKAGE_BUGREPORT "[email protected]"
  310. | #define PACKAGE_URL ""
  311. | /* end confdefs.h.  */
  312. |
  313. | int
  314. | main ()
  315. | {
  316. |
  317. |   ;
  318. |   return 0;
  319. | }
  320. configure:5253: gcc -c   conftest.m >&5
  321. gcc: error trying to exec 'cc1obj': execvp: No such file or directory
  322. configure:5253: $? = 1
  323. configure: failed program was:
  324. | /* confdefs.h */
  325. | #define PACKAGE_NAME "Bitcoin Core"
  326. | #define PACKAGE_TARNAME "bitcoin"
  327. | #define PACKAGE_VERSION "0.9.0"
  328. | #define PACKAGE_STRING "Bitcoin Core 0.9.0"
  329. | #define PACKAGE_BUGREPORT "[email protected]"
  330. | #define PACKAGE_URL ""
  331. | /* end confdefs.h.  */
  332. |
  333. | int
  334. | main ()
  335. | {
  336. |
  337. |   ;
  338. |   return 0;
  339. | }
  340. configure:5269: gcc -c -g  conftest.m >&5
  341. gcc: error trying to exec 'cc1obj': execvp: No such file or directory
  342. configure:5269: $? = 1
  343. configure: failed program was:
  344. | /* confdefs.h */
  345. | #define PACKAGE_NAME "Bitcoin Core"
  346. | #define PACKAGE_TARNAME "bitcoin"
  347. | #define PACKAGE_VERSION "0.9.0"
  348. | #define PACKAGE_STRING "Bitcoin Core 0.9.0"
  349. | #define PACKAGE_BUGREPORT "[email protected]"
  350. | #define PACKAGE_URL ""
  351. | /* end confdefs.h.  */
  352. |
  353. | int
  354. | main ()
  355. | {
  356. |
  357. |   ;
  358. |   return 0;
  359. | }
  360. configure:5279: result: no
  361. configure:5304: checking dependency style of gcc
  362. configure:5413: result: gcc3
  363. configure:5482: checking for g++
  364. configure:5498: found /usr/bin/g++
  365. configure:5509: result: g++
  366. configure:5534: checking for Objective C++ compiler version
  367. configure:5543: g++ --version >&5
  368. g++ (Ubuntu/Linaro 4.7.2-2ubuntu1) 4.7.2
  369. Copyright (C) 2012 Free Software Foundation, Inc.
  370. This is free software; see the source for copying conditions.  There is NO
  371. warranty; not even for MERCHANTABILITY or FITNESS FOR A PARTICULAR PURPOSE.
  372.  
  373. configure:5554: $? = 0
  374. configure:5543: g++ -v >&5
  375. Using built-in specs.
  376. COLLECT_GCC=g++
  377. COLLECT_LTO_WRAPPER=/usr/lib/gcc/x86_64-linux-gnu/4.7/lto-wrapper
  378. Target: x86_64-linux-gnu
  379. Configured with: ../src/configure -v --with-pkgversion='Ubuntu/Linaro 4.7.2-2ubuntu1' --with-bugurl=file:///usr/share/doc/gcc-4.7/README.Bugs --enable-languages=c,c++,go,fortran,objc,obj-c++ --prefix=/usr --program-suffix=-4.7 --enable-shared --enable-linker-build-id --with-system-zlib --libexecdir=/usr/lib --without-included-gettext --enable-threads=posix --with-gxx-include-dir=/usr/include/c++/4.7 --libdir=/usr/lib --enable-nls --with-sysroot=/ --enable-clocale=gnu --enable-libstdcxx-debug --enable-libstdcxx-time=yes --enable-gnu-unique-object --enable-plugin --enable-objc-gc --disable-werror --with-arch-32=i686 --with-tune=generic --enable-checking=release --build=x86_64-linux-gnu --host=x86_64-linux-gnu --target=x86_64-linux-gnu
  380. Thread model: posix
  381. gcc version 4.7.2 (Ubuntu/Linaro 4.7.2-2ubuntu1)
  382. configure:5554: $? = 0
  383. configure:5543: g++ -V >&5
  384. g++: error: unrecognized command line option '-V'
  385. g++: fatal error: no input files
  386. compilation terminated.
  387. configure:5554: $? = 4
  388. configure:5543: g++ -qversion >&5
  389. g++: error: unrecognized command line option '-qversion'
  390. g++: fatal error: no input files
  391. compilation terminated.
  392. configure:5554: $? = 4
  393. configure:5558: checking whether we are using the GNU Objective C++ compiler
  394. configure:5577: g++ -c   conftest.mm >&5
  395. g++: error trying to exec 'cc1objplus': execvp: No such file or directory
  396. configure:5577: $? = 1
  397. configure: failed program was:
  398. | /* confdefs.h */
  399. | #define PACKAGE_NAME "Bitcoin Core"
  400. | #define PACKAGE_TARNAME "bitcoin"
  401. | #define PACKAGE_VERSION "0.9.0"
  402. | #define PACKAGE_STRING "Bitcoin Core 0.9.0"
  403. | #define PACKAGE_BUGREPORT "[email protected]"
  404. | #define PACKAGE_URL ""
  405. | /* end confdefs.h.  */
  406. |
  407. | int
  408. | main ()
  409. | {
  410. | #ifndef __GNUC__
  411. |        choke me
  412. | #endif
  413. |
  414. |   ;
  415. |   return 0;
  416. | }
  417. configure:5586: result: no
  418. configure:5595: checking whether g++ accepts -g
  419. configure:5615: g++ -c -g  conftest.mm >&5
  420. g++: error trying to exec 'cc1objplus': execvp: No such file or directory
  421. configure:5615: $? = 1
  422. configure: failed program was:
  423. | /* confdefs.h */
  424. | #define PACKAGE_NAME "Bitcoin Core"
  425. | #define PACKAGE_TARNAME "bitcoin"
  426. | #define PACKAGE_VERSION "0.9.0"
  427. | #define PACKAGE_STRING "Bitcoin Core 0.9.0"
  428. | #define PACKAGE_BUGREPORT "[email protected]"
  429. | #define PACKAGE_URL ""
  430. | /* end confdefs.h.  */
  431. |
  432. | int
  433. | main ()
  434. | {
  435. |
  436. |   ;
  437. |   return 0;
  438. | }
  439. configure:5630: g++ -c   conftest.mm >&5
  440. g++: error trying to exec 'cc1objplus': execvp: No such file or directory
  441. configure:5630: $? = 1
  442. configure: failed program was:
  443. | /* confdefs.h */
  444. | #define PACKAGE_NAME "Bitcoin Core"
  445. | #define PACKAGE_TARNAME "bitcoin"
  446. | #define PACKAGE_VERSION "0.9.0"
  447. | #define PACKAGE_STRING "Bitcoin Core 0.9.0"
  448. | #define PACKAGE_BUGREPORT "[email protected]"
  449. | #define PACKAGE_URL ""
  450. | /* end confdefs.h.  */
  451. |
  452. | int
  453. | main ()
  454. | {
  455. |
  456. |   ;
  457. |   return 0;
  458. | }
  459. configure:5646: g++ -c -g  conftest.mm >&5
  460. g++: error trying to exec 'cc1objplus': execvp: No such file or directory
  461. configure:5646: $? = 1
  462. configure: failed program was:
  463. | /* confdefs.h */
  464. | #define PACKAGE_NAME "Bitcoin Core"
  465. | #define PACKAGE_TARNAME "bitcoin"
  466. | #define PACKAGE_VERSION "0.9.0"
  467. | #define PACKAGE_STRING "Bitcoin Core 0.9.0"
  468. | #define PACKAGE_BUGREPORT "[email protected]"
  469. | #define PACKAGE_URL ""
  470. | /* end confdefs.h.  */
  471. |
  472. | int
  473. | main ()
  474. | {
  475. |
  476. |   ;
  477. |   return 0;
  478. | }
  479. configure:5656: result: no
  480. configure:5680: checking for a sed that does not truncate output
  481. configure:5744: result: /bin/sed
  482. configure:5795: checking for ar
  483. configure:5813: found /usr/bin/ar
  484. configure:5825: result: /usr/bin/ar
  485. configure:5893: checking for ranlib
  486. configure:5911: found /usr/bin/ranlib
  487. configure:5923: result: /usr/bin/ranlib
  488. configure:5991: checking for strip
  489. configure:6009: found /usr/bin/strip
  490. configure:6021: result: /usr/bin/strip
  491. configure:6089: checking for gcov
  492. configure:6107: found /usr/bin/gcov
  493. configure:6119: result: /usr/bin/gcov
  494. configure:6143: checking for lcov
  495. configure:6176: result: no
  496. configure:6183: checking for java
  497. configure:6201: found /usr/bin/java
  498. configure:6213: result: /usr/bin/java
  499. configure:6223: checking for genhtml
  500. configure:6256: result: no
  501. configure:6263: checking for git
  502. configure:6281: found /usr/bin/git
  503. configure:6293: result: /usr/bin/git
  504. configure:6303: checking for ccache
  505. configure:6336: result: no
  506. configure:6343: checking for xgettext
  507. configure:6361: found /usr/bin/xgettext
  508. configure:6373: result: /usr/bin/xgettext
  509. configure:6383: checking for hexdump
  510. configure:6401: found /usr/bin/hexdump
  511. configure:6413: result: /usr/bin/hexdump
  512. configure:6475: checking for pkg-config
  513. configure:6493: found /usr/bin/pkg-config
  514. configure:6505: result: /usr/bin/pkg-config
  515. configure:6530: checking pkg-config is at least version 0.9.0
  516. configure:6533: result: yes
  517. configure:7803: checking for grep that handles long lines and -e
  518. configure:7861: result: /bin/grep
  519. configure:7866: checking for egrep
  520. configure:7928: result: /bin/grep -E
  521. configure:7933: checking for ANSI C header files
  522. configure:7953: g++ -c -g3 -O0 -DDEBUG -Wall -Wextra -Wformat -Wformat-security -Wno-unused-parameter  -DBOOST_SPIRIT_THREADSAFE -DHAVE_BUILD_INFO -D__STDC_FORMAT_MACROS conftest.cpp >&5
  523. configure:7953: $? = 0
  524. configure:8026: g++ -o conftest -g3 -O0 -DDEBUG -Wall -Wextra -Wformat -Wformat-security -Wno-unused-parameter  -DBOOST_SPIRIT_THREADSAFE -DHAVE_BUILD_INFO -D__STDC_FORMAT_MACROS  conftest.cpp  >&5
  525. configure:8026: $? = 0
  526. configure:8026: ./conftest
  527. configure:8026: $? = 0
  528. configure:8037: result: yes
  529. configure:8050: checking for sys/types.h
  530. configure:8050: g++ -c -g3 -O0 -DDEBUG -Wall -Wextra -Wformat -Wformat-security -Wno-unused-parameter  -DBOOST_SPIRIT_THREADSAFE -DHAVE_BUILD_INFO -D__STDC_FORMAT_MACROS conftest.cpp >&5
  531. configure:8050: $? = 0
  532. configure:8050: result: yes
  533. configure:8050: checking for sys/stat.h
  534. configure:8050: g++ -c -g3 -O0 -DDEBUG -Wall -Wextra -Wformat -Wformat-security -Wno-unused-parameter  -DBOOST_SPIRIT_THREADSAFE -DHAVE_BUILD_INFO -D__STDC_FORMAT_MACROS conftest.cpp >&5
  535. configure:8050: $? = 0
  536. configure:8050: result: yes
  537. configure:8050: checking for stdlib.h
  538. configure:8050: g++ -c -g3 -O0 -DDEBUG -Wall -Wextra -Wformat -Wformat-security -Wno-unused-parameter  -DBOOST_SPIRIT_THREADSAFE -DHAVE_BUILD_INFO -D__STDC_FORMAT_MACROS conftest.cpp >&5
  539. configure:8050: $? = 0
  540. configure:8050: result: yes
  541. configure:8050: checking for string.h
  542. configure:8050: g++ -c -g3 -O0 -DDEBUG -Wall -Wextra -Wformat -Wformat-security -Wno-unused-parameter  -DBOOST_SPIRIT_THREADSAFE -DHAVE_BUILD_INFO -D__STDC_FORMAT_MACROS conftest.cpp >&5
  543. configure:8050: $? = 0
  544. configure:8050: result: yes
  545. configure:8050: checking for memory.h
  546. configure:8050: g++ -c -g3 -O0 -DDEBUG -Wall -Wextra -Wformat -Wformat-security -Wno-unused-parameter  -DBOOST_SPIRIT_THREADSAFE -DHAVE_BUILD_INFO -D__STDC_FORMAT_MACROS conftest.cpp >&5
  547. configure:8050: $? = 0
  548. configure:8050: result: yes
  549. configure:8050: checking for strings.h
  550. configure:8050: g++ -c -g3 -O0 -DDEBUG -Wall -Wextra -Wformat -Wformat-security -Wno-unused-parameter  -DBOOST_SPIRIT_THREADSAFE -DHAVE_BUILD_INFO -D__STDC_FORMAT_MACROS conftest.cpp >&5
  551. configure:8050: $? = 0
  552. configure:8050: result: yes
  553. configure:8050: checking for inttypes.h
  554. configure:8050: g++ -c -g3 -O0 -DDEBUG -Wall -Wextra -Wformat -Wformat-security -Wno-unused-parameter  -DBOOST_SPIRIT_THREADSAFE -DHAVE_BUILD_INFO -D__STDC_FORMAT_MACROS conftest.cpp >&5
  555. configure:8050: $? = 0
  556. configure:8050: result: yes
  557. configure:8050: checking for stdint.h
  558. configure:8050: g++ -c -g3 -O0 -DDEBUG -Wall -Wextra -Wformat -Wformat-security -Wno-unused-parameter  -DBOOST_SPIRIT_THREADSAFE -DHAVE_BUILD_INFO -D__STDC_FORMAT_MACROS conftest.cpp >&5
  559. configure:8050: $? = 0
  560. configure:8050: result: yes
  561. configure:8050: checking for unistd.h
  562. configure:8050: g++ -c -g3 -O0 -DDEBUG -Wall -Wextra -Wformat -Wformat-security -Wno-unused-parameter  -DBOOST_SPIRIT_THREADSAFE -DHAVE_BUILD_INFO -D__STDC_FORMAT_MACROS conftest.cpp >&5
  563. configure:8050: $? = 0
  564. configure:8050: result: yes
  565. configure:8062: checking whether byte ordering is bigendian
  566. configure:8077: g++ -c -g3 -O0 -DDEBUG -Wall -Wextra -Wformat -Wformat-security -Wno-unused-parameter  -DBOOST_SPIRIT_THREADSAFE -DHAVE_BUILD_INFO -D__STDC_FORMAT_MACROS conftest.cpp >&5
  567. conftest.cpp:20:9: error: expected unqualified-id before 'not' token
  568. configure:8077: $? = 1
  569. configure: failed program was:
  570. | /* confdefs.h */
  571. | #define PACKAGE_NAME "Bitcoin Core"
  572. | #define PACKAGE_TARNAME "bitcoin"
  573. | #define PACKAGE_VERSION "0.9.0"
  574. | #define PACKAGE_STRING "Bitcoin Core 0.9.0"
  575. | #define PACKAGE_BUGREPORT "[email protected]"
  576. | #define PACKAGE_URL ""
  577. | #define STDC_HEADERS 1
  578. | #define HAVE_SYS_TYPES_H 1
  579. | #define HAVE_SYS_STAT_H 1
  580. | #define HAVE_STDLIB_H 1
  581. | #define HAVE_STRING_H 1
  582. | #define HAVE_MEMORY_H 1
  583. | #define HAVE_STRINGS_H 1
  584. | #define HAVE_INTTYPES_H 1
  585. | #define HAVE_STDINT_H 1
  586. | #define HAVE_UNISTD_H 1
  587. | /* end confdefs.h.  */
  588. | #ifndef __APPLE_CC__
  589. |          not a universal capable compiler
  590. |        #endif
  591. |        typedef int dummy;
  592. |
  593. configure:8122: g++ -c -g3 -O0 -DDEBUG -Wall -Wextra -Wformat -Wformat-security -Wno-unused-parameter  -DBOOST_SPIRIT_THREADSAFE -DHAVE_BUILD_INFO -D__STDC_FORMAT_MACROS conftest.cpp >&5
  594. configure:8122: $? = 0
  595. configure:8140: g++ -c -g3 -O0 -DDEBUG -Wall -Wextra -Wformat -Wformat-security -Wno-unused-parameter  -DBOOST_SPIRIT_THREADSAFE -DHAVE_BUILD_INFO -D__STDC_FORMAT_MACROS conftest.cpp >&5
  596. conftest.cpp: In function 'int main()':
  597. conftest.cpp:26:8: error: 'big' was not declared in this scope
  598. conftest.cpp:26:12: error: expected ';' before 'endian'
  599. configure:8140: $? = 1
  600. configure: failed program was:
  601. | /* confdefs.h */
  602. | #define PACKAGE_NAME "Bitcoin Core"
  603. | #define PACKAGE_TARNAME "bitcoin"
  604. | #define PACKAGE_VERSION "0.9.0"
  605. | #define PACKAGE_STRING "Bitcoin Core 0.9.0"
  606. | #define PACKAGE_BUGREPORT "[email protected]"
  607. | #define PACKAGE_URL ""
  608. | #define STDC_HEADERS 1
  609. | #define HAVE_SYS_TYPES_H 1
  610. | #define HAVE_SYS_STAT_H 1
  611. | #define HAVE_STDLIB_H 1
  612. | #define HAVE_STRING_H 1
  613. | #define HAVE_MEMORY_H 1
  614. | #define HAVE_STRINGS_H 1
  615. | #define HAVE_INTTYPES_H 1
  616. | #define HAVE_STDINT_H 1
  617. | #define HAVE_UNISTD_H 1
  618. | /* end confdefs.h.  */
  619. | #include <sys/types.h>
  620. |       #include <sys/param.h>
  621. |
  622. | int
  623. | main ()
  624. | {
  625. | #if BYTE_ORDER != BIG_ENDIAN
  626. |        not big endian
  627. |       #endif
  628. |
  629. |   ;
  630. |   return 0;
  631. | }
  632. configure:8268: result: no
  633. configure:8399: checking if compiler needs -Werror to reject unknown flags
  634. configure:8415: gcc -c -g3 -O0 -DDEBUG -Werror -Wunknown-warning-option -Wsizeof-array-argument  -DBOOST_SPIRIT_THREADSAFE -DHAVE_BUILD_INFO -D__STDC_FORMAT_MACROS conftest.c >&5
  635. gcc: error: unrecognized command line option '-Wunknown-warning-option'
  636. gcc: error: unrecognized command line option '-Wsizeof-array-argument'
  637. configure:8415: $? = 1
  638. configure: failed program was:
  639. | /* confdefs.h */
  640. | #define PACKAGE_NAME "Bitcoin Core"
  641. | #define PACKAGE_TARNAME "bitcoin"
  642. | #define PACKAGE_VERSION "0.9.0"
  643. | #define PACKAGE_STRING "Bitcoin Core 0.9.0"
  644. | #define PACKAGE_BUGREPORT "[email protected]"
  645. | #define PACKAGE_URL ""
  646. | #define STDC_HEADERS 1
  647. | #define HAVE_SYS_TYPES_H 1
  648. | #define HAVE_SYS_STAT_H 1
  649. | #define HAVE_STDLIB_H 1
  650. | #define HAVE_STRING_H 1
  651. | #define HAVE_MEMORY_H 1
  652. | #define HAVE_STRINGS_H 1
  653. | #define HAVE_INTTYPES_H 1
  654. | #define HAVE_STDINT_H 1
  655. | #define HAVE_UNISTD_H 1
  656. | /* end confdefs.h.  */
  657. | int foo(void);
  658. | int
  659. | main ()
  660. | {
  661. | foo()
  662. |   ;
  663. |   return 0;
  664. | }
  665. configure:8420: result: no
  666. configure:8486: checking for the pthreads library -lpthreads
  667. configure:8524: gcc -o conftest -g3 -O0 -DDEBUG    -DBOOST_SPIRIT_THREADSAFE -DHAVE_BUILD_INFO -D__STDC_FORMAT_MACROS  conftest.c -lpthreads  >&5
  668. /usr/bin/ld: cannot find -lpthreads
  669. collect2: error: ld returned 1 exit status
  670. configure:8524: $? = 1
  671. configure: failed program was:
  672. | /* confdefs.h */
  673. | #define PACKAGE_NAME "Bitcoin Core"
  674. | #define PACKAGE_TARNAME "bitcoin"
  675. | #define PACKAGE_VERSION "0.9.0"
  676. | #define PACKAGE_STRING "Bitcoin Core 0.9.0"
  677. | #define PACKAGE_BUGREPORT "[email protected]"
  678. | #define PACKAGE_URL ""
  679. | #define STDC_HEADERS 1
  680. | #define HAVE_SYS_TYPES_H 1
  681. | #define HAVE_SYS_STAT_H 1
  682. | #define HAVE_STDLIB_H 1
  683. | #define HAVE_STRING_H 1
  684. | #define HAVE_MEMORY_H 1
  685. | #define HAVE_STRINGS_H 1
  686. | #define HAVE_INTTYPES_H 1
  687. | #define HAVE_STDINT_H 1
  688. | #define HAVE_UNISTD_H 1
  689. | /* end confdefs.h.  */
  690. | #include <pthread.h>
  691. |                         static void routine(void *a) { a = 0; }
  692. |                         static void *start_routine(void *a) { return a; }
  693. | int
  694. | main ()
  695. | {
  696. | pthread_t th; pthread_attr_t attr;
  697. |                         pthread_create(&th, 0, start_routine, 0);
  698. |                         pthread_join(th, 0);
  699. |                         pthread_attr_init(&attr);
  700. |                         pthread_cleanup_push(routine, 0);
  701. |                         pthread_cleanup_pop(0) /* ; */
  702. |   ;
  703. |   return 0;
  704. | }
  705. configure:8533: result: no
  706. configure:8431: checking whether pthreads work without any flags
  707. configure:8524: gcc -o conftest -g3 -O0 -DDEBUG    -DBOOST_SPIRIT_THREADSAFE -DHAVE_BUILD_INFO -D__STDC_FORMAT_MACROS  conftest.c   >&5
  708. /tmp/ccOluCuY.o: In function `main':
  709. /home/<username>/codebase/bitcoin/conftest.c:26: undefined reference to `pthread_create'
  710. /home/<username>/codebase/bitcoin/conftest.c:27: undefined reference to `pthread_join'
  711. /home/<username>/codebase/bitcoin/conftest.c:29: undefined reference to `__pthread_register_cancel'
  712. /home/<username>/codebase/bitcoin/conftest.c:30: undefined reference to `__pthread_unregister_cancel'
  713. collect2: error: ld returned 1 exit status
  714. configure:8524: $? = 1
  715. configure: failed program was:
  716. | /* confdefs.h */
  717. | #define PACKAGE_NAME "Bitcoin Core"
  718. | #define PACKAGE_TARNAME "bitcoin"
  719. | #define PACKAGE_VERSION "0.9.0"
  720. | #define PACKAGE_STRING "Bitcoin Core 0.9.0"
  721. | #define PACKAGE_BUGREPORT "[email protected]"
  722. | #define PACKAGE_URL ""
  723. | #define STDC_HEADERS 1
  724. | #define HAVE_SYS_TYPES_H 1
  725. | #define HAVE_SYS_STAT_H 1
  726. | #define HAVE_STDLIB_H 1
  727. | #define HAVE_STRING_H 1
  728. | #define HAVE_MEMORY_H 1
  729. | #define HAVE_STRINGS_H 1
  730. | #define HAVE_INTTYPES_H 1
  731. | #define HAVE_STDINT_H 1
  732. | #define HAVE_UNISTD_H 1
  733. | /* end confdefs.h.  */
  734. | #include <pthread.h>
  735. |                         static void routine(void *a) { a = 0; }
  736. |                         static void *start_routine(void *a) { return a; }
  737. | int
  738. | main ()
  739. | {
  740. | pthread_t th; pthread_attr_t attr;
  741. |                         pthread_create(&th, 0, start_routine, 0);
  742. |                         pthread_join(th, 0);
  743. |                         pthread_attr_init(&attr);
  744. |                         pthread_cleanup_push(routine, 0);
  745. |                         pthread_cleanup_pop(0) /* ; */
  746. |   ;
  747. |   return 0;
  748. | }
  749. configure:8533: result: no
  750. configure:8436: checking whether pthreads work with -Kthread
  751. configure:8524: gcc -o conftest -g3 -O0 -DDEBUG -Kthread   -DBOOST_SPIRIT_THREADSAFE -DHAVE_BUILD_INFO -D__STDC_FORMAT_MACROS  conftest.c   >&5
  752. gcc: error: unrecognized command line option '-Kthread'
  753. configure:8524: $? = 1
  754. configure: failed program was:
  755. | /* confdefs.h */
  756. | #define PACKAGE_NAME "Bitcoin Core"
  757. | #define PACKAGE_TARNAME "bitcoin"
  758. | #define PACKAGE_VERSION "0.9.0"
  759. | #define PACKAGE_STRING "Bitcoin Core 0.9.0"
  760. | #define PACKAGE_BUGREPORT "[email protected]"
  761. | #define PACKAGE_URL ""
  762. | #define STDC_HEADERS 1
  763. | #define HAVE_SYS_TYPES_H 1
  764. | #define HAVE_SYS_STAT_H 1
  765. | #define HAVE_STDLIB_H 1
  766. | #define HAVE_STRING_H 1
  767. | #define HAVE_MEMORY_H 1
  768. | #define HAVE_STRINGS_H 1
  769. | #define HAVE_INTTYPES_H 1
  770. | #define HAVE_STDINT_H 1
  771. | #define HAVE_UNISTD_H 1
  772. | /* end confdefs.h.  */
  773. | #include <pthread.h>
  774. |                         static void routine(void *a) { a = 0; }
  775. |                         static void *start_routine(void *a) { return a; }
  776. | int
  777. | main ()
  778. | {
  779. | pthread_t th; pthread_attr_t attr;
  780. |                         pthread_create(&th, 0, start_routine, 0);
  781. |                         pthread_join(th, 0);
  782. |                         pthread_attr_init(&attr);
  783. |                         pthread_cleanup_push(routine, 0);
  784. |                         pthread_cleanup_pop(0) /* ; */
  785. |   ;
  786. |   return 0;
  787. | }
  788. configure:8533: result: no
  789. configure:8436: checking whether pthreads work with -kthread
  790. configure:8524: gcc -o conftest -g3 -O0 -DDEBUG -kthread   -DBOOST_SPIRIT_THREADSAFE -DHAVE_BUILD_INFO -D__STDC_FORMAT_MACROS  conftest.c   >&5
  791. gcc: error: unrecognized command line option '-kthread'
  792. configure:8524: $? = 1
  793. configure: failed program was:
  794. | /* confdefs.h */
  795. | #define PACKAGE_NAME "Bitcoin Core"
  796. | #define PACKAGE_TARNAME "bitcoin"
  797. | #define PACKAGE_VERSION "0.9.0"
  798. | #define PACKAGE_STRING "Bitcoin Core 0.9.0"
  799. | #define PACKAGE_BUGREPORT "[email protected]"
  800. | #define PACKAGE_URL ""
  801. | #define STDC_HEADERS 1
  802. | #define HAVE_SYS_TYPES_H 1
  803. | #define HAVE_SYS_STAT_H 1
  804. | #define HAVE_STDLIB_H 1
  805. | #define HAVE_STRING_H 1
  806. | #define HAVE_MEMORY_H 1
  807. | #define HAVE_STRINGS_H 1
  808. | #define HAVE_INTTYPES_H 1
  809. | #define HAVE_STDINT_H 1
  810. | #define HAVE_UNISTD_H 1
  811. | /* end confdefs.h.  */
  812. | #include <pthread.h>
  813. |                         static void routine(void *a) { a = 0; }
  814. |                         static void *start_routine(void *a) { return a; }
  815. | int
  816. | main ()
  817. | {
  818. | pthread_t th; pthread_attr_t attr;
  819. |                         pthread_create(&th, 0, start_routine, 0);
  820. |                         pthread_join(th, 0);
  821. |                         pthread_attr_init(&attr);
  822. |                         pthread_cleanup_push(routine, 0);
  823. |                         pthread_cleanup_pop(0) /* ; */
  824. |   ;
  825. |   return 0;
  826. | }
  827. configure:8533: result: no
  828. configure:8486: checking for the pthreads library -llthread
  829. configure:8524: gcc -o conftest -g3 -O0 -DDEBUG    -DBOOST_SPIRIT_THREADSAFE -DHAVE_BUILD_INFO -D__STDC_FORMAT_MACROS  conftest.c -llthread  >&5
  830. /usr/bin/ld: cannot find -llthread
  831. collect2: error: ld returned 1 exit status
  832. configure:8524: $? = 1
  833. configure: failed program was:
  834. | /* confdefs.h */
  835. | #define PACKAGE_NAME "Bitcoin Core"
  836. | #define PACKAGE_TARNAME "bitcoin"
  837. | #define PACKAGE_VERSION "0.9.0"
  838. | #define PACKAGE_STRING "Bitcoin Core 0.9.0"
  839. | #define PACKAGE_BUGREPORT "[email protected]"
  840. | #define PACKAGE_URL ""
  841. | #define STDC_HEADERS 1
  842. | #define HAVE_SYS_TYPES_H 1
  843. | #define HAVE_SYS_STAT_H 1
  844. | #define HAVE_STDLIB_H 1
  845. | #define HAVE_STRING_H 1
  846. | #define HAVE_MEMORY_H 1
  847. | #define HAVE_STRINGS_H 1
  848. | #define HAVE_INTTYPES_H 1
  849. | #define HAVE_STDINT_H 1
  850. | #define HAVE_UNISTD_H 1
  851. | /* end confdefs.h.  */
  852. | #include <pthread.h>
  853. |                         static void routine(void *a) { a = 0; }
  854. |                         static void *start_routine(void *a) { return a; }
  855. | int
  856. | main ()
  857. | {
  858. | pthread_t th; pthread_attr_t attr;
  859. |                         pthread_create(&th, 0, start_routine, 0);
  860. |                         pthread_join(th, 0);
  861. |                         pthread_attr_init(&attr);
  862. |                         pthread_cleanup_push(routine, 0);
  863. |                         pthread_cleanup_pop(0) /* ; */
  864. |   ;
  865. |   return 0;
  866. | }
  867. configure:8533: result: no
  868. configure:8436: checking whether pthreads work with -pthread
  869. configure:8524: gcc -o conftest -g3 -O0 -DDEBUG -pthread   -DBOOST_SPIRIT_THREADSAFE -DHAVE_BUILD_INFO -D__STDC_FORMAT_MACROS  conftest.c   >&5
  870. configure:8524: $? = 0
  871. configure:8533: result: yes
  872. configure:8552: checking for joinable pthread attribute
  873. configure:8567: gcc -o conftest -g3 -O0 -DDEBUG -pthread  -DBOOST_SPIRIT_THREADSAFE -DHAVE_BUILD_INFO -D__STDC_FORMAT_MACROS  conftest.c   >&5
  874. configure:8567: $? = 0
  875. configure:8573: result: PTHREAD_CREATE_JOINABLE
  876. configure:8583: checking if more special flags are required for pthreads
  877. configure:8598: result: no
  878. configure:8604: checking for PTHREAD_PRIO_INHERIT
  879. configure:8621: gcc -o conftest -g3 -O0 -DDEBUG -pthread  -DBOOST_SPIRIT_THREADSAFE -DHAVE_BUILD_INFO -D__STDC_FORMAT_MACROS  conftest.c   >&5
  880. conftest.c: In function 'main':
  881. conftest.c:23:9: error: 'PTHREAD_PRIO_INHERIT' undeclared (first use in this function)
  882. conftest.c:23:9: note: each undeclared identifier is reported only once for each function it appears in
  883. configure:8621: $? = 1
  884. configure: failed program was:
  885. | /* confdefs.h */
  886. | #define PACKAGE_NAME "Bitcoin Core"
  887. | #define PACKAGE_TARNAME "bitcoin"
  888. | #define PACKAGE_VERSION "0.9.0"
  889. | #define PACKAGE_STRING "Bitcoin Core 0.9.0"
  890. | #define PACKAGE_BUGREPORT "[email protected]"
  891. | #define PACKAGE_URL ""
  892. | #define STDC_HEADERS 1
  893. | #define HAVE_SYS_TYPES_H 1
  894. | #define HAVE_SYS_STAT_H 1
  895. | #define HAVE_STDLIB_H 1
  896. | #define HAVE_STRING_H 1
  897. | #define HAVE_MEMORY_H 1
  898. | #define HAVE_STRINGS_H 1
  899. | #define HAVE_INTTYPES_H 1
  900. | #define HAVE_STDINT_H 1
  901. | #define HAVE_UNISTD_H 1
  902. | /* end confdefs.h.  */
  903. | #include <pthread.h>
  904. | int
  905. | main ()
  906. | {
  907. | int i = PTHREAD_PRIO_INHERIT;
  908. |   ;
  909. |   return 0;
  910. | }
  911. configure:8630: result: no
  912. configure:8741: checking for special C compiler options needed for large files
  913. configure:8786: result: no
  914. configure:8792: checking for _FILE_OFFSET_BITS value needed for large files
  915. configure:8817: g++ -c -g3 -O0 -DDEBUG -Wall -Wextra -Wformat -Wformat-security -Wno-unused-parameter  -DBOOST_SPIRIT_THREADSAFE -DHAVE_BUILD_INFO -D__STDC_FORMAT_MACROS conftest.cpp >&5
  916. configure:8817: $? = 0
  917. configure:8849: result: no
  918. configure:8947: checking whether the linker accepts -Wl,--large-address-aware
  919. configure:8966: g++ -o conftest -g3 -O0 -DDEBUG -Wall -Wextra -Wformat -Wformat-security -Wno-unused-parameter  -DBOOST_SPIRIT_THREADSAFE -DHAVE_BUILD_INFO -D__STDC_FORMAT_MACROS   -Wl,--large-address-aware conftest.cpp  >&5
  920. /usr/bin/ld: unrecognized option '--large-address-aware'
  921. /usr/bin/ld: use the --help option for usage information
  922. collect2: error: ld returned 1 exit status
  923. configure:8966: $? = 1
  924. configure: failed program was:
  925. | /* confdefs.h */
  926. | #define PACKAGE_NAME "Bitcoin Core"
  927. | #define PACKAGE_TARNAME "bitcoin"
  928. | #define PACKAGE_VERSION "0.9.0"
  929. | #define PACKAGE_STRING "Bitcoin Core 0.9.0"
  930. | #define PACKAGE_BUGREPORT "[email protected]"
  931. | #define PACKAGE_URL ""
  932. | #define STDC_HEADERS 1
  933. | #define HAVE_SYS_TYPES_H 1
  934. | #define HAVE_SYS_STAT_H 1
  935. | #define HAVE_STDLIB_H 1
  936. | #define HAVE_STRING_H 1
  937. | #define HAVE_MEMORY_H 1
  938. | #define HAVE_STRINGS_H 1
  939. | #define HAVE_INTTYPES_H 1
  940. | #define HAVE_STDINT_H 1
  941. | #define HAVE_UNISTD_H 1
  942. | #define HAVE_PTHREAD 1
  943. | /* end confdefs.h.  */
  944. |
  945. | int
  946. | main ()
  947. | {
  948. |
  949. |   ;
  950. |   return 0;
  951. | }
  952. configure:8975: result: no
  953. configure:8985: checking whether C++ compiler accepts -Wstack-protector
  954. configure:9004: g++ -c -g3 -O0 -DDEBUG -Wall -Wextra -Wformat -Wformat-security -Wno-unused-parameter  -Wstack-protector  -DBOOST_SPIRIT_THREADSAFE -DHAVE_BUILD_INFO -D__STDC_FORMAT_MACROS conftest.cpp >&5
  955. configure:9004: $? = 0
  956. configure:9012: result: yes
  957. configure:9020: checking whether C++ compiler accepts -fstack-protector-all
  958. configure:9039: g++ -c -g3 -O0 -DDEBUG -Wall -Wextra -Wformat -Wformat-security -Wno-unused-parameter  -fstack-protector-all  -DBOOST_SPIRIT_THREADSAFE -DHAVE_BUILD_INFO -D__STDC_FORMAT_MACROS conftest.cpp >&5
  959. configure:9039: $? = 0
  960. configure:9047: result: yes
  961. configure:9055: checking whether C++ compiler accepts -fPIE
  962. configure:9074: g++ -c -g3 -O0 -DDEBUG -Wall -Wextra -Wformat -Wformat-security -Wno-unused-parameter  -fPIE  -DBOOST_SPIRIT_THREADSAFE -DHAVE_BUILD_INFO -D__STDC_FORMAT_MACROS conftest.cpp >&5
  963. configure:9074: $? = 0
  964. configure:9082: result: yes
  965. configure:9091: checking whether C++ preprocessor accepts -D_FORTIFY_SOURCE=2
  966. configure:9110: g++ -E  -DBOOST_SPIRIT_THREADSAFE -DHAVE_BUILD_INFO -D__STDC_FORMAT_MACROS  -D_FORTIFY_SOURCE=2 conftest.cpp
  967. configure:9110: $? = 0
  968. configure:9118: result: yes
  969. configure:9122: checking whether C++ preprocessor accepts -U_FORTIFY_SOURCE
  970. configure:9141: g++ -E  -DBOOST_SPIRIT_THREADSAFE -DHAVE_BUILD_INFO -D__STDC_FORMAT_MACROS  -U_FORTIFY_SOURCE conftest.cpp
  971. configure:9141: $? = 0
  972. configure:9149: result: yes
  973. configure:9166: checking whether the linker accepts -Wl,--dynamicbase
  974. configure:9185: g++ -o conftest -g3 -O0 -DDEBUG -Wall -Wextra -Wformat -Wformat-security -Wno-unused-parameter  -DBOOST_SPIRIT_THREADSAFE -DHAVE_BUILD_INFO -D__STDC_FORMAT_MACROS   -Wl,--dynamicbase conftest.cpp  >&5
  975. /usr/bin/ld: unrecognized option '--dynamicbase'
  976. /usr/bin/ld: use the --help option for usage information
  977. collect2: error: ld returned 1 exit status
  978. configure:9185: $? = 1
  979. configure: failed program was:
  980. | /* confdefs.h */
  981. | #define PACKAGE_NAME "Bitcoin Core"
  982. | #define PACKAGE_TARNAME "bitcoin"
  983. | #define PACKAGE_VERSION "0.9.0"
  984. | #define PACKAGE_STRING "Bitcoin Core 0.9.0"
  985. | #define PACKAGE_BUGREPORT "[email protected]"
  986. | #define PACKAGE_URL ""
  987. | #define STDC_HEADERS 1
  988. | #define HAVE_SYS_TYPES_H 1
  989. | #define HAVE_SYS_STAT_H 1
  990. | #define HAVE_STDLIB_H 1
  991. | #define HAVE_STRING_H 1
  992. | #define HAVE_MEMORY_H 1
  993. | #define HAVE_STRINGS_H 1
  994. | #define HAVE_INTTYPES_H 1
  995. | #define HAVE_STDINT_H 1
  996. | #define HAVE_UNISTD_H 1
  997. | #define HAVE_PTHREAD 1
  998. | /* end confdefs.h.  */
  999. |
  1000. | int
  1001. | main ()
  1002. | {
  1003. |
  1004. |   ;
  1005. |   return 0;
  1006. | }
  1007. configure:9194: result: no
  1008. configure:9202: checking whether the linker accepts -Wl,--nxcompat
  1009. configure:9221: g++ -o conftest -g3 -O0 -DDEBUG -Wall -Wextra -Wformat -Wformat-security -Wno-unused-parameter  -DBOOST_SPIRIT_THREADSAFE -DHAVE_BUILD_INFO -D__STDC_FORMAT_MACROS   -Wl,--nxcompat conftest.cpp  >&5
  1010. /usr/bin/ld: unrecognized option '--nxcompat'
  1011. /usr/bin/ld: use the --help option for usage information
  1012. collect2: error: ld returned 1 exit status
  1013. configure:9221: $? = 1
  1014. configure: failed program was:
  1015. | /* confdefs.h */
  1016. | #define PACKAGE_NAME "Bitcoin Core"
  1017. | #define PACKAGE_TARNAME "bitcoin"
  1018. | #define PACKAGE_VERSION "0.9.0"
  1019. | #define PACKAGE_STRING "Bitcoin Core 0.9.0"
  1020. | #define PACKAGE_BUGREPORT "[email protected]"
  1021. | #define PACKAGE_URL ""
  1022. | #define STDC_HEADERS 1
  1023. | #define HAVE_SYS_TYPES_H 1
  1024. | #define HAVE_SYS_STAT_H 1
  1025. | #define HAVE_STDLIB_H 1
  1026. | #define HAVE_STRING_H 1
  1027. | #define HAVE_MEMORY_H 1
  1028. | #define HAVE_STRINGS_H 1
  1029. | #define HAVE_INTTYPES_H 1
  1030. | #define HAVE_STDINT_H 1
  1031. | #define HAVE_UNISTD_H 1
  1032. | #define HAVE_PTHREAD 1
  1033. | /* end confdefs.h.  */
  1034. |
  1035. | int
  1036. | main ()
  1037. | {
  1038. |
  1039. |   ;
  1040. |   return 0;
  1041. | }
  1042. configure:9230: result: no
  1043. configure:9238: checking whether the linker accepts -Wl,-z,relro
  1044. configure:9257: g++ -o conftest -g3 -O0 -DDEBUG -Wall -Wextra -Wformat -Wformat-security -Wno-unused-parameter  -DBOOST_SPIRIT_THREADSAFE -DHAVE_BUILD_INFO -D__STDC_FORMAT_MACROS   -Wl,-z,relro conftest.cpp  >&5
  1045. configure:9257: $? = 0
  1046. configure:9266: result: yes
  1047. configure:9274: checking whether the linker accepts -Wl,-z,now
  1048. configure:9293: g++ -o conftest -g3 -O0 -DDEBUG -Wall -Wextra -Wformat -Wformat-security -Wno-unused-parameter  -DBOOST_SPIRIT_THREADSAFE -DHAVE_BUILD_INFO -D__STDC_FORMAT_MACROS   -Wl,-z,now conftest.cpp  >&5
  1049. configure:9293: $? = 0
  1050. configure:9302: result: yes
  1051. configure:9313: checking whether the linker accepts -pie
  1052. configure:9332: g++ -o conftest -g3 -O0 -DDEBUG -Wall -Wextra -Wformat -Wformat-security -Wno-unused-parameter  -DBOOST_SPIRIT_THREADSAFE -DHAVE_BUILD_INFO -D__STDC_FORMAT_MACROS   -pie conftest.cpp  >&5
  1053. configure:9332: $? = 0
  1054. configure:9341: result: yes
  1055. configure:9399: checking stdio.h usability
  1056. configure:9399: g++ -c -g3 -O0 -DDEBUG -Wall -Wextra -Wformat -Wformat-security -Wno-unused-parameter  -Wstack-protector -fstack-protector-all -fPIE  -DBOOST_SPIRIT_THREADSAFE -DHAVE_BUILD_INFO -D__STDC_FORMAT_MACROS  -U_FORTIFY_SOURCE -D_FORTIFY_SOURCE=2 conftest.cpp >&5
  1057. configure:9399: $? = 0
  1058. configure:9399: result: yes
  1059. configure:9399: checking stdio.h presence
  1060. configure:9399: g++ -E  -DBOOST_SPIRIT_THREADSAFE -DHAVE_BUILD_INFO -D__STDC_FORMAT_MACROS  -U_FORTIFY_SOURCE -D_FORTIFY_SOURCE=2 conftest.cpp
  1061. configure:9399: $? = 0
  1062. configure:9399: result: yes
  1063. configure:9399: checking for stdio.h
  1064. configure:9399: result: yes
  1065. configure:9399: checking for stdlib.h
  1066. configure:9399: result: yes
  1067. configure:9399: checking for unistd.h
  1068. configure:9399: result: yes
  1069. configure:9399: checking for strings.h
  1070. configure:9399: result: yes
  1071. configure:9399: checking for sys/types.h
  1072. configure:9399: result: yes
  1073. configure:9399: checking for sys/stat.h
  1074. configure:9399: result: yes
  1075. configure:9410: checking for MSG_NOSIGNAL
  1076. configure:9423: g++ -c -g3 -O0 -DDEBUG -Wall -Wextra -Wformat -Wformat-security -Wno-unused-parameter  -Wstack-protector -fstack-protector-all -fPIE  -DBOOST_SPIRIT_THREADSAFE -DHAVE_BUILD_INFO -D__STDC_FORMAT_MACROS  -U_FORTIFY_SOURCE -D_FORTIFY_SOURCE=2 conftest.cpp >&5
  1077. conftest.cpp: In function 'int main()':
  1078. conftest.cpp:30:6: warning: unused variable 'f' [-Wunused-variable]
  1079. configure:9423: $? = 0
  1080. configure:9424: result: yes
  1081. configure:9452: checking for Berkeley DB C++ headers
  1082. configure:9483: g++ -c -g3 -O0 -DDEBUG -Wall -Wextra -Wformat -Wformat-security -Wno-unused-parameter  -Wstack-protector -fstack-protector-all -fPIE  -DBOOST_SPIRIT_THREADSAFE -DHAVE_BUILD_INFO -D__STDC_FORMAT_MACROS  -U_FORTIFY_SOURCE -D_FORTIFY_SOURCE=2 conftest.cpp >&5
  1083. conftest.cpp:28:33: fatal error: bdb4.8/db_cxx.h: No such file or directory
  1084. compilation terminated.
  1085. configure:9483: $? = 1
  1086. configure: failed program was:
  1087. | /* confdefs.h */
  1088. | #define PACKAGE_NAME "Bitcoin Core"
  1089. | #define PACKAGE_TARNAME "bitcoin"
  1090. | #define PACKAGE_VERSION "0.9.0"
  1091. | #define PACKAGE_STRING "Bitcoin Core 0.9.0"
  1092. | #define PACKAGE_BUGREPORT "[email protected]"
  1093. | #define PACKAGE_URL ""
  1094. | #define STDC_HEADERS 1
  1095. | #define HAVE_SYS_TYPES_H 1
  1096. | #define HAVE_SYS_STAT_H 1
  1097. | #define HAVE_STDLIB_H 1
  1098. | #define HAVE_STRING_H 1
  1099. | #define HAVE_MEMORY_H 1
  1100. | #define HAVE_STRINGS_H 1
  1101. | #define HAVE_INTTYPES_H 1
  1102. | #define HAVE_STDINT_H 1
  1103. | #define HAVE_UNISTD_H 1
  1104. | #define HAVE_PTHREAD 1
  1105. | #define HAVE_STDIO_H 1
  1106. | #define HAVE_STDLIB_H 1
  1107. | #define HAVE_UNISTD_H 1
  1108. | #define HAVE_STRINGS_H 1
  1109. | #define HAVE_SYS_TYPES_H 1
  1110. | #define HAVE_SYS_STAT_H 1
  1111. | #define HAVE_MSG_NOSIGNAL 1
  1112. | /* end confdefs.h.  */
  1113. |
  1114. |       #include <bdb4.8/db_cxx.h>
  1115. |
  1116. | int
  1117. | main ()
  1118. | {
  1119. |
  1120. |       #if !((DB_VERSION_MAJOR == 4 && DB_VERSION_MINOR >= 8) || DB_VERSION_MAJOR > 4)
  1121. |         #error "failed to find bdb 4.8+"
  1122. |       #endif
  1123. |
  1124. |   ;
  1125. |   return 0;
  1126. | }
  1127. configure:9483: g++ -c -g3 -O0 -DDEBUG -Wall -Wextra -Wformat -Wformat-security -Wno-unused-parameter  -Wstack-protector -fstack-protector-all -fPIE  -DBOOST_SPIRIT_THREADSAFE -DHAVE_BUILD_INFO -D__STDC_FORMAT_MACROS  -U_FORTIFY_SOURCE -D_FORTIFY_SOURCE=2 conftest.cpp >&5
  1128. conftest.cpp:28:35: fatal error: libdb4.8/db_cxx.h: No such file or directory
  1129. compilation terminated.
  1130. configure:9483: $? = 1
  1131. configure: failed program was:
  1132. | /* confdefs.h */
  1133. | #define PACKAGE_NAME "Bitcoin Core"
  1134. | #define PACKAGE_TARNAME "bitcoin"
  1135. | #define PACKAGE_VERSION "0.9.0"
  1136. | #define PACKAGE_STRING "Bitcoin Core 0.9.0"
  1137. | #define PACKAGE_BUGREPORT "[email protected]"
  1138. | #define PACKAGE_URL ""
  1139. | #define STDC_HEADERS 1
  1140. | #define HAVE_SYS_TYPES_H 1
  1141. | #define HAVE_SYS_STAT_H 1
  1142. | #define HAVE_STDLIB_H 1
  1143. | #define HAVE_STRING_H 1
  1144. | #define HAVE_MEMORY_H 1
  1145. | #define HAVE_STRINGS_H 1
  1146. | #define HAVE_INTTYPES_H 1
  1147. | #define HAVE_STDINT_H 1
  1148. | #define HAVE_UNISTD_H 1
  1149. | #define HAVE_PTHREAD 1
  1150. | #define HAVE_STDIO_H 1
  1151. | #define HAVE_STDLIB_H 1
  1152. | #define HAVE_UNISTD_H 1
  1153. | #define HAVE_STRINGS_H 1
  1154. | #define HAVE_SYS_TYPES_H 1
  1155. | #define HAVE_SYS_STAT_H 1
  1156. | #define HAVE_MSG_NOSIGNAL 1
  1157. | /* end confdefs.h.  */
  1158. |
  1159. |       #include <libdb4.8/db_cxx.h>
  1160. |
  1161. | int
  1162. | main ()
  1163. | {
  1164. |
  1165. |       #if !((DB_VERSION_MAJOR == 4 && DB_VERSION_MINOR >= 8) || DB_VERSION_MAJOR > 4)
  1166. |         #error "failed to find bdb 4.8+"
  1167. |       #endif
  1168. |
  1169. |   ;
  1170. |   return 0;
  1171. | }
  1172. configure:9483: g++ -c -g3 -O0 -DDEBUG -Wall -Wextra -Wformat -Wformat-security -Wno-unused-parameter  -Wstack-protector -fstack-protector-all -fPIE  -DBOOST_SPIRIT_THREADSAFE -DHAVE_BUILD_INFO -D__STDC_FORMAT_MACROS  -U_FORTIFY_SOURCE -D_FORTIFY_SOURCE=2 conftest.cpp >&5
  1173. conftest.cpp:28:32: fatal error: db4.8/db_cxx.h: No such file or directory
  1174. compilation terminated.
  1175. configure:9483: $? = 1
  1176. configure: failed program was:
  1177. | /* confdefs.h */
  1178. | #define PACKAGE_NAME "Bitcoin Core"
  1179. | #define PACKAGE_TARNAME "bitcoin"
  1180. | #define PACKAGE_VERSION "0.9.0"
  1181. | #define PACKAGE_STRING "Bitcoin Core 0.9.0"
  1182. | #define PACKAGE_BUGREPORT "[email protected]"
  1183. | #define PACKAGE_URL ""
  1184. | #define STDC_HEADERS 1
  1185. | #define HAVE_SYS_TYPES_H 1
  1186. | #define HAVE_SYS_STAT_H 1
  1187. | #define HAVE_STDLIB_H 1
  1188. | #define HAVE_STRING_H 1
  1189. | #define HAVE_MEMORY_H 1
  1190. | #define HAVE_STRINGS_H 1
  1191. | #define HAVE_INTTYPES_H 1
  1192. | #define HAVE_STDINT_H 1
  1193. | #define HAVE_UNISTD_H 1
  1194. | #define HAVE_PTHREAD 1
  1195. | #define HAVE_STDIO_H 1
  1196. | #define HAVE_STDLIB_H 1
  1197. | #define HAVE_UNISTD_H 1
  1198. | #define HAVE_STRINGS_H 1
  1199. | #define HAVE_SYS_TYPES_H 1
  1200. | #define HAVE_SYS_STAT_H 1
  1201. | #define HAVE_MSG_NOSIGNAL 1
  1202. | /* end confdefs.h.  */
  1203. |
  1204. |       #include <db4.8/db_cxx.h>
  1205. |
  1206. | int
  1207. | main ()
  1208. | {
  1209. |
  1210. |       #if !((DB_VERSION_MAJOR == 4 && DB_VERSION_MINOR >= 8) || DB_VERSION_MAJOR > 4)
  1211. |         #error "failed to find bdb 4.8+"
  1212. |       #endif
  1213. |
  1214. |   ;
  1215. |   return 0;
  1216. | }
  1217. configure:9483: g++ -c -g3 -O0 -DDEBUG -Wall -Wextra -Wformat -Wformat-security -Wno-unused-parameter  -Wstack-protector -fstack-protector-all -fPIE  -DBOOST_SPIRIT_THREADSAFE -DHAVE_BUILD_INFO -D__STDC_FORMAT_MACROS  -U_FORTIFY_SOURCE -D_FORTIFY_SOURCE=2 conftest.cpp >&5
  1218. conftest.cpp:28:32: fatal error: bdb48/db_cxx.h: No such file or directory
  1219. compilation terminated.
  1220. configure:9483: $? = 1
  1221. configure: failed program was:
  1222. | /* confdefs.h */
  1223. | #define PACKAGE_NAME "Bitcoin Core"
  1224. | #define PACKAGE_TARNAME "bitcoin"
  1225. | #define PACKAGE_VERSION "0.9.0"
  1226. | #define PACKAGE_STRING "Bitcoin Core 0.9.0"
  1227. | #define PACKAGE_BUGREPORT "[email protected]"
  1228. | #define PACKAGE_URL ""
  1229. | #define STDC_HEADERS 1
  1230. | #define HAVE_SYS_TYPES_H 1
  1231. | #define HAVE_SYS_STAT_H 1
  1232. | #define HAVE_STDLIB_H 1
  1233. | #define HAVE_STRING_H 1
  1234. | #define HAVE_MEMORY_H 1
  1235. | #define HAVE_STRINGS_H 1
  1236. | #define HAVE_INTTYPES_H 1
  1237. | #define HAVE_STDINT_H 1
  1238. | #define HAVE_UNISTD_H 1
  1239. | #define HAVE_PTHREAD 1
  1240. | #define HAVE_STDIO_H 1
  1241. | #define HAVE_STDLIB_H 1
  1242. | #define HAVE_UNISTD_H 1
  1243. | #define HAVE_STRINGS_H 1
  1244. | #define HAVE_SYS_TYPES_H 1
  1245. | #define HAVE_SYS_STAT_H 1
  1246. | #define HAVE_MSG_NOSIGNAL 1
  1247. | /* end confdefs.h.  */
  1248. |
  1249. |       #include <bdb48/db_cxx.h>
  1250. |
  1251. | int
  1252. | main ()
  1253. | {
  1254. |
  1255. |       #if !((DB_VERSION_MAJOR == 4 && DB_VERSION_MINOR >= 8) || DB_VERSION_MAJOR > 4)
  1256. |         #error "failed to find bdb 4.8+"
  1257. |       #endif
  1258. |
  1259. |   ;
  1260. |   return 0;
  1261. | }
  1262. configure:9483: g++ -c -g3 -O0 -DDEBUG -Wall -Wextra -Wformat -Wformat-security -Wno-unused-parameter  -Wstack-protector -fstack-protector-all -fPIE  -DBOOST_SPIRIT_THREADSAFE -DHAVE_BUILD_INFO -D__STDC_FORMAT_MACROS  -U_FORTIFY_SOURCE -D_FORTIFY_SOURCE=2 conftest.cpp >&5
  1263. conftest.cpp:28:34: fatal error: libdb48/db_cxx.h: No such file or directory
  1264. compilation terminated.
  1265. configure:9483: $? = 1
  1266. configure: failed program was:
  1267. | /* confdefs.h */
  1268. | #define PACKAGE_NAME "Bitcoin Core"
  1269. | #define PACKAGE_TARNAME "bitcoin"
  1270. | #define PACKAGE_VERSION "0.9.0"
  1271. | #define PACKAGE_STRING "Bitcoin Core 0.9.0"
  1272. | #define PACKAGE_BUGREPORT "[email protected]"
  1273. | #define PACKAGE_URL ""
  1274. | #define STDC_HEADERS 1
  1275. | #define HAVE_SYS_TYPES_H 1
  1276. | #define HAVE_SYS_STAT_H 1
  1277. | #define HAVE_STDLIB_H 1
  1278. | #define HAVE_STRING_H 1
  1279. | #define HAVE_MEMORY_H 1
  1280. | #define HAVE_STRINGS_H 1
  1281. | #define HAVE_INTTYPES_H 1
  1282. | #define HAVE_STDINT_H 1
  1283. | #define HAVE_UNISTD_H 1
  1284. | #define HAVE_PTHREAD 1
  1285. | #define HAVE_STDIO_H 1
  1286. | #define HAVE_STDLIB_H 1
  1287. | #define HAVE_UNISTD_H 1
  1288. | #define HAVE_STRINGS_H 1
  1289. | #define HAVE_SYS_TYPES_H 1
  1290. | #define HAVE_SYS_STAT_H 1
  1291. | #define HAVE_MSG_NOSIGNAL 1
  1292. | /* end confdefs.h.  */
  1293. |
  1294. |       #include <libdb48/db_cxx.h>
  1295. |
  1296. | int
  1297. | main ()
  1298. | {
  1299. |
  1300. |       #if !((DB_VERSION_MAJOR == 4 && DB_VERSION_MINOR >= 8) || DB_VERSION_MAJOR > 4)
  1301. |         #error "failed to find bdb 4.8+"
  1302. |       #endif
  1303. |
  1304. |   ;
  1305. |   return 0;
  1306. | }
  1307. configure:9483: g++ -c -g3 -O0 -DDEBUG -Wall -Wextra -Wformat -Wformat-security -Wno-unused-parameter  -Wstack-protector -fstack-protector-all -fPIE  -DBOOST_SPIRIT_THREADSAFE -DHAVE_BUILD_INFO -D__STDC_FORMAT_MACROS  -U_FORTIFY_SOURCE -D_FORTIFY_SOURCE=2 conftest.cpp >&5
  1308. conftest.cpp:28:31: fatal error: db48/db_cxx.h: No such file or directory
  1309. compilation terminated.
  1310. configure:9483: $? = 1
  1311. configure: failed program was:
  1312. | /* confdefs.h */
  1313. | #define PACKAGE_NAME "Bitcoin Core"
  1314. | #define PACKAGE_TARNAME "bitcoin"
  1315. | #define PACKAGE_VERSION "0.9.0"
  1316. | #define PACKAGE_STRING "Bitcoin Core 0.9.0"
  1317. | #define PACKAGE_BUGREPORT "[email protected]"
  1318. | #define PACKAGE_URL ""
  1319. | #define STDC_HEADERS 1
  1320. | #define HAVE_SYS_TYPES_H 1
  1321. | #define HAVE_SYS_STAT_H 1
  1322. | #define HAVE_STDLIB_H 1
  1323. | #define HAVE_STRING_H 1
  1324. | #define HAVE_MEMORY_H 1
  1325. | #define HAVE_STRINGS_H 1
  1326. | #define HAVE_INTTYPES_H 1
  1327. | #define HAVE_STDINT_H 1
  1328. | #define HAVE_UNISTD_H 1
  1329. | #define HAVE_PTHREAD 1
  1330. | #define HAVE_STDIO_H 1
  1331. | #define HAVE_STDLIB_H 1
  1332. | #define HAVE_UNISTD_H 1
  1333. | #define HAVE_STRINGS_H 1
  1334. | #define HAVE_SYS_TYPES_H 1
  1335. | #define HAVE_SYS_STAT_H 1
  1336. | #define HAVE_MSG_NOSIGNAL 1
  1337. | /* end confdefs.h.  */
  1338. |
  1339. |       #include <db48/db_cxx.h>
  1340. |
  1341. | int
  1342. | main ()
  1343. | {
  1344. |
  1345. |       #if !((DB_VERSION_MAJOR == 4 && DB_VERSION_MINOR >= 8) || DB_VERSION_MAJOR > 4)
  1346. |         #error "failed to find bdb 4.8+"
  1347. |       #endif
  1348. |
  1349. |   ;
  1350. |   return 0;
  1351. | }
  1352. configure:9483: g++ -c -g3 -O0 -DDEBUG -Wall -Wextra -Wformat -Wformat-security -Wno-unused-parameter  -Wstack-protector -fstack-protector-all -fPIE  -DBOOST_SPIRIT_THREADSAFE -DHAVE_BUILD_INFO -D__STDC_FORMAT_MACROS  -U_FORTIFY_SOURCE -D_FORTIFY_SOURCE=2 conftest.cpp >&5
  1353. conftest.cpp:28:31: fatal error: bdb4/db_cxx.h: No such file or directory
  1354. compilation terminated.
  1355. configure:9483: $? = 1
  1356. configure: failed program was:
  1357. | /* confdefs.h */
  1358. | #define PACKAGE_NAME "Bitcoin Core"
  1359. | #define PACKAGE_TARNAME "bitcoin"
  1360. | #define PACKAGE_VERSION "0.9.0"
  1361. | #define PACKAGE_STRING "Bitcoin Core 0.9.0"
  1362. | #define PACKAGE_BUGREPORT "[email protected]"
  1363. | #define PACKAGE_URL ""
  1364. | #define STDC_HEADERS 1
  1365. | #define HAVE_SYS_TYPES_H 1
  1366. | #define HAVE_SYS_STAT_H 1
  1367. | #define HAVE_STDLIB_H 1
  1368. | #define HAVE_STRING_H 1
  1369. | #define HAVE_MEMORY_H 1
  1370. | #define HAVE_STRINGS_H 1
  1371. | #define HAVE_INTTYPES_H 1
  1372. | #define HAVE_STDINT_H 1
  1373. | #define HAVE_UNISTD_H 1
  1374. | #define HAVE_PTHREAD 1
  1375. | #define HAVE_STDIO_H 1
  1376. | #define HAVE_STDLIB_H 1
  1377. | #define HAVE_UNISTD_H 1
  1378. | #define HAVE_STRINGS_H 1
  1379. | #define HAVE_SYS_TYPES_H 1
  1380. | #define HAVE_SYS_STAT_H 1
  1381. | #define HAVE_MSG_NOSIGNAL 1
  1382. | /* end confdefs.h.  */
  1383. |
  1384. |       #include <bdb4/db_cxx.h>
  1385. |
  1386. | int
  1387. | main ()
  1388. | {
  1389. |
  1390. |       #if !((DB_VERSION_MAJOR == 4 && DB_VERSION_MINOR >= 8) || DB_VERSION_MAJOR > 4)
  1391. |         #error "failed to find bdb 4.8+"
  1392. |       #endif
  1393. |
  1394. |   ;
  1395. |   return 0;
  1396. | }
  1397. configure:9483: g++ -c -g3 -O0 -DDEBUG -Wall -Wextra -Wformat -Wformat-security -Wno-unused-parameter  -Wstack-protector -fstack-protector-all -fPIE  -DBOOST_SPIRIT_THREADSAFE -DHAVE_BUILD_INFO -D__STDC_FORMAT_MACROS  -U_FORTIFY_SOURCE -D_FORTIFY_SOURCE=2 conftest.cpp >&5
  1398. conftest.cpp:28:33: fatal error: libdb4/db_cxx.h: No such file or directory
  1399. compilation terminated.
  1400. configure:9483: $? = 1
  1401. configure: failed program was:
  1402. | /* confdefs.h */
  1403. | #define PACKAGE_NAME "Bitcoin Core"
  1404. | #define PACKAGE_TARNAME "bitcoin"
  1405. | #define PACKAGE_VERSION "0.9.0"
  1406. | #define PACKAGE_STRING "Bitcoin Core 0.9.0"
  1407. | #define PACKAGE_BUGREPORT "[email protected]"
  1408. | #define PACKAGE_URL ""
  1409. | #define STDC_HEADERS 1
  1410. | #define HAVE_SYS_TYPES_H 1
  1411. | #define HAVE_SYS_STAT_H 1
  1412. | #define HAVE_STDLIB_H 1
  1413. | #define HAVE_STRING_H 1
  1414. | #define HAVE_MEMORY_H 1
  1415. | #define HAVE_STRINGS_H 1
  1416. | #define HAVE_INTTYPES_H 1
  1417. | #define HAVE_STDINT_H 1
  1418. | #define HAVE_UNISTD_H 1
  1419. | #define HAVE_PTHREAD 1
  1420. | #define HAVE_STDIO_H 1
  1421. | #define HAVE_STDLIB_H 1
  1422. | #define HAVE_UNISTD_H 1
  1423. | #define HAVE_STRINGS_H 1
  1424. | #define HAVE_SYS_TYPES_H 1
  1425. | #define HAVE_SYS_STAT_H 1
  1426. | #define HAVE_MSG_NOSIGNAL 1
  1427. | /* end confdefs.h.  */
  1428. |
  1429. |       #include <libdb4/db_cxx.h>
  1430. |
  1431. | int
  1432. | main ()
  1433. | {
  1434. |
  1435. |       #if !((DB_VERSION_MAJOR == 4 && DB_VERSION_MINOR >= 8) || DB_VERSION_MAJOR > 4)
  1436. |         #error "failed to find bdb 4.8+"
  1437. |       #endif
  1438. |
  1439. |   ;
  1440. |   return 0;
  1441. | }
  1442. configure:9483: g++ -c -g3 -O0 -DDEBUG -Wall -Wextra -Wformat -Wformat-security -Wno-unused-parameter  -Wstack-protector -fstack-protector-all -fPIE  -DBOOST_SPIRIT_THREADSAFE -DHAVE_BUILD_INFO -D__STDC_FORMAT_MACROS  -U_FORTIFY_SOURCE -D_FORTIFY_SOURCE=2 conftest.cpp >&5
  1443. conftest.cpp:28:30: fatal error: db4/db_cxx.h: No such file or directory
  1444. compilation terminated.
  1445. configure:9483: $? = 1
  1446. configure: failed program was:
  1447. | /* confdefs.h */
  1448. | #define PACKAGE_NAME "Bitcoin Core"
  1449. | #define PACKAGE_TARNAME "bitcoin"
  1450. | #define PACKAGE_VERSION "0.9.0"
  1451. | #define PACKAGE_STRING "Bitcoin Core 0.9.0"
  1452. | #define PACKAGE_BUGREPORT "[email protected]"
  1453. | #define PACKAGE_URL ""
  1454. | #define STDC_HEADERS 1
  1455. | #define HAVE_SYS_TYPES_H 1
  1456. | #define HAVE_SYS_STAT_H 1
  1457. | #define HAVE_STDLIB_H 1
  1458. | #define HAVE_STRING_H 1
  1459. | #define HAVE_MEMORY_H 1
  1460. | #define HAVE_STRINGS_H 1
  1461. | #define HAVE_INTTYPES_H 1
  1462. | #define HAVE_STDINT_H 1
  1463. | #define HAVE_UNISTD_H 1
  1464. | #define HAVE_PTHREAD 1
  1465. | #define HAVE_STDIO_H 1
  1466. | #define HAVE_STDLIB_H 1
  1467. | #define HAVE_UNISTD_H 1
  1468. | #define HAVE_STRINGS_H 1
  1469. | #define HAVE_SYS_TYPES_H 1
  1470. | #define HAVE_SYS_STAT_H 1
  1471. | #define HAVE_MSG_NOSIGNAL 1
  1472. | /* end confdefs.h.  */
  1473. |
  1474. |       #include <db4/db_cxx.h>
  1475. |
  1476. | int
  1477. | main ()
  1478. | {
  1479. |
  1480. |       #if !((DB_VERSION_MAJOR == 4 && DB_VERSION_MINOR >= 8) || DB_VERSION_MAJOR > 4)
  1481. |         #error "failed to find bdb 4.8+"
  1482. |       #endif
  1483. |
  1484. |   ;
  1485. |   return 0;
  1486. | }
  1487. configure:9483: g++ -c -g3 -O0 -DDEBUG -Wall -Wextra -Wformat -Wformat-security -Wno-unused-parameter  -Wstack-protector -fstack-protector-all -fPIE  -DBOOST_SPIRIT_THREADSAFE -DHAVE_BUILD_INFO -D__STDC_FORMAT_MACROS  -U_FORTIFY_SOURCE -D_FORTIFY_SOURCE=2 conftest.cpp >&5
  1488. conftest.cpp:28:31: fatal error: bdb5/db_cxx.h: No such file or directory
  1489. compilation terminated.
  1490. configure:9483: $? = 1
  1491. configure: failed program was:
  1492. | /* confdefs.h */
  1493. | #define PACKAGE_NAME "Bitcoin Core"
  1494. | #define PACKAGE_TARNAME "bitcoin"
  1495. | #define PACKAGE_VERSION "0.9.0"
  1496. | #define PACKAGE_STRING "Bitcoin Core 0.9.0"
  1497. | #define PACKAGE_BUGREPORT "[email protected]"
  1498. | #define PACKAGE_URL ""
  1499. | #define STDC_HEADERS 1
  1500. | #define HAVE_SYS_TYPES_H 1
  1501. | #define HAVE_SYS_STAT_H 1
  1502. | #define HAVE_STDLIB_H 1
  1503. | #define HAVE_STRING_H 1
  1504. | #define HAVE_MEMORY_H 1
  1505. | #define HAVE_STRINGS_H 1
  1506. | #define HAVE_INTTYPES_H 1
  1507. | #define HAVE_STDINT_H 1
  1508. | #define HAVE_UNISTD_H 1
  1509. | #define HAVE_PTHREAD 1
  1510. | #define HAVE_STDIO_H 1
  1511. | #define HAVE_STDLIB_H 1
  1512. | #define HAVE_UNISTD_H 1
  1513. | #define HAVE_STRINGS_H 1
  1514. | #define HAVE_SYS_TYPES_H 1
  1515. | #define HAVE_SYS_STAT_H 1
  1516. | #define HAVE_MSG_NOSIGNAL 1
  1517. | /* end confdefs.h.  */
  1518. |
  1519. |       #include <bdb5/db_cxx.h>
  1520. |
  1521. | int
  1522. | main ()
  1523. | {
  1524. |
  1525. |       #if !((DB_VERSION_MAJOR == 4 && DB_VERSION_MINOR >= 8) || DB_VERSION_MAJOR > 4)
  1526. |         #error "failed to find bdb 4.8+"
  1527. |       #endif
  1528. |
  1529. |   ;
  1530. |   return 0;
  1531. | }
  1532. configure:9483: g++ -c -g3 -O0 -DDEBUG -Wall -Wextra -Wformat -Wformat-security -Wno-unused-parameter  -Wstack-protector -fstack-protector-all -fPIE  -DBOOST_SPIRIT_THREADSAFE -DHAVE_BUILD_INFO -D__STDC_FORMAT_MACROS  -U_FORTIFY_SOURCE -D_FORTIFY_SOURCE=2 conftest.cpp >&5
  1533. conftest.cpp:28:33: fatal error: libdb5/db_cxx.h: No such file or directory
  1534. compilation terminated.
  1535. configure:9483: $? = 1
  1536. configure: failed program was:
  1537. | /* confdefs.h */
  1538. | #define PACKAGE_NAME "Bitcoin Core"
  1539. | #define PACKAGE_TARNAME "bitcoin"
  1540. | #define PACKAGE_VERSION "0.9.0"
  1541. | #define PACKAGE_STRING "Bitcoin Core 0.9.0"
  1542. | #define PACKAGE_BUGREPORT "[email protected]"
  1543. | #define PACKAGE_URL ""
  1544. | #define STDC_HEADERS 1
  1545. | #define HAVE_SYS_TYPES_H 1
  1546. | #define HAVE_SYS_STAT_H 1
  1547. | #define HAVE_STDLIB_H 1
  1548. | #define HAVE_STRING_H 1
  1549. | #define HAVE_MEMORY_H 1
  1550. | #define HAVE_STRINGS_H 1
  1551. | #define HAVE_INTTYPES_H 1
  1552. | #define HAVE_STDINT_H 1
  1553. | #define HAVE_UNISTD_H 1
  1554. | #define HAVE_PTHREAD 1
  1555. | #define HAVE_STDIO_H 1
  1556. | #define HAVE_STDLIB_H 1
  1557. | #define HAVE_UNISTD_H 1
  1558. | #define HAVE_STRINGS_H 1
  1559. | #define HAVE_SYS_TYPES_H 1
  1560. | #define HAVE_SYS_STAT_H 1
  1561. | #define HAVE_MSG_NOSIGNAL 1
  1562. | /* end confdefs.h.  */
  1563. |
  1564. |       #include <libdb5/db_cxx.h>
  1565. |
  1566. | int
  1567. | main ()
  1568. | {
  1569. |
  1570. |       #if !((DB_VERSION_MAJOR == 4 && DB_VERSION_MINOR >= 8) || DB_VERSION_MAJOR > 4)
  1571. |         #error "failed to find bdb 4.8+"
  1572. |       #endif
  1573. |
  1574. |   ;
  1575. |   return 0;
  1576. | }
  1577. configure:9483: g++ -c -g3 -O0 -DDEBUG -Wall -Wextra -Wformat -Wformat-security -Wno-unused-parameter  -Wstack-protector -fstack-protector-all -fPIE  -DBOOST_SPIRIT_THREADSAFE -DHAVE_BUILD_INFO -D__STDC_FORMAT_MACROS  -U_FORTIFY_SOURCE -D_FORTIFY_SOURCE=2 conftest.cpp >&5
  1578. conftest.cpp:28:30: fatal error: db5/db_cxx.h: No such file or directory
  1579. compilation terminated.
  1580. configure:9483: $? = 1
  1581. configure: failed program was:
  1582. | /* confdefs.h */
  1583. | #define PACKAGE_NAME "Bitcoin Core"
  1584. | #define PACKAGE_TARNAME "bitcoin"
  1585. | #define PACKAGE_VERSION "0.9.0"
  1586. | #define PACKAGE_STRING "Bitcoin Core 0.9.0"
  1587. | #define PACKAGE_BUGREPORT "[email protected]"
  1588. | #define PACKAGE_URL ""
  1589. | #define STDC_HEADERS 1
  1590. | #define HAVE_SYS_TYPES_H 1
  1591. | #define HAVE_SYS_STAT_H 1
  1592. | #define HAVE_STDLIB_H 1
  1593. | #define HAVE_STRING_H 1
  1594. | #define HAVE_MEMORY_H 1
  1595. | #define HAVE_STRINGS_H 1
  1596. | #define HAVE_INTTYPES_H 1
  1597. | #define HAVE_STDINT_H 1
  1598. | #define HAVE_UNISTD_H 1
  1599. | #define HAVE_PTHREAD 1
  1600. | #define HAVE_STDIO_H 1
  1601. | #define HAVE_STDLIB_H 1
  1602. | #define HAVE_UNISTD_H 1
  1603. | #define HAVE_STRINGS_H 1
  1604. | #define HAVE_SYS_TYPES_H 1
  1605. | #define HAVE_SYS_STAT_H 1
  1606. | #define HAVE_MSG_NOSIGNAL 1
  1607. | /* end confdefs.h.  */
  1608. |
  1609. |       #include <db5/db_cxx.h>
  1610. |
  1611. | int
  1612. | main ()
  1613. | {
  1614. |
  1615. |       #if !((DB_VERSION_MAJOR == 4 && DB_VERSION_MINOR >= 8) || DB_VERSION_MAJOR > 4)
  1616. |         #error "failed to find bdb 4.8+"
  1617. |       #endif
  1618. |
  1619. |   ;
  1620. |   return 0;
  1621. | }
  1622. configure:9483: g++ -c -g3 -O0 -DDEBUG -Wall -Wextra -Wformat -Wformat-security -Wno-unused-parameter  -Wstack-protector -fstack-protector-all -fPIE  -DBOOST_SPIRIT_THREADSAFE -DHAVE_BUILD_INFO -D__STDC_FORMAT_MACROS  -U_FORTIFY_SOURCE -D_FORTIFY_SOURCE=2 conftest.cpp >&5
  1623. conftest.cpp:28:30: fatal error: bdb/db_cxx.h: No such file or directory
  1624. compilation terminated.
  1625. configure:9483: $? = 1
  1626. configure: failed program was:
  1627. | /* confdefs.h */
  1628. | #define PACKAGE_NAME "Bitcoin Core"
  1629. | #define PACKAGE_TARNAME "bitcoin"
  1630. | #define PACKAGE_VERSION "0.9.0"
  1631. | #define PACKAGE_STRING "Bitcoin Core 0.9.0"
  1632. | #define PACKAGE_BUGREPORT "[email protected]"
  1633. | #define PACKAGE_URL ""
  1634. | #define STDC_HEADERS 1
  1635. | #define HAVE_SYS_TYPES_H 1
  1636. | #define HAVE_SYS_STAT_H 1
  1637. | #define HAVE_STDLIB_H 1
  1638. | #define HAVE_STRING_H 1
  1639. | #define HAVE_MEMORY_H 1
  1640. | #define HAVE_STRINGS_H 1
  1641. | #define HAVE_INTTYPES_H 1
  1642. | #define HAVE_STDINT_H 1
  1643. | #define HAVE_UNISTD_H 1
  1644. | #define HAVE_PTHREAD 1
  1645. | #define HAVE_STDIO_H 1
  1646. | #define HAVE_STDLIB_H 1
  1647. | #define HAVE_UNISTD_H 1
  1648. | #define HAVE_STRINGS_H 1
  1649. | #define HAVE_SYS_TYPES_H 1
  1650. | #define HAVE_SYS_STAT_H 1
  1651. | #define HAVE_MSG_NOSIGNAL 1
  1652. | /* end confdefs.h.  */
  1653. |
  1654. |       #include <bdb/db_cxx.h>
  1655. |
  1656. | int
  1657. | main ()
  1658. | {
  1659. |
  1660. |       #if !((DB_VERSION_MAJOR == 4 && DB_VERSION_MINOR >= 8) || DB_VERSION_MAJOR > 4)
  1661. |         #error "failed to find bdb 4.8+"
  1662. |       #endif
  1663. |
  1664. |   ;
  1665. |   return 0;
  1666. | }
  1667. configure:9483: g++ -c -g3 -O0 -DDEBUG -Wall -Wextra -Wformat -Wformat-security -Wno-unused-parameter  -Wstack-protector -fstack-protector-all -fPIE  -DBOOST_SPIRIT_THREADSAFE -DHAVE_BUILD_INFO -D__STDC_FORMAT_MACROS  -U_FORTIFY_SOURCE -D_FORTIFY_SOURCE=2 conftest.cpp >&5
  1668. conftest.cpp:28:32: fatal error: libdb/db_cxx.h: No such file or directory
  1669. compilation terminated.
  1670. configure:9483: $? = 1
  1671. configure: failed program was:
  1672. | /* confdefs.h */
  1673. | #define PACKAGE_NAME "Bitcoin Core"
  1674. | #define PACKAGE_TARNAME "bitcoin"
  1675. | #define PACKAGE_VERSION "0.9.0"
  1676. | #define PACKAGE_STRING "Bitcoin Core 0.9.0"
  1677. | #define PACKAGE_BUGREPORT "[email protected]"
  1678. | #define PACKAGE_URL ""
  1679. | #define STDC_HEADERS 1
  1680. | #define HAVE_SYS_TYPES_H 1
  1681. | #define HAVE_SYS_STAT_H 1
  1682. | #define HAVE_STDLIB_H 1
  1683. | #define HAVE_STRING_H 1
  1684. | #define HAVE_MEMORY_H 1
  1685. | #define HAVE_STRINGS_H 1
  1686. | #define HAVE_INTTYPES_H 1
  1687. | #define HAVE_STDINT_H 1
  1688. | #define HAVE_UNISTD_H 1
  1689. | #define HAVE_PTHREAD 1
  1690. | #define HAVE_STDIO_H 1
  1691. | #define HAVE_STDLIB_H 1
  1692. | #define HAVE_UNISTD_H 1
  1693. | #define HAVE_STRINGS_H 1
  1694. | #define HAVE_SYS_TYPES_H 1
  1695. | #define HAVE_SYS_STAT_H 1
  1696. | #define HAVE_MSG_NOSIGNAL 1
  1697. | /* end confdefs.h.  */
  1698. |
  1699. |       #include <libdb/db_cxx.h>
  1700. |
  1701. | int
  1702. | main ()
  1703. | {
  1704. |
  1705. |       #if !((DB_VERSION_MAJOR == 4 && DB_VERSION_MINOR >= 8) || DB_VERSION_MAJOR > 4)
  1706. |         #error "failed to find bdb 4.8+"
  1707. |       #endif
  1708. |
  1709. |   ;
  1710. |   return 0;
  1711. | }
  1712. configure:9483: g++ -c -g3 -O0 -DDEBUG -Wall -Wextra -Wformat -Wformat-security -Wno-unused-parameter  -Wstack-protector -fstack-protector-all -fPIE  -DBOOST_SPIRIT_THREADSAFE -DHAVE_BUILD_INFO -D__STDC_FORMAT_MACROS  -U_FORTIFY_SOURCE -D_FORTIFY_SOURCE=2 conftest.cpp >&5
  1713. conftest.cpp:28:29: fatal error: db/db_cxx.h: No such file or directory
  1714. compilation terminated.
  1715. configure:9483: $? = 1
  1716. configure: failed program was:
  1717. | /* confdefs.h */
  1718. | #define PACKAGE_NAME "Bitcoin Core"
  1719. | #define PACKAGE_TARNAME "bitcoin"
  1720. | #define PACKAGE_VERSION "0.9.0"
  1721. | #define PACKAGE_STRING "Bitcoin Core 0.9.0"
  1722. | #define PACKAGE_BUGREPORT "[email protected]"
  1723. | #define PACKAGE_URL ""
  1724. | #define STDC_HEADERS 1
  1725. | #define HAVE_SYS_TYPES_H 1
  1726. | #define HAVE_SYS_STAT_H 1
  1727. | #define HAVE_STDLIB_H 1
  1728. | #define HAVE_STRING_H 1
  1729. | #define HAVE_MEMORY_H 1
  1730. | #define HAVE_STRINGS_H 1
  1731. | #define HAVE_INTTYPES_H 1
  1732. | #define HAVE_STDINT_H 1
  1733. | #define HAVE_UNISTD_H 1
  1734. | #define HAVE_PTHREAD 1
  1735. | #define HAVE_STDIO_H 1
  1736. | #define HAVE_STDLIB_H 1
  1737. | #define HAVE_UNISTD_H 1
  1738. | #define HAVE_STRINGS_H 1
  1739. | #define HAVE_SYS_TYPES_H 1
  1740. | #define HAVE_SYS_STAT_H 1
  1741. | #define HAVE_MSG_NOSIGNAL 1
  1742. | /* end confdefs.h.  */
  1743. |
  1744. |       #include <db/db_cxx.h>
  1745. |
  1746. | int
  1747. | main ()
  1748. | {
  1749. |
  1750. |       #if !((DB_VERSION_MAJOR == 4 && DB_VERSION_MINOR >= 8) || DB_VERSION_MAJOR > 4)
  1751. |         #error "failed to find bdb 4.8+"
  1752. |       #endif
  1753. |
  1754. |   ;
  1755. |   return 0;
  1756. | }
  1757. configure:9483: g++ -c -g3 -O0 -DDEBUG -Wall -Wextra -Wformat -Wformat-security -Wno-unused-parameter  -Wstack-protector -fstack-protector-all -fPIE  -DBOOST_SPIRIT_THREADSAFE -DHAVE_BUILD_INFO -D__STDC_FORMAT_MACROS  -U_FORTIFY_SOURCE -D_FORTIFY_SOURCE=2 conftest.cpp >&5
  1758. configure:9483: $? = 0
  1759. configure:9512: g++ -c -g3 -O0 -DDEBUG -Wall -Wextra -Wformat -Wformat-security -Wno-unused-parameter  -Wstack-protector -fstack-protector-all -fPIE  -DBOOST_SPIRIT_THREADSAFE -DHAVE_BUILD_INFO -D__STDC_FORMAT_MACROS  -U_FORTIFY_SOURCE -D_FORTIFY_SOURCE=2 conftest.cpp >&5
  1760. configure:9512: $? = 0
  1761. configure:9555: result: default
  1762. configure:9574: checking for main in -ldb_cxx-4.8
  1763. configure:9593: g++ -o conftest -g3 -O0 -DDEBUG -Wall -Wextra -Wformat -Wformat-security -Wno-unused-parameter  -Wstack-protector -fstack-protector-all -fPIE  -DBOOST_SPIRIT_THREADSAFE -DHAVE_BUILD_INFO -D__STDC_FORMAT_MACROS  -U_FORTIFY_SOURCE -D_FORTIFY_SOURCE=2   -Wl,-z,relro -Wl,-z,now -pie conftest.cpp -ldb_cxx-4.8   >&5
  1764. configure:9593: $? = 0
  1765. configure:9603: result: yes
  1766. configure:9624: checking miniupnpc/miniwget.h usability
  1767. configure:9624: g++ -c -g3 -O0 -DDEBUG -Wall -Wextra -Wformat -Wformat-security -Wno-unused-parameter  -Wstack-protector -fstack-protector-all -fPIE  -DBOOST_SPIRIT_THREADSAFE -DHAVE_BUILD_INFO -D__STDC_FORMAT_MACROS  -U_FORTIFY_SOURCE -D_FORTIFY_SOURCE=2 conftest.cpp >&5
  1768. conftest.cpp:60:32: fatal error: miniupnpc/miniwget.h: No such file or directory
  1769. compilation terminated.
  1770. configure:9624: $? = 1
  1771. configure: failed program was:
  1772. | /* confdefs.h */
  1773. | #define PACKAGE_NAME "Bitcoin Core"
  1774. | #define PACKAGE_TARNAME "bitcoin"
  1775. | #define PACKAGE_VERSION "0.9.0"
  1776. | #define PACKAGE_STRING "Bitcoin Core 0.9.0"
  1777. | #define PACKAGE_BUGREPORT "[email protected]"
  1778. | #define PACKAGE_URL ""
  1779. | #define STDC_HEADERS 1
  1780. | #define HAVE_SYS_TYPES_H 1
  1781. | #define HAVE_SYS_STAT_H 1
  1782. | #define HAVE_STDLIB_H 1
  1783. | #define HAVE_STRING_H 1
  1784. | #define HAVE_MEMORY_H 1
  1785. | #define HAVE_STRINGS_H 1
  1786. | #define HAVE_INTTYPES_H 1
  1787. | #define HAVE_STDINT_H 1
  1788. | #define HAVE_UNISTD_H 1
  1789. | #define HAVE_PTHREAD 1
  1790. | #define HAVE_STDIO_H 1
  1791. | #define HAVE_STDLIB_H 1
  1792. | #define HAVE_UNISTD_H 1
  1793. | #define HAVE_STRINGS_H 1
  1794. | #define HAVE_SYS_TYPES_H 1
  1795. | #define HAVE_SYS_STAT_H 1
  1796. | #define HAVE_MSG_NOSIGNAL 1
  1797. | /* end confdefs.h.  */
  1798. | #include <stdio.h>
  1799. | #ifdef HAVE_SYS_TYPES_H
  1800. | # include <sys/types.h>
  1801. | #endif
  1802. | #ifdef HAVE_SYS_STAT_H
  1803. | # include <sys/stat.h>
  1804. | #endif
  1805. | #ifdef STDC_HEADERS
  1806. | # include <stdlib.h>
  1807. | # include <stddef.h>
  1808. | #else
  1809. | # ifdef HAVE_STDLIB_H
  1810. | #  include <stdlib.h>
  1811. | # endif
  1812. | #endif
  1813. | #ifdef HAVE_STRING_H
  1814. | # if !defined STDC_HEADERS && defined HAVE_MEMORY_H
  1815. | #  include <memory.h>
  1816. | # endif
  1817. | # include <string.h>
  1818. | #endif
  1819. | #ifdef HAVE_STRINGS_H
  1820. | # include <strings.h>
  1821. | #endif
  1822. | #ifdef HAVE_INTTYPES_H
  1823. | # include <inttypes.h>
  1824. | #endif
  1825. | #ifdef HAVE_STDINT_H
  1826. | # include <stdint.h>
  1827. | #endif
  1828. | #ifdef HAVE_UNISTD_H
  1829. | # include <unistd.h>
  1830. | #endif
  1831. | #include <miniupnpc/miniwget.h>
  1832. configure:9624: result: no
  1833. configure:9624: checking miniupnpc/miniwget.h presence
  1834. configure:9624: g++ -E  -DBOOST_SPIRIT_THREADSAFE -DHAVE_BUILD_INFO -D__STDC_FORMAT_MACROS  -U_FORTIFY_SOURCE -D_FORTIFY_SOURCE=2 conftest.cpp
  1835. conftest.cpp:27:32: fatal error: miniupnpc/miniwget.h: No such file or directory
  1836. compilation terminated.
  1837. configure:9624: $? = 1
  1838. configure: failed program was:
  1839. | /* confdefs.h */
  1840. | #define PACKAGE_NAME "Bitcoin Core"
  1841. | #define PACKAGE_TARNAME "bitcoin"
  1842. | #define PACKAGE_VERSION "0.9.0"
  1843. | #define PACKAGE_STRING "Bitcoin Core 0.9.0"
  1844. | #define PACKAGE_BUGREPORT "[email protected]"
  1845. | #define PACKAGE_URL ""
  1846. | #define STDC_HEADERS 1
  1847. | #define HAVE_SYS_TYPES_H 1
  1848. | #define HAVE_SYS_STAT_H 1
  1849. | #define HAVE_STDLIB_H 1
  1850. | #define HAVE_STRING_H 1
  1851. | #define HAVE_MEMORY_H 1
  1852. | #define HAVE_STRINGS_H 1
  1853. | #define HAVE_INTTYPES_H 1
  1854. | #define HAVE_STDINT_H 1
  1855. | #define HAVE_UNISTD_H 1
  1856. | #define HAVE_PTHREAD 1
  1857. | #define HAVE_STDIO_H 1
  1858. | #define HAVE_STDLIB_H 1
  1859. | #define HAVE_UNISTD_H 1
  1860. | #define HAVE_STRINGS_H 1
  1861. | #define HAVE_SYS_TYPES_H 1
  1862. | #define HAVE_SYS_STAT_H 1
  1863. | #define HAVE_MSG_NOSIGNAL 1
  1864. | /* end confdefs.h.  */
  1865. | #include <miniupnpc/miniwget.h>
  1866. configure:9624: result: no
  1867. configure:9624: checking for miniupnpc/miniwget.h
  1868. configure:9624: result: no
  1869. configure:9624: checking miniupnpc/miniupnpc.h usability
  1870. configure:9624: g++ -c -g3 -O0 -DDEBUG -Wall -Wextra -Wformat -Wformat-security -Wno-unused-parameter  -Wstack-protector -fstack-protector-all -fPIE  -DBOOST_SPIRIT_THREADSAFE -DHAVE_BUILD_INFO -D__STDC_FORMAT_MACROS  -U_FORTIFY_SOURCE -D_FORTIFY_SOURCE=2 conftest.cpp >&5
  1871. conftest.cpp:60:33: fatal error: miniupnpc/miniupnpc.h: No such file or directory
  1872. compilation terminated.
  1873. configure:9624: $? = 1
  1874. configure: failed program was:
  1875. | /* confdefs.h */
  1876. | #define PACKAGE_NAME "Bitcoin Core"
  1877. | #define PACKAGE_TARNAME "bitcoin"
  1878. | #define PACKAGE_VERSION "0.9.0"
  1879. | #define PACKAGE_STRING "Bitcoin Core 0.9.0"
  1880. | #define PACKAGE_BUGREPORT "[email protected]"
  1881. | #define PACKAGE_URL ""
  1882. | #define STDC_HEADERS 1
  1883. | #define HAVE_SYS_TYPES_H 1
  1884. | #define HAVE_SYS_STAT_H 1
  1885. | #define HAVE_STDLIB_H 1
  1886. | #define HAVE_STRING_H 1
  1887. | #define HAVE_MEMORY_H 1
  1888. | #define HAVE_STRINGS_H 1
  1889. | #define HAVE_INTTYPES_H 1
  1890. | #define HAVE_STDINT_H 1
  1891. | #define HAVE_UNISTD_H 1
  1892. | #define HAVE_PTHREAD 1
  1893. | #define HAVE_STDIO_H 1
  1894. | #define HAVE_STDLIB_H 1
  1895. | #define HAVE_UNISTD_H 1
  1896. | #define HAVE_STRINGS_H 1
  1897. | #define HAVE_SYS_TYPES_H 1
  1898. | #define HAVE_SYS_STAT_H 1
  1899. | #define HAVE_MSG_NOSIGNAL 1
  1900. | /* end confdefs.h.  */
  1901. | #include <stdio.h>
  1902. | #ifdef HAVE_SYS_TYPES_H
  1903. | # include <sys/types.h>
  1904. | #endif
  1905. | #ifdef HAVE_SYS_STAT_H
  1906. | # include <sys/stat.h>
  1907. | #endif
  1908. | #ifdef STDC_HEADERS
  1909. | # include <stdlib.h>
  1910. | # include <stddef.h>
  1911. | #else
  1912. | # ifdef HAVE_STDLIB_H
  1913. | #  include <stdlib.h>
  1914. | # endif
  1915. | #endif
  1916. | #ifdef HAVE_STRING_H
  1917. | # if !defined STDC_HEADERS && defined HAVE_MEMORY_H
  1918. | #  include <memory.h>
  1919. | # endif
  1920. | # include <string.h>
  1921. | #endif
  1922. | #ifdef HAVE_STRINGS_H
  1923. | # include <strings.h>
  1924. | #endif
  1925. | #ifdef HAVE_INTTYPES_H
  1926. | # include <inttypes.h>
  1927. | #endif
  1928. | #ifdef HAVE_STDINT_H
  1929. | # include <stdint.h>
  1930. | #endif
  1931. | #ifdef HAVE_UNISTD_H
  1932. | # include <unistd.h>
  1933. | #endif
  1934. | #include <miniupnpc/miniupnpc.h>
  1935. configure:9624: result: no
  1936. configure:9624: checking miniupnpc/miniupnpc.h presence
  1937. configure:9624: g++ -E  -DBOOST_SPIRIT_THREADSAFE -DHAVE_BUILD_INFO -D__STDC_FORMAT_MACROS  -U_FORTIFY_SOURCE -D_FORTIFY_SOURCE=2 conftest.cpp
  1938. conftest.cpp:27:33: fatal error: miniupnpc/miniupnpc.h: No such file or directory
  1939. compilation terminated.
  1940. configure:9624: $? = 1
  1941. configure: failed program was:
  1942. | /* confdefs.h */
  1943. | #define PACKAGE_NAME "Bitcoin Core"
  1944. | #define PACKAGE_TARNAME "bitcoin"
  1945. | #define PACKAGE_VERSION "0.9.0"
  1946. | #define PACKAGE_STRING "Bitcoin Core 0.9.0"
  1947. | #define PACKAGE_BUGREPORT "[email protected]"
  1948. | #define PACKAGE_URL ""
  1949. | #define STDC_HEADERS 1
  1950. | #define HAVE_SYS_TYPES_H 1
  1951. | #define HAVE_SYS_STAT_H 1
  1952. | #define HAVE_STDLIB_H 1
  1953. | #define HAVE_STRING_H 1
  1954. | #define HAVE_MEMORY_H 1
  1955. | #define HAVE_STRINGS_H 1
  1956. | #define HAVE_INTTYPES_H 1
  1957. | #define HAVE_STDINT_H 1
  1958. | #define HAVE_UNISTD_H 1
  1959. | #define HAVE_PTHREAD 1
  1960. | #define HAVE_STDIO_H 1
  1961. | #define HAVE_STDLIB_H 1
  1962. | #define HAVE_UNISTD_H 1
  1963. | #define HAVE_STRINGS_H 1
  1964. | #define HAVE_SYS_TYPES_H 1
  1965. | #define HAVE_SYS_STAT_H 1
  1966. | #define HAVE_MSG_NOSIGNAL 1
  1967. | /* end confdefs.h.  */
  1968. | #include <miniupnpc/miniupnpc.h>
  1969. configure:9624: result: no
  1970. configure:9624: checking for miniupnpc/miniupnpc.h
  1971. configure:9624: result: no
  1972. configure:9624: checking miniupnpc/upnpcommands.h usability
  1973. configure:9624: g++ -c -g3 -O0 -DDEBUG -Wall -Wextra -Wformat -Wformat-security -Wno-unused-parameter  -Wstack-protector -fstack-protector-all -fPIE  -DBOOST_SPIRIT_THREADSAFE -DHAVE_BUILD_INFO -D__STDC_FORMAT_MACROS  -U_FORTIFY_SOURCE -D_FORTIFY_SOURCE=2 conftest.cpp >&5
  1974. conftest.cpp:60:36: fatal error: miniupnpc/upnpcommands.h: No such file or directory
  1975. compilation terminated.
  1976. configure:9624: $? = 1
  1977. configure: failed program was:
  1978. | /* confdefs.h */
  1979. | #define PACKAGE_NAME "Bitcoin Core"
  1980. | #define PACKAGE_TARNAME "bitcoin"
  1981. | #define PACKAGE_VERSION "0.9.0"
  1982. | #define PACKAGE_STRING "Bitcoin Core 0.9.0"
  1983. | #define PACKAGE_BUGREPORT "[email protected]"
  1984. | #define PACKAGE_URL ""
  1985. | #define STDC_HEADERS 1
  1986. | #define HAVE_SYS_TYPES_H 1
  1987. | #define HAVE_SYS_STAT_H 1
  1988. | #define HAVE_STDLIB_H 1
  1989. | #define HAVE_STRING_H 1
  1990. | #define HAVE_MEMORY_H 1
  1991. | #define HAVE_STRINGS_H 1
  1992. | #define HAVE_INTTYPES_H 1
  1993. | #define HAVE_STDINT_H 1
  1994. | #define HAVE_UNISTD_H 1
  1995. | #define HAVE_PTHREAD 1
  1996. | #define HAVE_STDIO_H 1
  1997. | #define HAVE_STDLIB_H 1
  1998. | #define HAVE_UNISTD_H 1
  1999. | #define HAVE_STRINGS_H 1
  2000. | #define HAVE_SYS_TYPES_H 1
  2001. | #define HAVE_SYS_STAT_H 1
  2002. | #define HAVE_MSG_NOSIGNAL 1
  2003. | /* end confdefs.h.  */
  2004. | #include <stdio.h>
  2005. | #ifdef HAVE_SYS_TYPES_H
  2006. | # include <sys/types.h>
  2007. | #endif
  2008. | #ifdef HAVE_SYS_STAT_H
  2009. | # include <sys/stat.h>
  2010. | #endif
  2011. | #ifdef STDC_HEADERS
  2012. | # include <stdlib.h>
  2013. | # include <stddef.h>
  2014. | #else
  2015. | # ifdef HAVE_STDLIB_H
  2016. | #  include <stdlib.h>
  2017. | # endif
  2018. | #endif
  2019. | #ifdef HAVE_STRING_H
  2020. | # if !defined STDC_HEADERS && defined HAVE_MEMORY_H
  2021. | #  include <memory.h>
  2022. | # endif
  2023. | # include <string.h>
  2024. | #endif
  2025. | #ifdef HAVE_STRINGS_H
  2026. | # include <strings.h>
  2027. | #endif
  2028. | #ifdef HAVE_INTTYPES_H
  2029. | # include <inttypes.h>
  2030. | #endif
  2031. | #ifdef HAVE_STDINT_H
  2032. | # include <stdint.h>
  2033. | #endif
  2034. | #ifdef HAVE_UNISTD_H
  2035. | # include <unistd.h>
  2036. | #endif
  2037. | #include <miniupnpc/upnpcommands.h>
  2038. configure:9624: result: no
  2039. configure:9624: checking miniupnpc/upnpcommands.h presence
  2040. configure:9624: g++ -E  -DBOOST_SPIRIT_THREADSAFE -DHAVE_BUILD_INFO -D__STDC_FORMAT_MACROS  -U_FORTIFY_SOURCE -D_FORTIFY_SOURCE=2 conftest.cpp
  2041. conftest.cpp:27:36: fatal error: miniupnpc/upnpcommands.h: No such file or directory
  2042. compilation terminated.
  2043. configure:9624: $? = 1
  2044. configure: failed program was:
  2045. | /* confdefs.h */
  2046. | #define PACKAGE_NAME "Bitcoin Core"
  2047. | #define PACKAGE_TARNAME "bitcoin"
  2048. | #define PACKAGE_VERSION "0.9.0"
  2049. | #define PACKAGE_STRING "Bitcoin Core 0.9.0"
  2050. | #define PACKAGE_BUGREPORT "[email protected]"
  2051. | #define PACKAGE_URL ""
  2052. | #define STDC_HEADERS 1
  2053. | #define HAVE_SYS_TYPES_H 1
  2054. | #define HAVE_SYS_STAT_H 1
  2055. | #define HAVE_STDLIB_H 1
  2056. | #define HAVE_STRING_H 1
  2057. | #define HAVE_MEMORY_H 1
  2058. | #define HAVE_STRINGS_H 1
  2059. | #define HAVE_INTTYPES_H 1
  2060. | #define HAVE_STDINT_H 1
  2061. | #define HAVE_UNISTD_H 1
  2062. | #define HAVE_PTHREAD 1
  2063. | #define HAVE_STDIO_H 1
  2064. | #define HAVE_STDLIB_H 1
  2065. | #define HAVE_UNISTD_H 1
  2066. | #define HAVE_STRINGS_H 1
  2067. | #define HAVE_SYS_TYPES_H 1
  2068. | #define HAVE_SYS_STAT_H 1
  2069. | #define HAVE_MSG_NOSIGNAL 1
  2070. | /* end confdefs.h.  */
  2071. | #include <miniupnpc/upnpcommands.h>
  2072. configure:9624: result: no
  2073. configure:9624: checking for miniupnpc/upnpcommands.h
  2074. configure:9624: result: no
  2075. configure:9624: checking miniupnpc/upnperrors.h usability
  2076. configure:9624: g++ -c -g3 -O0 -DDEBUG -Wall -Wextra -Wformat -Wformat-security -Wno-unused-parameter  -Wstack-protector -fstack-protector-all -fPIE  -DBOOST_SPIRIT_THREADSAFE -DHAVE_BUILD_INFO -D__STDC_FORMAT_MACROS  -U_FORTIFY_SOURCE -D_FORTIFY_SOURCE=2 conftest.cpp >&5
  2077. conftest.cpp:60:34: fatal error: miniupnpc/upnperrors.h: No such file or directory
  2078. compilation terminated.
  2079. configure:9624: $? = 1
  2080. configure: failed program was:
  2081. | /* confdefs.h */
  2082. | #define PACKAGE_NAME "Bitcoin Core"
  2083. | #define PACKAGE_TARNAME "bitcoin"
  2084. | #define PACKAGE_VERSION "0.9.0"
  2085. | #define PACKAGE_STRING "Bitcoin Core 0.9.0"
  2086. | #define PACKAGE_BUGREPORT "[email protected]"
  2087. | #define PACKAGE_URL ""
  2088. | #define STDC_HEADERS 1
  2089. | #define HAVE_SYS_TYPES_H 1
  2090. | #define HAVE_SYS_STAT_H 1
  2091. | #define HAVE_STDLIB_H 1
  2092. | #define HAVE_STRING_H 1
  2093. | #define HAVE_MEMORY_H 1
  2094. | #define HAVE_STRINGS_H 1
  2095. | #define HAVE_INTTYPES_H 1
  2096. | #define HAVE_STDINT_H 1
  2097. | #define HAVE_UNISTD_H 1
  2098. | #define HAVE_PTHREAD 1
  2099. | #define HAVE_STDIO_H 1
  2100. | #define HAVE_STDLIB_H 1
  2101. | #define HAVE_UNISTD_H 1
  2102. | #define HAVE_STRINGS_H 1
  2103. | #define HAVE_SYS_TYPES_H 1
  2104. | #define HAVE_SYS_STAT_H 1
  2105. | #define HAVE_MSG_NOSIGNAL 1
  2106. | /* end confdefs.h.  */
  2107. | #include <stdio.h>
  2108. | #ifdef HAVE_SYS_TYPES_H
  2109. | # include <sys/types.h>
  2110. | #endif
  2111. | #ifdef HAVE_SYS_STAT_H
  2112. | # include <sys/stat.h>
  2113. | #endif
  2114. | #ifdef STDC_HEADERS
  2115. | # include <stdlib.h>
  2116. | # include <stddef.h>
  2117. | #else
  2118. | # ifdef HAVE_STDLIB_H
  2119. | #  include <stdlib.h>
  2120. | # endif
  2121. | #endif
  2122. | #ifdef HAVE_STRING_H
  2123. | # if !defined STDC_HEADERS && defined HAVE_MEMORY_H
  2124. | #  include <memory.h>
  2125. | # endif
  2126. | # include <string.h>
  2127. | #endif
  2128. | #ifdef HAVE_STRINGS_H
  2129. | # include <strings.h>
  2130. | #endif
  2131. | #ifdef HAVE_INTTYPES_H
  2132. | # include <inttypes.h>
  2133. | #endif
  2134. | #ifdef HAVE_STDINT_H
  2135. | # include <stdint.h>
  2136. | #endif
  2137. | #ifdef HAVE_UNISTD_H
  2138. | # include <unistd.h>
  2139. | #endif
  2140. | #include <miniupnpc/upnperrors.h>
  2141. configure:9624: result: no
  2142. configure:9624: checking miniupnpc/upnperrors.h presence
  2143. configure:9624: g++ -E  -DBOOST_SPIRIT_THREADSAFE -DHAVE_BUILD_INFO -D__STDC_FORMAT_MACROS  -U_FORTIFY_SOURCE -D_FORTIFY_SOURCE=2 conftest.cpp
  2144. conftest.cpp:27:34: fatal error: miniupnpc/upnperrors.h: No such file or directory
  2145. compilation terminated.
  2146. configure:9624: $? = 1
  2147. configure: failed program was:
  2148. | /* confdefs.h */
  2149. | #define PACKAGE_NAME "Bitcoin Core"
  2150. | #define PACKAGE_TARNAME "bitcoin"
  2151. | #define PACKAGE_VERSION "0.9.0"
  2152. | #define PACKAGE_STRING "Bitcoin Core 0.9.0"
  2153. | #define PACKAGE_BUGREPORT "[email protected]"
  2154. | #define PACKAGE_URL ""
  2155. | #define STDC_HEADERS 1
  2156. | #define HAVE_SYS_TYPES_H 1
  2157. | #define HAVE_SYS_STAT_H 1
  2158. | #define HAVE_STDLIB_H 1
  2159. | #define HAVE_STRING_H 1
  2160. | #define HAVE_MEMORY_H 1
  2161. | #define HAVE_STRINGS_H 1
  2162. | #define HAVE_INTTYPES_H 1
  2163. | #define HAVE_STDINT_H 1
  2164. | #define HAVE_UNISTD_H 1
  2165. | #define HAVE_PTHREAD 1
  2166. | #define HAVE_STDIO_H 1
  2167. | #define HAVE_STDLIB_H 1
  2168. | #define HAVE_UNISTD_H 1
  2169. | #define HAVE_STRINGS_H 1
  2170. | #define HAVE_SYS_TYPES_H 1
  2171. | #define HAVE_SYS_STAT_H 1
  2172. | #define HAVE_MSG_NOSIGNAL 1
  2173. | /* end confdefs.h.  */
  2174. | #include <miniupnpc/upnperrors.h>
  2175. configure:9624: result: no
  2176. configure:9624: checking for miniupnpc/upnperrors.h
  2177. configure:9624: result: no
  2178. configure:9727: checking for boostlib >= 1.20.0
  2179. configure:9801: g++ -c -g3 -O0 -DDEBUG -Wall -Wextra -Wformat -Wformat-security -Wno-unused-parameter  -Wstack-protector -fstack-protector-all -fPIE  -DBOOST_SPIRIT_THREADSAFE -DHAVE_BUILD_INFO -D__STDC_FORMAT_MACROS  -U_FORTIFY_SOURCE -D_FORTIFY_SOURCE=2 -I/usr/include conftest.cpp >&5
  2180. configure:9801: $? = 0
  2181. configure:9803: result: yes
  2182. configure:9987: checking whether the Boost::System library is available
  2183. configure:10011: g++ -c -g3 -O0 -DDEBUG -Wall -Wextra -Wformat -Wformat-security -Wno-unused-parameter  -Wstack-protector -fstack-protector-all -fPIE  -DBOOST_SPIRIT_THREADSAFE -DHAVE_BUILD_INFO -D__STDC_FORMAT_MACROS  -U_FORTIFY_SOURCE -D_FORTIFY_SOURCE=2 -I/usr/include conftest.cpp >&5
  2184. conftest.cpp: In function 'int main()':
  2185. conftest.cpp:33:3: warning: statement is a reference, not call, to function 'boost::system::system_category' [-Waddress]
  2186. conftest.cpp:33:3: warning: statement has no effect [-Wunused-value]
  2187. configure:10011: $? = 0
  2188. configure:10026: result: yes
  2189. configure:10041: checking for exit in -lboost_system
  2190. configure:10066: g++ -o conftest -g3 -O0 -DDEBUG -Wall -Wextra -Wformat -Wformat-security -Wno-unused-parameter  -Wstack-protector -fstack-protector-all -fPIE  -DBOOST_SPIRIT_THREADSAFE -DHAVE_BUILD_INFO -D__STDC_FORMAT_MACROS  -U_FORTIFY_SOURCE -D_FORTIFY_SOURCE=2 -I/usr/include   -Wl,-z,relro -Wl,-z,now -pie -L/home/<username>/Downloads/boost_1_53_0/stage/lib conftest.cpp -lboost_system   >&5
  2191. configure:10066: $? = 0
  2192. configure:10076: result: yes
  2193. configure:10231: checking whether the Boost::Filesystem library is available
  2194. configure:10255: g++ -c -g3 -O0 -DDEBUG -Wall -Wextra -Wformat -Wformat-security -Wno-unused-parameter  -Wstack-protector -fstack-protector-all -fPIE  -DBOOST_SPIRIT_THREADSAFE -DHAVE_BUILD_INFO -D__STDC_FORMAT_MACROS  -U_FORTIFY_SOURCE -D_FORTIFY_SOURCE=2 -I/usr/include conftest.cpp >&5
  2195. configure:10255: $? = 0
  2196. configure:10269: result: yes
  2197. configure:10280: checking for exit in -lboost_filesystem
  2198. configure:10305: g++ -o conftest -g3 -O0 -DDEBUG -Wall -Wextra -Wformat -Wformat-security -Wno-unused-parameter  -Wstack-protector -fstack-protector-all -fPIE  -DBOOST_SPIRIT_THREADSAFE -DHAVE_BUILD_INFO -D__STDC_FORMAT_MACROS  -U_FORTIFY_SOURCE -D_FORTIFY_SOURCE=2 -I/usr/include   -Wl,-z,relro -Wl,-z,now -pie -L/home/<username>/Downloads/boost_1_53_0/stage/lib conftest.cpp -lboost_filesystem   -lboost_system >&5
  2199. configure:10305: $? = 0
  2200. configure:10315: result: yes
  2201. configure:10465: checking whether the Boost::Program_Options library is available
  2202. configure:10489: g++ -c -g3 -O0 -DDEBUG -Wall -Wextra -Wformat -Wformat-security -Wno-unused-parameter  -Wstack-protector -fstack-protector-all -fPIE  -DBOOST_SPIRIT_THREADSAFE -DHAVE_BUILD_INFO -D__STDC_FORMAT_MACROS  -U_FORTIFY_SOURCE -D_FORTIFY_SOURCE=2 -I/usr/include conftest.cpp >&5
  2203. configure:10489: $? = 0
  2204. configure:10503: result: yes
  2205. configure:10514: checking for exit in -lboost_program_options
  2206. configure:10539: g++ -o conftest -g3 -O0 -DDEBUG -Wall -Wextra -Wformat -Wformat-security -Wno-unused-parameter  -Wstack-protector -fstack-protector-all -fPIE  -DBOOST_SPIRIT_THREADSAFE -DHAVE_BUILD_INFO -D__STDC_FORMAT_MACROS  -U_FORTIFY_SOURCE -D_FORTIFY_SOURCE=2 -I/usr/include   -Wl,-z,relro -Wl,-z,now -pie -L/home/<username>/Downloads/boost_1_53_0/stage/lib conftest.cpp -lboost_program_options   >&5
  2207. configure:10539: $? = 0
  2208. configure:10549: result: yes
  2209. configure:10692: checking whether the Boost::Thread library is available
  2210. configure:10724: g++ -c -pthread -g3 -O0 -DDEBUG -Wall -Wextra -Wformat -Wformat-security -Wno-unused-parameter  -Wstack-protector -fstack-protector-all -fPIE  -DBOOST_SPIRIT_THREADSAFE -DHAVE_BUILD_INFO -D__STDC_FORMAT_MACROS  -U_FORTIFY_SOURCE -D_FORTIFY_SOURCE=2 -I/usr/include conftest.cpp >&5
  2211. configure:10724: $? = 0
  2212. configure:10739: result: yes
  2213. configure:10768: checking for exit in -lboost_thread
  2214. configure:10793: g++ -o conftest -g3 -O0 -DDEBUG -Wall -Wextra -Wformat -Wformat-security -Wno-unused-parameter  -Wstack-protector -fstack-protector-all -fPIE  -DBOOST_SPIRIT_THREADSAFE -DHAVE_BUILD_INFO -D__STDC_FORMAT_MACROS  -U_FORTIFY_SOURCE -D_FORTIFY_SOURCE=2 -I/usr/include   -Wl,-z,relro -Wl,-z,now -pie -L/home/<username>/Downloads/boost_1_53_0/stage/lib conftest.cpp -lboost_thread   >&5
  2215. configure:10793: $? = 0
  2216. configure:10803: result: yes
  2217. configure:10963: checking whether the Boost::Chrono library is available
  2218. configure:10987: g++ -c -g3 -O0 -DDEBUG -Wall -Wextra -Wformat -Wformat-security -Wno-unused-parameter  -Wstack-protector -fstack-protector-all -fPIE  -DBOOST_SPIRIT_THREADSAFE -DHAVE_BUILD_INFO -D__STDC_FORMAT_MACROS  -U_FORTIFY_SOURCE -D_FORTIFY_SOURCE=2 -pthread -I/usr/include conftest.cpp >&5
  2219. configure:10987: $? = 0
  2220. configure:11002: result: yes
  2221. configure:11017: checking for exit in -lboost_chrono
  2222. configure:11042: g++ -o conftest -g3 -O0 -DDEBUG -Wall -Wextra -Wformat -Wformat-security -Wno-unused-parameter  -Wstack-protector -fstack-protector-all -fPIE  -DBOOST_SPIRIT_THREADSAFE -DHAVE_BUILD_INFO -D__STDC_FORMAT_MACROS  -U_FORTIFY_SOURCE -D_FORTIFY_SOURCE=2 -pthread -I/usr/include   -Wl,-z,relro -Wl,-z,now -pie -L/home/<username>/Downloads/boost_1_53_0/stage/lib conftest.cpp -lboost_chrono   >&5
  2223. configure:11042: $? = 0
  2224. configure:11052: result: yes
  2225. configure:11211: checking whether the Boost::Unit_Test_Framework library is available
  2226. configure:11234: g++ -c -g3 -O0 -DDEBUG -Wall -Wextra -Wformat -Wformat-security -Wno-unused-parameter  -Wstack-protector -fstack-protector-all -fPIE  -DBOOST_SPIRIT_THREADSAFE -DHAVE_BUILD_INFO -D__STDC_FORMAT_MACROS  -U_FORTIFY_SOURCE -D_FORTIFY_SOURCE=2 -pthread -I/usr/include conftest.cpp >&5
  2227. conftest.cpp: In function 'int main()':
  2228. conftest.cpp:38:21: warning: unused variable 'test' [-Wunused-variable]
  2229. configure:11234: $? = 0
  2230. configure:11248: result: yes
  2231. configure:11359: checking for dynamic linked boost test
  2232. configure:11374: g++ -o conftest -g3 -O0 -DDEBUG -Wall -Wextra -Wformat -Wformat-security -Wno-unused-parameter  -Wstack-protector -fstack-protector-all -fPIE  -DBOOST_SPIRIT_THREADSAFE -DHAVE_BUILD_INFO -D__STDC_FORMAT_MACROS  -U_FORTIFY_SOURCE -D_FORTIFY_SOURCE=2 -pthread -I/usr/include   -Wl,-z,relro -Wl,-z,now -pie conftest.cpp  -lboost_unit_test_framework >&5
  2233. /usr/bin/ld: cannot find -lboost_unit_test_framework
  2234. collect2: error: ld returned 1 exit status
  2235. configure:11374: $? = 1
  2236. configure: failed program was:
  2237. | /* confdefs.h */
  2238. | #define PACKAGE_NAME "Bitcoin Core"
  2239. | #define PACKAGE_TARNAME "bitcoin"
  2240. | #define PACKAGE_VERSION "0.9.0"
  2241. | #define PACKAGE_STRING "Bitcoin Core 0.9.0"
  2242. | #define PACKAGE_BUGREPORT "[email protected]"
  2243. | #define PACKAGE_URL ""
  2244. | #define STDC_HEADERS 1
  2245. | #define HAVE_SYS_TYPES_H 1
  2246. | #define HAVE_SYS_STAT_H 1
  2247. | #define HAVE_STDLIB_H 1
  2248. | #define HAVE_STRING_H 1
  2249. | #define HAVE_MEMORY_H 1
  2250. | #define HAVE_STRINGS_H 1
  2251. | #define HAVE_INTTYPES_H 1
  2252. | #define HAVE_STDINT_H 1
  2253. | #define HAVE_UNISTD_H 1
  2254. | #define HAVE_PTHREAD 1
  2255. | #define HAVE_STDIO_H 1
  2256. | #define HAVE_STDLIB_H 1
  2257. | #define HAVE_UNISTD_H 1
  2258. | #define HAVE_STRINGS_H 1
  2259. | #define HAVE_SYS_TYPES_H 1
  2260. | #define HAVE_SYS_STAT_H 1
  2261. | #define HAVE_MSG_NOSIGNAL 1
  2262. | #define HAVE_BOOST /**/
  2263. | #define HAVE_BOOST_SYSTEM /**/
  2264. | #define HAVE_BOOST_FILESYSTEM /**/
  2265. | #define HAVE_BOOST_PROGRAM_OPTIONS /**/
  2266. | #define HAVE_BOOST_THREAD /**/
  2267. | #define HAVE_BOOST_CHRONO /**/
  2268. | #define HAVE_BOOST_UNIT_TEST_FRAMEWORK /**/
  2269. | /* end confdefs.h.  */
  2270. |
  2271. |        #define BOOST_TEST_DYN_LINK
  2272. |        #define BOOST_TEST_MAIN
  2273. |         #include <boost/test/unit_test.hpp>
  2274. |
  2275. |
  2276. configure:11379: result: no
  2277. configure:11418: g++ -o conftest -g3 -O0 -DDEBUG -Wall -Wextra -Wformat -Wformat-security -Wno-unused-parameter  -Wstack-protector -fstack-protector-all -fPIE  -DBOOST_SPIRIT_THREADSAFE -DHAVE_BUILD_INFO -D__STDC_FORMAT_MACROS  -U_FORTIFY_SOURCE -D_FORTIFY_SOURCE=2 -pthread -I/usr/include   -Wl,-z,relro -Wl,-z,now -pie conftest.cpp  -L/home/<username>/Downloads/boost_1_53_0/stage/lib -lboost_system -lboost_filesystem -lboost_program_options -lboost_thread -lboost_chrono  >&5
  2278. conftest.cpp: In function 'int main()':
  2279. conftest.cpp:45:4: error: 'choke' was not declared in this scope
  2280. conftest.cpp:45:10: error: expected ';' before 'me'
  2281. configure:11418: $? = 1
  2282. configure: failed program was:
  2283. | /* confdefs.h */
  2284. | #define PACKAGE_NAME "Bitcoin Core"
  2285. | #define PACKAGE_TARNAME "bitcoin"
  2286. | #define PACKAGE_VERSION "0.9.0"
  2287. | #define PACKAGE_STRING "Bitcoin Core 0.9.0"
  2288. | #define PACKAGE_BUGREPORT "[email protected]"
  2289. | #define PACKAGE_URL ""
  2290. | #define STDC_HEADERS 1
  2291. | #define HAVE_SYS_TYPES_H 1
  2292. | #define HAVE_SYS_STAT_H 1
  2293. | #define HAVE_STDLIB_H 1
  2294. | #define HAVE_STRING_H 1
  2295. | #define HAVE_MEMORY_H 1
  2296. | #define HAVE_STRINGS_H 1
  2297. | #define HAVE_INTTYPES_H 1
  2298. | #define HAVE_STDINT_H 1
  2299. | #define HAVE_UNISTD_H 1
  2300. | #define HAVE_PTHREAD 1
  2301. | #define HAVE_STDIO_H 1
  2302. | #define HAVE_STDLIB_H 1
  2303. | #define HAVE_UNISTD_H 1
  2304. | #define HAVE_STRINGS_H 1
  2305. | #define HAVE_SYS_TYPES_H 1
  2306. | #define HAVE_SYS_STAT_H 1
  2307. | #define HAVE_MSG_NOSIGNAL 1
  2308. | #define HAVE_BOOST /**/
  2309. | #define HAVE_BOOST_SYSTEM /**/
  2310. | #define HAVE_BOOST_FILESYSTEM /**/
  2311. | #define HAVE_BOOST_PROGRAM_OPTIONS /**/
  2312. | #define HAVE_BOOST_THREAD /**/
  2313. | #define HAVE_BOOST_CHRONO /**/
  2314. | #define HAVE_BOOST_UNIT_TEST_FRAMEWORK /**/
  2315. | /* end confdefs.h.  */
  2316. |
  2317. |   #include <boost/thread/thread.hpp>
  2318. |   #include <boost/version.hpp>
  2319. |
  2320. | int
  2321. | main ()
  2322. | {
  2323. |
  2324. |   #if BOOST_VERSION >= 105000 && (!defined(BOOST_HAS_NANOSLEEP) || BOOST_VERSION >= 105200)
  2325. |       boost::this_thread::sleep_for(boost::chrono::milliseconds(0));
  2326. |   #else
  2327. |    choke me
  2328. |   #endif
  2329. |
  2330. |   ;
  2331. |   return 0;
  2332. | }
  2333. configure:11458: g++ -o conftest -g3 -O0 -DDEBUG -Wall -Wextra -Wformat -Wformat-security -Wno-unused-parameter  -Wstack-protector -fstack-protector-all -fPIE  -DBOOST_SPIRIT_THREADSAFE -DHAVE_BUILD_INFO -D__STDC_FORMAT_MACROS  -U_FORTIFY_SOURCE -D_FORTIFY_SOURCE=2 -pthread -I/usr/include   -Wl,-z,relro -Wl,-z,now -pie conftest.cpp  -L/home/<username>/Downloads/boost_1_53_0/stage/lib -lboost_system -lboost_filesystem -lboost_program_options -lboost_thread >&5
  2334. /tmp/ccs6ZJRV.o: In function `void boost::this_thread::sleep<boost::date_time::subsecond_duration<boost::posix_time::time_duration, 1000l> >(boost::date_time::subsecond_duration<boost::posix_time::time_duration, 1000l> const&)':
  2335. /usr/include/boost/thread/pthread/thread_data.hpp:149: undefined reference to `boost::this_thread::sleep(boost::posix_time::ptime const&)'
  2336. collect2: error: ld returned 1 exit status
  2337. configure:11458: $? = 1
  2338. configure: failed program was:
  2339. | /* confdefs.h */
  2340. | #define PACKAGE_NAME "Bitcoin Core"
  2341. | #define PACKAGE_TARNAME "bitcoin"
  2342. | #define PACKAGE_VERSION "0.9.0"
  2343. | #define PACKAGE_STRING "Bitcoin Core 0.9.0"
  2344. | #define PACKAGE_BUGREPORT "[email protected]"
  2345. | #define PACKAGE_URL ""
  2346. | #define STDC_HEADERS 1
  2347. | #define HAVE_SYS_TYPES_H 1
  2348. | #define HAVE_SYS_STAT_H 1
  2349. | #define HAVE_STDLIB_H 1
  2350. | #define HAVE_STRING_H 1
  2351. | #define HAVE_MEMORY_H 1
  2352. | #define HAVE_STRINGS_H 1
  2353. | #define HAVE_INTTYPES_H 1
  2354. | #define HAVE_STDINT_H 1
  2355. | #define HAVE_UNISTD_H 1
  2356. | #define HAVE_PTHREAD 1
  2357. | #define HAVE_STDIO_H 1
  2358. | #define HAVE_STDLIB_H 1
  2359. | #define HAVE_UNISTD_H 1
  2360. | #define HAVE_STRINGS_H 1
  2361. | #define HAVE_SYS_TYPES_H 1
  2362. | #define HAVE_SYS_STAT_H 1
  2363. | #define HAVE_MSG_NOSIGNAL 1
  2364. | #define HAVE_BOOST /**/
  2365. | #define HAVE_BOOST_SYSTEM /**/
  2366. | #define HAVE_BOOST_FILESYSTEM /**/
  2367. | #define HAVE_BOOST_PROGRAM_OPTIONS /**/
  2368. | #define HAVE_BOOST_THREAD /**/
  2369. | #define HAVE_BOOST_CHRONO /**/
  2370. | #define HAVE_BOOST_UNIT_TEST_FRAMEWORK /**/
  2371. | /* end confdefs.h.  */
  2372. |
  2373. |   #include <boost/version.hpp>
  2374. |   #include <boost/thread.hpp>
  2375. |   #include <boost/date_time/posix_time/posix_time_types.hpp>
  2376. |
  2377. | int
  2378. | main ()
  2379. | {
  2380. |
  2381. |   #if BOOST_VERSION <= 105600
  2382. |       boost::this_thread::sleep(boost::posix_time::milliseconds(0));
  2383. |   #else
  2384. |    choke me
  2385. |   #endif
  2386. |
  2387. |   ;
  2388. |   return 0;
  2389. | }
  2390. configure:11472: error: No working boost sleep implementation found. If on ubuntu 13.10 with libboost1.54-all-dev remove libboost.1.54-all-dev and use libboost1.53-all-dev
  2391.  
  2392. ## ---------------- ##
  2393. ## Cache variables. ##
  2394. ## ---------------- ##
  2395.  
  2396. ac_cv_build=x86_64-unknown-linux-gnu
  2397. ac_cv_c_bigendian=no
  2398. ac_cv_c_compiler_gnu=yes
  2399. ac_cv_cxx_compiler_gnu=yes
  2400. ac_cv_env_CCC_set=
  2401. ac_cv_env_CCC_value=
  2402. ac_cv_env_CC_set=
  2403. ac_cv_env_CC_value=
  2404. ac_cv_env_CFLAGS_set=
  2405. ac_cv_env_CFLAGS_value=
  2406. ac_cv_env_CPPFLAGS_set=
  2407. ac_cv_env_CPPFLAGS_value=
  2408. ac_cv_env_CPP_set=
  2409. ac_cv_env_CPP_value=
  2410. ac_cv_env_CRYPTO_CFLAGS_set=
  2411. ac_cv_env_CRYPTO_CFLAGS_value=
  2412. ac_cv_env_CRYPTO_LIBS_set=
  2413. ac_cv_env_CRYPTO_LIBS_value=
  2414. ac_cv_env_CXXCPP_set=
  2415. ac_cv_env_CXXCPP_value=
  2416. ac_cv_env_CXXFLAGS_set=
  2417. ac_cv_env_CXXFLAGS_value=
  2418. ac_cv_env_CXX_set=
  2419. ac_cv_env_CXX_value=
  2420. ac_cv_env_LDFLAGS_set=
  2421. ac_cv_env_LDFLAGS_value=
  2422. ac_cv_env_LIBS_set=
  2423. ac_cv_env_LIBS_value=
  2424. ac_cv_env_OBJCFLAGS_set=
  2425. ac_cv_env_OBJCFLAGS_value=
  2426. ac_cv_env_OBJCXXFLAGS_set=
  2427. ac_cv_env_OBJCXXFLAGS_value=
  2428. ac_cv_env_OBJCXX_set=
  2429. ac_cv_env_OBJCXX_value=
  2430. ac_cv_env_OBJC_set=
  2431. ac_cv_env_OBJC_value=
  2432. ac_cv_env_PKG_CONFIG_LIBDIR_set=
  2433. ac_cv_env_PKG_CONFIG_LIBDIR_value=
  2434. ac_cv_env_PKG_CONFIG_PATH_set=
  2435. ac_cv_env_PKG_CONFIG_PATH_value=
  2436. ac_cv_env_PKG_CONFIG_set=
  2437. ac_cv_env_PKG_CONFIG_value=
  2438. ac_cv_env_PROTOBUF_CFLAGS_set=
  2439. ac_cv_env_PROTOBUF_CFLAGS_value=
  2440. ac_cv_env_PROTOBUF_LIBS_set=
  2441. ac_cv_env_PROTOBUF_LIBS_value=
  2442. ac_cv_env_QR_CFLAGS_set=
  2443. ac_cv_env_QR_CFLAGS_value=
  2444. ac_cv_env_QR_LIBS_set=
  2445. ac_cv_env_QR_LIBS_value=
  2446. ac_cv_env_QT_CFLAGS_set=
  2447. ac_cv_env_QT_CFLAGS_value=
  2448. ac_cv_env_QT_DBUS_CFLAGS_set=
  2449. ac_cv_env_QT_DBUS_CFLAGS_value=
  2450. ac_cv_env_QT_DBUS_LIBS_set=
  2451. ac_cv_env_QT_DBUS_LIBS_value=
  2452. ac_cv_env_QT_LIBS_set=
  2453. ac_cv_env_QT_LIBS_value=
  2454. ac_cv_env_QT_TEST_CFLAGS_set=
  2455. ac_cv_env_QT_TEST_CFLAGS_value=
  2456. ac_cv_env_QT_TEST_LIBS_set=
  2457. ac_cv_env_QT_TEST_LIBS_value=
  2458. ac_cv_env_SSL_CFLAGS_set=
  2459. ac_cv_env_SSL_CFLAGS_value=
  2460. ac_cv_env_SSL_LIBS_set=
  2461. ac_cv_env_SSL_LIBS_value=
  2462. ac_cv_env_build_alias_set=
  2463. ac_cv_env_build_alias_value=
  2464. ac_cv_env_host_alias_set=
  2465. ac_cv_env_host_alias_value=
  2466. ac_cv_env_target_alias_set=
  2467. ac_cv_env_target_alias_value=
  2468. ac_cv_header_inttypes_h=yes
  2469. ac_cv_header_memory_h=yes
  2470. ac_cv_header_miniupnpc_miniupnpc_h=no
  2471. ac_cv_header_miniupnpc_miniwget_h=no
  2472. ac_cv_header_miniupnpc_upnpcommands_h=no
  2473. ac_cv_header_miniupnpc_upnperrors_h=no
  2474. ac_cv_header_stdc=yes
  2475. ac_cv_header_stdint_h=yes
  2476. ac_cv_header_stdio_h=yes
  2477. ac_cv_header_stdlib_h=yes
  2478. ac_cv_header_string_h=yes
  2479. ac_cv_header_strings_h=yes
  2480. ac_cv_header_sys_stat_h=yes
  2481. ac_cv_header_sys_types_h=yes
  2482. ac_cv_header_unistd_h=yes
  2483. ac_cv_host=x86_64-unknown-linux-gnu
  2484. ac_cv_lib_boost_chrono___exit=yes
  2485. ac_cv_lib_boost_filesystem___exit=yes
  2486. ac_cv_lib_boost_program_options___exit=yes
  2487. ac_cv_lib_boost_system___exit=yes
  2488. ac_cv_lib_boost_thread___exit=yes
  2489. ac_cv_lib_db_cxx_4_8___main=yes
  2490. ac_cv_objc_compiler_gnu=no
  2491. ac_cv_objcxx_compiler_gnu=no
  2492. ac_cv_objext=o
  2493. ac_cv_path_EGREP='/bin/grep -E'
  2494. ac_cv_path_GIT=/usr/bin/git
  2495. ac_cv_path_GREP=/bin/grep
  2496. ac_cv_path_HEXDUMP=/usr/bin/hexdump
  2497. ac_cv_path_JAVA=/usr/bin/java
  2498. ac_cv_path_SED=/bin/sed
  2499. ac_cv_path_XGETTEXT=/usr/bin/xgettext
  2500. ac_cv_path_ac_pt_AR=/usr/bin/ar
  2501. ac_cv_path_ac_pt_GCOV=/usr/bin/gcov
  2502. ac_cv_path_ac_pt_PKG_CONFIG=/usr/bin/pkg-config
  2503. ac_cv_path_ac_pt_RANLIB=/usr/bin/ranlib
  2504. ac_cv_path_ac_pt_STRIP=/usr/bin/strip
  2505. ac_cv_path_install='/usr/bin/install -c'
  2506. ac_cv_path_mkdir=/bin/mkdir
  2507. ac_cv_prog_AWK=gawk
  2508. ac_cv_prog_CPP='gcc -E'
  2509. ac_cv_prog_CXXCPP='g++ -E'
  2510. ac_cv_prog_ac_ct_CC=gcc
  2511. ac_cv_prog_ac_ct_CXX=g++
  2512. ac_cv_prog_ac_ct_OBJC=gcc
  2513. ac_cv_prog_ac_ct_OBJCXX=g++
  2514. ac_cv_prog_cc_c89=
  2515. ac_cv_prog_cc_g=yes
  2516. ac_cv_prog_cxx_g=yes
  2517. ac_cv_prog_make_make_set=yes
  2518. ac_cv_prog_objc_g=no
  2519. ac_cv_prog_objcxx_g=no
  2520. ac_cv_sys_file_offset_bits=no
  2521. ac_cv_sys_largefile_CC=no
  2522. am_cv_CC_dependencies_compiler_type=gcc3
  2523. am_cv_CXX_dependencies_compiler_type=gcc3
  2524. am_cv_OBJC_dependencies_compiler_type=gcc3
  2525. am_cv_make_support_nested_variables=yes
  2526. ax_cv_PTHREAD_PRIO_INHERIT=no
  2527. ax_cv_boost_chrono=yes
  2528. ax_cv_boost_filesystem=yes
  2529. ax_cv_boost_program_options=yes
  2530. ax_cv_boost_system=yes
  2531. ax_cv_boost_thread=yes
  2532. ax_cv_boost_unit_test_framework=yes
  2533. ax_cv_check_cxxcppflags___D_FORTIFY_SOURCE_2=yes
  2534. ax_cv_check_cxxcppflags___U_FORTIFY_SOURCE=yes
  2535. ax_cv_check_cxxflags___Wstack_protector=yes
  2536. ax_cv_check_cxxflags___fPIE=yes
  2537. ax_cv_check_cxxflags___fstack_protector_all=yes
  2538. ax_cv_check_ldflags___Wl___dynamicbase=no
  2539. ax_cv_check_ldflags___Wl___large_address_aware=no
  2540. ax_cv_check_ldflags___Wl___nxcompat=no
  2541. ax_cv_check_ldflags___Wl__z_now=yes
  2542. ax_cv_check_ldflags___Wl__z_relro=yes
  2543. ax_cv_check_ldflags___pie=yes
  2544.  
  2545. ## ----------------- ##
  2546. ## Output variables. ##
  2547. ## ----------------- ##
  2548.  
  2549. ACLOCAL='${SHELL} /home/<username>/codebase/bitcoin/src/build-aux/missing --run aclocal-1.11'
  2550. AMDEPBACKSLASH='\'
  2551. AMDEP_FALSE='#'
  2552. AMDEP_TRUE=''
  2553. AMTAR='$${TAR-tar}'
  2554. AM_BACKSLASH='\'
  2555. AM_DEFAULT_V='$(AM_DEFAULT_VERBOSITY)'
  2556. AM_DEFAULT_VERBOSITY='0'
  2557. AM_V='$(V)'
  2558. AR='/usr/bin/ar'
  2559. AUTOCONF='${SHELL} /home/<username>/codebase/bitcoin/src/build-aux/missing --run autoconf'
  2560. AUTOHEADER='${SHELL} /home/<username>/codebase/bitcoin/src/build-aux/missing --run autoheader'
  2561. AUTOMAKE='${SHELL} /home/<username>/codebase/bitcoin/src/build-aux/missing --run automake-1.11'
  2562. AWK='gawk'
  2563. BDB_CPPFLAGS=''
  2564. BDB_LIBS='-ldb_cxx-4.8'
  2565. BOOST_CHRONO_LIB='-lboost_chrono '
  2566. BOOST_CPPFLAGS='-pthread -I/usr/include'
  2567. BOOST_FILESYSTEM_LIB='-lboost_filesystem'
  2568. BOOST_LDFLAGS='-L/home/<username>/Downloads/boost_1_53_0/stage/lib'
  2569. BOOST_LIBS='-L/home/<username>/Downloads/boost_1_53_0/stage/lib -lboost_system -lboost_filesystem -lboost_program_options -lboost_thread'
  2570. BOOST_PROGRAM_OPTIONS_LIB='-lboost_program_options'
  2571. BOOST_SYSTEM_LIB='-lboost_system'
  2572. BOOST_THREAD_LIB='-lboost_thread'
  2573. BOOST_UNIT_TEST_FRAMEWORK_LIB='-lboost_unit_test_framework'
  2574. BREW=''
  2575. BUILD_BITCOIND_FALSE=''
  2576. BUILD_BITCOIND_TRUE=''
  2577. BUILD_BITCOIN_CLI_FALSE=''
  2578. BUILD_BITCOIN_CLI_TRUE=''
  2579. BUILD_QT=''
  2580. BUILD_TEST=''
  2581. BUILD_TEST_QT=''
  2582. CC='gcc'
  2583. CCACHE=''
  2584. CCDEPMODE='depmode=gcc3'
  2585. CFLAGS='-g3 -O0 -DDEBUG'
  2586. CLIENT_VERSION_BUILD=''
  2587. CLIENT_VERSION_IS_RELEASE=''
  2588. CLIENT_VERSION_MAJOR=''
  2589. CLIENT_VERSION_MINOR=''
  2590. CLIENT_VERSION_REVISION=''
  2591. COMPARISON_TOOL_REORG_TESTS='0'
  2592. COPYRIGHT_YEAR=''
  2593. CPP='gcc -E'
  2594. CPPFLAGS=' -DBOOST_SPIRIT_THREADSAFE -DHAVE_BUILD_INFO -D__STDC_FORMAT_MACROS  -U_FORTIFY_SOURCE -D_FORTIFY_SOURCE=2'
  2595. CRYPTO_CFLAGS=''
  2596. CRYPTO_LIBS=''
  2597. CXX='g++'
  2598. CXXCPP='g++ -E'
  2599. CXXDEPMODE='depmode=gcc3'
  2600. CXXFLAGS='-g3 -O0 -DDEBUG -Wall -Wextra -Wformat -Wformat-security -Wno-unused-parameter  -Wstack-protector -fstack-protector-all -fPIE'
  2601. CYGPATH_W='echo'
  2602. DEFS=''
  2603. DEPDIR='.deps'
  2604. ECHO_C=''
  2605. ECHO_N='-n'
  2606. ECHO_T=''
  2607. EGREP='/bin/grep -E'
  2608. EMBEDDED_LEVELDB_FALSE='#'
  2609. EMBEDDED_LEVELDB_TRUE=''
  2610. ENABLE_WALLET_FALSE=''
  2611. ENABLE_WALLET_TRUE=''
  2612. EXEEXT=''
  2613. GCOV='/usr/bin/gcov'
  2614. GENHTML=''
  2615. GIT='/usr/bin/git'
  2616. GREP='/bin/grep'
  2617. HEXDUMP='/usr/bin/hexdump'
  2618. INCLUDES=' -pthread'
  2619. INSTALL_DATA='${INSTALL} -m 644'
  2620. INSTALL_PROGRAM='${INSTALL}'
  2621. INSTALL_SCRIPT='${INSTALL}'
  2622. INSTALL_STRIP_PROGRAM='$(install_sh) -c -s'
  2623. JAVA='/usr/bin/java'
  2624. JAVA_COMPARISON_TOOL=''
  2625. LCOV=''
  2626. LDFLAGS='  -Wl,-z,relro -Wl,-z,now -pie'
  2627. LEVELDB_CPPFLAGS=''
  2628. LEVELDB_TARGET_FLAGS=''
  2629. LIBLEVELDB=''
  2630. LIBMEMENV=''
  2631. LIBOBJS=''
  2632. LIBS=''
  2633. LRELEASE=''
  2634. LTLIBOBJS=''
  2635. LUPDATE=''
  2636. MAINT=''
  2637. MAINTAINER_MODE_FALSE='#'
  2638. MAINTAINER_MODE_TRUE=''
  2639. MAKEINFO='${SHELL} /home/<username>/codebase/bitcoin/src/build-aux/missing --run makeinfo'
  2640. MAKENSIS=''
  2641. MKDIR_P='/bin/mkdir -p'
  2642. MOC=''
  2643. MOC_DEFS=''
  2644. OBJC='gcc'
  2645. OBJCDEPMODE='depmode=gcc3'
  2646. OBJCFLAGS=''
  2647. OBJCXX='g++'
  2648. OBJCXXFLAGS='-g3 -O0 -DDEBUG -Wall -Wextra -Wformat -Wformat-security -Wno-unused-parameter  -Wstack-protector -fstack-protector-all -fPIE'
  2649. OBJEXT='o'
  2650. PACKAGE='bitcoin'
  2651. PACKAGE_BUGREPORT='[email protected]'
  2652. PACKAGE_NAME='Bitcoin Core'
  2653. PACKAGE_STRING='Bitcoin Core 0.9.0'
  2654. PACKAGE_TARNAME='bitcoin'
  2655. PACKAGE_URL=''
  2656. PACKAGE_VERSION='0.9.0'
  2657. PATH_SEPARATOR=':'
  2658. PKG_CONFIG='/usr/bin/pkg-config'
  2659. PKG_CONFIG_LIBDIR=''
  2660. PKG_CONFIG_PATH=''
  2661. PORT=''
  2662. PROTOBUF_CFLAGS=''
  2663. PROTOBUF_LIBS=''
  2664. PROTOC=''
  2665. PTHREAD_CC='gcc'
  2666. PTHREAD_CFLAGS='-pthread'
  2667. PTHREAD_LIBS=''
  2668. QR_CFLAGS=''
  2669. QR_LIBS=''
  2670. QT_CFLAGS=''
  2671. QT_DBUS_CFLAGS=''
  2672. QT_DBUS_INCLUDES=''
  2673. QT_DBUS_LIBS=''
  2674. QT_INCLUDES=''
  2675. QT_LDFLAGS=''
  2676. QT_LIBS=''
  2677. QT_SELECT=''
  2678. QT_TEST_CFLAGS=''
  2679. QT_TEST_INCLUDES=''
  2680. QT_TEST_LIBS=''
  2681. RANLIB='/usr/bin/ranlib'
  2682. RCC=''
  2683. SED='/bin/sed'
  2684. SET_MAKE=''
  2685. SHELL='/bin/bash'
  2686. SSL_CFLAGS=''
  2687. SSL_LIBS=''
  2688. STRIP='/usr/bin/strip'
  2689. TARGET_DARWIN_FALSE=''
  2690. TARGET_DARWIN_TRUE=''
  2691. TARGET_WINDOWS_FALSE=''
  2692. TARGET_WINDOWS_TRUE=''
  2693. TESTDEFS=''
  2694. UIC=''
  2695. USE_COMPARISON_TOOL_FALSE=''
  2696. USE_COMPARISON_TOOL_REORG_TESTS_FALSE=''
  2697. USE_COMPARISON_TOOL_REORG_TESTS_TRUE=''
  2698. USE_COMPARISON_TOOL_TRUE=''
  2699. USE_IPV6=''
  2700. USE_LCOV_FALSE=''
  2701. USE_LCOV_TRUE=''
  2702. USE_QRCODE=''
  2703. USE_QRCODE_FALSE=''
  2704. USE_QRCODE_TRUE=''
  2705. USE_UPNP=''
  2706. VERSION='0.9.0'
  2707. WINDOWS_BITS=''
  2708. WINDRES=''
  2709. XGETTEXT='/usr/bin/xgettext'
  2710. ac_ct_CC='gcc'
  2711. ac_ct_CXX='g++'
  2712. ac_ct_OBJC='gcc'
  2713. ac_ct_OBJCXX='g++'
  2714. am__EXEEXT_FALSE=''
  2715. am__EXEEXT_TRUE=''
  2716. am__fastdepCC_FALSE='#'
  2717. am__fastdepCC_TRUE=''
  2718. am__fastdepCXX_FALSE='#'
  2719. am__fastdepCXX_TRUE=''
  2720. am__fastdepOBJC_FALSE='#'
  2721. am__fastdepOBJC_TRUE=''
  2722. am__include='include'
  2723. am__isrc=''
  2724. am__leading_dot='.'
  2725. am__nodep='_no'
  2726. am__quote=''
  2727. am__tar='$${TAR-tar} chof - "$$tardir"'
  2728. am__untar='$${TAR-tar} xf -'
  2729. ax_pthread_config=''
  2730. bindir='${exec_prefix}/bin'
  2731. build='x86_64-unknown-linux-gnu'
  2732. build_alias=''
  2733. build_cpu='x86_64'
  2734. build_os='linux-gnu'
  2735. build_vendor='unknown'
  2736. datadir='${datarootdir}'
  2737. datarootdir='${prefix}/share'
  2738. docdir='${datarootdir}/doc/${PACKAGE_TARNAME}'
  2739. dvidir='${docdir}'
  2740. exec_prefix='NONE'
  2741. host='x86_64-unknown-linux-gnu'
  2742. host_alias=''
  2743. host_cpu='x86_64'
  2744. host_os='linux-gnu'
  2745. host_vendor='unknown'
  2746. htmldir='${docdir}'
  2747. includedir='${prefix}/include'
  2748. infodir='${datarootdir}/info'
  2749. install_sh='${SHELL} /home/<username>/codebase/bitcoin/src/build-aux/install-sh'
  2750. libdir='${exec_prefix}/lib'
  2751. libexecdir='${exec_prefix}/libexec'
  2752. localedir='${datarootdir}/locale'
  2753. localstatedir='${prefix}/var'
  2754. mandir='${datarootdir}/man'
  2755. mkdir_p='/bin/mkdir -p'
  2756. oldincludedir='/usr/include'
  2757. pdfdir='${docdir}'
  2758. prefix='NONE'
  2759. program_transform_name='s,x,x,'
  2760. psdir='${docdir}'
  2761. sbindir='${exec_prefix}/sbin'
  2762. sharedstatedir='${prefix}/com'
  2763. sysconfdir='${prefix}/etc'
  2764. target_alias=''
  2765.  
  2766. ## ----------- ##
  2767. ## confdefs.h. ##
  2768. ## ----------- ##
  2769.  
  2770. /* confdefs.h */
  2771. #define PACKAGE_NAME "Bitcoin Core"
  2772. #define PACKAGE_TARNAME "bitcoin"
  2773. #define PACKAGE_VERSION "0.9.0"
  2774. #define PACKAGE_STRING "Bitcoin Core 0.9.0"
  2775. #define PACKAGE_BUGREPORT "[email protected]"
  2776. #define PACKAGE_URL ""
  2777. #define STDC_HEADERS 1
  2778. #define HAVE_SYS_TYPES_H 1
  2779. #define HAVE_SYS_STAT_H 1
  2780. #define HAVE_STDLIB_H 1
  2781. #define HAVE_STRING_H 1
  2782. #define HAVE_MEMORY_H 1
  2783. #define HAVE_STRINGS_H 1
  2784. #define HAVE_INTTYPES_H 1
  2785. #define HAVE_STDINT_H 1
  2786. #define HAVE_UNISTD_H 1
  2787. #define HAVE_PTHREAD 1
  2788. #define HAVE_STDIO_H 1
  2789. #define HAVE_STDLIB_H 1
  2790. #define HAVE_UNISTD_H 1
  2791. #define HAVE_STRINGS_H 1
  2792. #define HAVE_SYS_TYPES_H 1
  2793. #define HAVE_SYS_STAT_H 1
  2794. #define HAVE_MSG_NOSIGNAL 1
  2795. #define HAVE_BOOST /**/
  2796. #define HAVE_BOOST_SYSTEM /**/
  2797. #define HAVE_BOOST_FILESYSTEM /**/
  2798. #define HAVE_BOOST_PROGRAM_OPTIONS /**/
  2799. #define HAVE_BOOST_THREAD /**/
  2800. #define HAVE_BOOST_CHRONO /**/
  2801. #define HAVE_BOOST_UNIT_TEST_FRAMEWORK /**/
  2802.  
  2803. configure: exit 1
Advertisement
Add Comment
Please, Sign In to add comment