This week only. Pastebin PRO Accounts Christmas Special! Don't miss out!Want more features on Pastebin? Sign Up, it's FREE!
Guest

Untitled

By: a guest on Nov 24th, 2010  |  syntax: None  |  size: 2.82 KB  |  views: 61  |  expires: Never
download  |  raw  |  embed  |  report abuse  |  print
Text below is selected. Please press Ctrl+C to copy to your clipboard. (⌘+C on Mac)
  1. make[4]: Entering directory `/home/hb/src/aur/pd-extended-svn/src/pd-extended-build/Gem/src/plugins/filmGMERLIN'
  2. /bin/sh ./libtool  --tag=CXX   --mode=compile g++ -DHAVE_CONFIG_H -I.  -I../..  -DPD -I/home/hb/src/aur/pd-extended-svn/src/pd-extended-build/pd/src   -march=x86-64 -mtune=generic -O2 -pipe -MT gem_filmGMERLIN_la-filmGMERLIN.lo -MD -MP -MF .deps/gem_filmGMERLIN_la-filmGMERLIN.Tpo -c -o gem_filmGMERLIN_la-filmGMERLIN.lo `test -f 'filmGMERLIN.cpp' || echo './'`filmGMERLIN.cpp
  3. libtool: compile:  g++ -DHAVE_CONFIG_H -I. -I../.. -DPD -I/home/hb/src/aur/pd-extended-svn/src/pd-extended-build/pd/src -march=x86-64 -mtune=generic -O2 -pipe -MT gem_filmGMERLIN_la-filmGMERLIN.lo -MD -MP -MF .deps/gem_filmGMERLIN_la-filmGMERLIN.Tpo -c filmGMERLIN.cpp  -fPIC -DPIC -o .libs/gem_filmGMERLIN_la-filmGMERLIN.o
  4. In file included from filmGMERLIN.cpp:20:0:
  5. filmGMERLIN.h:89:3: error: 'gavl_frame_table_t' does not name a type
  6. filmGMERLIN.cpp: In constructor 'gem::filmGMERLIN::filmGMERLIN(int)':
  7. filmGMERLIN.cpp:48:42: error: class 'gem::filmGMERLIN' does not have any field named 'm_frametable'
  8. filmGMERLIN.cpp: In member function 'virtual void gem::filmGMERLIN::close()':
  9. filmGMERLIN.cpp:83:6: error: 'm_frametable' was not declared in this scope
  10. filmGMERLIN.cpp:83:56: error: 'gavl_frame_table_destroy' was not declared in this scope
  11. filmGMERLIN.cpp:83:59: error: 'm_frametable' was not declared in this scope
  12. filmGMERLIN.cpp: In member function 'virtual bool gem::filmGMERLIN::open(char*, int)':
  13. filmGMERLIN.cpp:248:3: error: 'm_frametable' was not declared in this scope
  14. filmGMERLIN.cpp:248:52: error: 'bgav_get_frame_table' was not declared in this scope
  15. filmGMERLIN.cpp:249:43: error: 'gavl_frame_table_num_frames' was not declared in this scope
  16. filmGMERLIN.cpp: In member function 'virtual int gem::filmGMERLIN::changeImage(int, int)':
  17. filmGMERLIN.cpp:321:8: error: 'm_frametable' was not declared in this scope
  18. filmGMERLIN.cpp:323:82: error: 'gavl_frame_table_frame_to_time' was not declared in this scope
  19. make[4]: *** [gem_filmGMERLIN_la-filmGMERLIN.lo] Fehler 1
  20. make[4]: Das Target »all-am« wurde wegen Fehlern nicht aktualisiert.
  21. make[4]: Leaving directory `/home/hb/src/aur/pd-extended-svn/src/pd-extended-build/Gem/src/plugins/filmGMERLIN'
  22. make[3]: *** [all] Fehler 2
  23. make[3]: Leaving directory `/home/hb/src/aur/pd-extended-svn/src/pd-extended-build/Gem/src/plugins/filmGMERLIN'
  24. make[2]: *** [filmGMERLIN] Fehler 2
  25. make[2]: Leaving directory `/home/hb/src/aur/pd-extended-svn/src/pd-extended-build/Gem/src/plugins'
  26. make[1]: *** [PLUGINS] Fehler 2
  27. make[1]: Leaving directory `/home/hb/src/aur/pd-extended-svn/src/pd-extended-build/Gem/src'
  28. make: *** [/home/hb/src/aur/pd-extended-svn/src/pd-extended-build/Gem/src/Gem.pd_linux] Fehler 2
  29. make: Leaving directory `/home/hb/src/aur/pd-extended-svn/src/pd-extended-build/packages'
  30.     Breche ab ...
clone this paste RAW Paste Data