Want more features on Pastebin? Sign Up, it's FREE!
Guest

Untitled

By: a guest on Jul 3rd, 2012  |  syntax: None  |  size: 6.85 KB  |  views: 25  |  expires: Never
download  |  raw  |  embed  |  report abuse  |  print
Text below is selected. Please press Ctrl+C to copy to your clipboard. (⌘+C on Mac)
  1. schwenk@schwenk-desktop:~/dev/hadoop/trunk/pig/java$ java -Dhadoop.log.dir=./build/test/logs -cp .:/home/schwenk/pig/pig-withouthadoop.jar:/home/schwenk/pig/test/pig-test.jar:/usr/lib/hadoop/lib/guava-11.0.2.jar:/usr/lib/hadoop/lib/jsp-api-2.1.jar:/usr/lib/hadoop/lib/commons-httpclient-3.1.jar:/usr/lib/hadoop-mapreduce/hadoop-mapreduce-client-core-2.0.0-cdh4.0.0.jar:/usr/lib/hadoop-mapreduce/hadoop-mapreduce-client-common-2.0.0-cdh4.0.0.jar:/usr/lib/hadoop/lib/log4j-1.2.15.jar:/usr/lib/hadoop-mapreduce/lib/junit-4.8.2.jar:/usr/lib/hadoop/lib/commons-cli-1.2.jar:/usr/lib/hadoop/lib/commons-codec-1.4.jar:/usr/lib/hadoop/lib/commons-configuration-1.6.jar:/usr/lib/hadoop/lib/commons-lang-2.5.jar:/usr/lib/hadoop/lib/commons-logging-1.1.1.jar:/usr/lib/hadoop/hadoop-common-2.0.0-cdh4.0.0.jar:/usr/lib/hadoop/hadoop-auth-2.0.0-cdh4.0.0.jar:/usr/lib/hadoop/lib/slf4j-api-1.6.1.jar:/usr/lib/hadoop/lib/slf4j-log4j12-1.6.1.jar:/home/schwenk/pigtest/conf:./lib/adition.jar:./lib/adition-test.jar org.junit.runner.JUnitCore com.adition.pig.test.TestCONTAINS
  2. JUnit version 4.8.2
  3. log4j:WARN No appenders could be found for logger (org.apache.pig.impl.util.SpillableMemoryManager).
  4. log4j:WARN Please initialize the log4j system properly.
  5. .org.apache.pig.impl.logicalLayer.FrontendException: ERROR 1066: Unable to open iterator for alias b
  6.         at org.apache.pig.PigServer.openIterator(PigServer.java:857)
  7.         at com.adition.pig.test.TestCONTAINS.testFiltering(TestCONTAINS.java:130)
  8.         at sun.reflect.NativeMethodAccessorImpl.invoke0(Native Method)
  9.         at sun.reflect.NativeMethodAccessorImpl.invoke(NativeMethodAccessorImpl.java:39)
  10.         at sun.reflect.DelegatingMethodAccessorImpl.invoke(DelegatingMethodAccessorImpl.java:25)
  11.         at java.lang.reflect.Method.invoke(Method.java:597)
  12.         at org.junit.runners.model.FrameworkMethod$1.runReflectiveCall(FrameworkMethod.java:44)
  13.         at org.junit.internal.runners.model.ReflectiveCallable.run(ReflectiveCallable.java:15)
  14.         at org.junit.runners.model.FrameworkMethod.invokeExplosively(FrameworkMethod.java:41)
  15.         at org.junit.internal.runners.statements.InvokeMethod.evaluate(InvokeMethod.java:20)
  16.         at org.junit.runners.BlockJUnit4ClassRunner.runNotIgnored(BlockJUnit4ClassRunner.java:79)
  17.         at org.junit.runners.BlockJUnit4ClassRunner.runChild(BlockJUnit4ClassRunner.java:71)
  18.         at org.junit.runners.BlockJUnit4ClassRunner.runChild(BlockJUnit4ClassRunner.java:49)
  19.         at org.junit.runners.ParentRunner$3.run(ParentRunner.java:193)
  20.         at org.junit.runners.ParentRunner$1.schedule(ParentRunner.java:52)
  21.         at org.junit.runners.ParentRunner.runChildren(ParentRunner.java:191)
  22.         at org.junit.runners.ParentRunner.access$000(ParentRunner.java:42)
  23.         at org.junit.runners.ParentRunner$2.evaluate(ParentRunner.java:184)
  24.         at org.junit.internal.runners.statements.RunBefores.evaluate(RunBefores.java:28)
  25.         at org.junit.runners.ParentRunner.run(ParentRunner.java:236)
  26.         at org.junit.runners.Suite.runChild(Suite.java:128)
  27.         at org.junit.runners.Suite.runChild(Suite.java:24)
  28.         at org.junit.runners.ParentRunner$3.run(ParentRunner.java:193)
  29.         at org.junit.runners.ParentRunner$1.schedule(ParentRunner.java:52)
  30.         at org.junit.runners.ParentRunner.runChildren(ParentRunner.java:191)
  31.         at org.junit.runners.ParentRunner.access$000(ParentRunner.java:42)
  32.         at org.junit.runners.ParentRunner$2.evaluate(ParentRunner.java:184)
  33.         at org.junit.runners.ParentRunner.run(ParentRunner.java:236)
  34.         at org.junit.runner.JUnitCore.run(JUnitCore.java:157)
  35.         at org.junit.runner.JUnitCore.run(JUnitCore.java:136)
  36.         at org.junit.runner.JUnitCore.run(JUnitCore.java:117)
  37.         at org.junit.runner.JUnitCore.runMain(JUnitCore.java:98)
  38.         at org.junit.runner.JUnitCore.runMainAndExit(JUnitCore.java:53)
  39.         at org.junit.runner.JUnitCore.main(JUnitCore.java:45)
  40. Caused by: java.io.IOException: Job terminated with anomalous status FAILED
  41.         at org.apache.pig.PigServer.openIterator(PigServer.java:849)
  42.         ... 33 more
  43. E
  44. Time: 2,138
  45. There was 1 failure:
  46. 1) testFiltering(com.adition.pig.test.TestCONTAINS)
  47. junit.framework.AssertionFailedError: null
  48.         at junit.framework.Assert.fail(Assert.java:47)
  49.         at junit.framework.Assert.fail(Assert.java:53)
  50.         at com.adition.pig.test.TestCONTAINS.testFiltering(TestCONTAINS.java:140)
  51.         at sun.reflect.NativeMethodAccessorImpl.invoke0(Native Method)
  52.         at sun.reflect.NativeMethodAccessorImpl.invoke(NativeMethodAccessorImpl.java:39)
  53.         at sun.reflect.DelegatingMethodAccessorImpl.invoke(DelegatingMethodAccessorImpl.java:25)
  54.         at java.lang.reflect.Method.invoke(Method.java:597)
  55.         at org.junit.runners.model.FrameworkMethod$1.runReflectiveCall(FrameworkMethod.java:44)
  56.         at org.junit.internal.runners.model.ReflectiveCallable.run(ReflectiveCallable.java:15)
  57.         at org.junit.runners.model.FrameworkMethod.invokeExplosively(FrameworkMethod.java:41)
  58.         at org.junit.internal.runners.statements.InvokeMethod.evaluate(InvokeMethod.java:20)
  59.         at org.junit.runners.BlockJUnit4ClassRunner.runNotIgnored(BlockJUnit4ClassRunner.java:79)
  60.         at org.junit.runners.BlockJUnit4ClassRunner.runChild(BlockJUnit4ClassRunner.java:71)
  61.         at org.junit.runners.BlockJUnit4ClassRunner.runChild(BlockJUnit4ClassRunner.java:49)
  62.         at org.junit.runners.ParentRunner$3.run(ParentRunner.java:193)
  63.         at org.junit.runners.ParentRunner$1.schedule(ParentRunner.java:52)
  64.         at org.junit.runners.ParentRunner.runChildren(ParentRunner.java:191)
  65.         at org.junit.runners.ParentRunner.access$000(ParentRunner.java:42)
  66.         at org.junit.runners.ParentRunner$2.evaluate(ParentRunner.java:184)
  67.         at org.junit.internal.runners.statements.RunBefores.evaluate(RunBefores.java:28)
  68.         at org.junit.runners.ParentRunner.run(ParentRunner.java:236)
  69.         at org.junit.runners.Suite.runChild(Suite.java:128)
  70.         at org.junit.runners.Suite.runChild(Suite.java:24)
  71.         at org.junit.runners.ParentRunner$3.run(ParentRunner.java:193)
  72.         at org.junit.runners.ParentRunner$1.schedule(ParentRunner.java:52)
  73.         at org.junit.runners.ParentRunner.runChildren(ParentRunner.java:191)
  74.         at org.junit.runners.ParentRunner.access$000(ParentRunner.java:42)
  75.         at org.junit.runners.ParentRunner$2.evaluate(ParentRunner.java:184)
  76.         at org.junit.runners.ParentRunner.run(ParentRunner.java:236)
  77.         at org.junit.runner.JUnitCore.run(JUnitCore.java:157)
  78.         at org.junit.runner.JUnitCore.run(JUnitCore.java:136)
  79.         at org.junit.runner.JUnitCore.run(JUnitCore.java:117)
  80.         at org.junit.runner.JUnitCore.runMain(JUnitCore.java:98)
  81.         at org.junit.runner.JUnitCore.runMainAndExit(JUnitCore.java:53)
  82.         at org.junit.runner.JUnitCore.main(JUnitCore.java:45)
  83.  
  84. FAILURES!!!
  85. Tests run: 1,  Failures: 1
clone this paste RAW Paste Data