Guest User

Untitled

a guest
Oct 2nd, 2011
532
0
Never
Not a member of Pastebin yet? Sign Up, it unlocks many cool features!
text 51.42 KB | None | 0 0
  1. pip install gevent
  2. Downloading/unpacking gevent
  3. Running setup.py egg_info for package gevent
  4.  
  5. Requirement already satisfied (use --upgrade to upgrade): greenlet in ./tl_env/lib/python2.7/site-packages (from gevent)
  6. Installing collected packages: gevent
  7. Running setup.py install for gevent
  8. building 'gevent.core' extension
  9. gcc-4.2 -fno-strict-aliasing -fno-common -dynamic -isysroot /Developer/SDKs/MacOSX10.6.sdk -arch i386 -arch x86_64 -g -O2 -DNDEBUG -g -O3 -I/Library/Frameworks/Python.framework/Versions/2.7/include/python2.7 -c gevent/core.c -o build/temp.macosx-10.6-intel-2.7/gevent/core.o
  10. In file included from gevent/core.c:225:
  11. gevent/libevent.h:9:19: error: event.h: No such file or directory
  12. gevent/libevent.h:38:20: error: evhttp.h: No such file or directory
  13. gevent/libevent.h:39:19: error: evdns.h: No such file or directory
  14. gevent/core.c:361: error: field ‘ev’ has incomplete type
  15. gevent/core.c:741: warning: parameter names (without types) in function declaration
  16. gevent/core.c: In function ‘__pyx_f_6gevent_4core___event_handler’:
  17. gevent/core.c:1619: error: ‘EV_READ’ undeclared (first use in this function)
  18. gevent/core.c:1619: error: (Each undeclared identifier is reported only once
  19. gevent/core.c:1619: error: for each function it appears in.)
  20. gevent/core.c:1619: error: ‘EV_WRITE’ undeclared (first use in this function)
  21. gevent/core.c:1619: error: ‘EV_SIGNAL’ undeclared (first use in this function)
  22. gevent/core.c:1619: error: ‘EV_TIMEOUT’ undeclared (first use in this function)
  23. gevent/core.c: In function ‘__pyx_pf_6gevent_4core_5event_7pending___get__’:
  24. gevent/core.c:1970: error: ‘EV_TIMEOUT’ undeclared (first use in this function)
  25. gevent/core.c:1970: error: ‘EV_SIGNAL’ undeclared (first use in this function)
  26. gevent/core.c:1970: error: ‘EV_READ’ undeclared (first use in this function)
  27. gevent/core.c:1970: error: ‘EV_WRITE’ undeclared (first use in this function)
  28. gevent/core.c: In function ‘__pyx_pf_6gevent_4core_5event_10events_str___get__’:
  29. gevent/core.c:2126: error: ‘EV_TIMEOUT’ undeclared (first use in this function)
  30. gevent/core.c:2136: error: ‘EV_READ’ undeclared (first use in this function)
  31. gevent/core.c:2146: error: ‘EV_WRITE’ undeclared (first use in this function)
  32. gevent/core.c:2164: error: ‘EV_SIGNAL’ undeclared (first use in this function)
  33. gevent/core.c:2174: error: ‘EV_PERSIST’ undeclared (first use in this function)
  34. gevent/core.c: In function ‘__pyx_pf_6gevent_4core_5event_9flags_str___get__’:
  35. gevent/core.c:2466: error: ‘EVLIST_TIMEOUT’ undeclared (first use in this function)
  36. gevent/core.c:2476: error: ‘EVLIST_INSERTED’ undeclared (first use in this function)
  37. gevent/core.c:2486: error: ‘EVLIST_SIGNAL’ undeclared (first use in this function)
  38. gevent/core.c:2504: error: ‘EVLIST_ACTIVE’ undeclared (first use in this function)
  39. gevent/core.c:2514: error: ‘EVLIST_INTERNAL’ undeclared (first use in this function)
  40. gevent/core.c:2524: error: ‘EVLIST_INIT’ undeclared (first use in this function)
  41. gevent/core.c: In function ‘__pyx_pf_6gevent_4core_5event_2cancel’:
  42. gevent/core.c:3048: error: ‘EV_TIMEOUT’ undeclared (first use in this function)
  43. gevent/core.c:3048: error: ‘EV_SIGNAL’ undeclared (first use in this function)
  44. gevent/core.c:3048: error: ‘EV_READ’ undeclared (first use in this function)
  45. gevent/core.c:3048: error: ‘EV_WRITE’ undeclared (first use in this function)
  46. gevent/core.c: In function ‘__pyx_pf_6gevent_4core_10read_event___init__’:
  47. gevent/core.c:3886: error: ‘EV_READ’ undeclared (first use in this function)
  48. gevent/core.c:3905: error: ‘EV_PERSIST’ undeclared (first use in this function)
  49. gevent/core.c: In function ‘__pyx_pf_6gevent_4core_11write_event___init__’:
  50. gevent/core.c:4088: error: ‘EV_WRITE’ undeclared (first use in this function)
  51. gevent/core.c:4107: error: ‘EV_PERSIST’ undeclared (first use in this function)
  52. gevent/core.c: In function ‘__pyx_pf_6gevent_4core_15readwrite_event___init__’:
  53. gevent/core.c:4302: error: ‘EV_READ’ undeclared (first use in this function)
  54. gevent/core.c:4302: error: ‘EV_WRITE’ undeclared (first use in this function)
  55. gevent/core.c:4321: error: ‘EV_PERSIST’ undeclared (first use in this function)
  56. gevent/core.c: In function ‘__pyx_f_6gevent_4core___simple_handler’:
  57. gevent/core.c:4710: error: ‘EV_READ’ undeclared (first use in this function)
  58. gevent/core.c:4710: error: ‘EV_WRITE’ undeclared (first use in this function)
  59. gevent/core.c:4710: error: ‘EV_SIGNAL’ undeclared (first use in this function)
  60. gevent/core.c:4710: error: ‘EV_TIMEOUT’ undeclared (first use in this function)
  61. gevent/core.c: In function ‘__pyx_pf_6gevent_4core_6signal___init__’:
  62. gevent/core.c:5040: error: ‘EV_SIGNAL’ undeclared (first use in this function)
  63. gevent/core.c:5040: error: ‘EV_PERSIST’ undeclared (first use in this function)
  64. gevent/core.c: In function ‘__pyx_pf_6gevent_4core_12active_event___init__’:
  65. gevent/core.c:5195: error: ‘EV_TIMEOUT’ undeclared (first use in this function)
  66. gevent/core.c: In function ‘__pyx_pf_6gevent_4core_2loop’:
  67. gevent/core.c:5504: error: ‘EVLOOP_ONCE’ undeclared (first use in this function)
  68. gevent/core.c:5523: error: ‘EVLOOP_NONBLOCK’ undeclared (first use in this function)
  69. gevent/core.c: In function ‘__pyx_pf_6gevent_4core_3get_version’:
  70. gevent/core.c:5656: warning: passing argument 1 of ‘PyString_FromString’ makes pointer from integer without a cast
  71. gevent/core.c: In function ‘__pyx_pf_6gevent_4core_4get_method’:
  72. gevent/core.c:5699: warning: passing argument 1 of ‘PyString_FromString’ makes pointer from integer without a cast
  73. gevent/core.c: In function ‘__pyx_pf_6gevent_4core_9dns_err_to_string’:
  74. gevent/core.c:5977: warning: assignment makes pointer from integer without a cast
  75. gevent/core.c: In function ‘__pyx_pf_6gevent_4core_17http_request_base_6get_input_headers’:
  76. gevent/core.c:9277: error: dereferencing pointer to incomplete type
  77. gevent/core.c:9286: error: dereferencing pointer to incomplete type
  78. gevent/core.c:9319: error: dereferencing pointer to incomplete type
  79. gevent/core.c:9328: error: dereferencing pointer to incomplete type
  80. gevent/core.c:9396: error: dereferencing pointer to incomplete type
  81. gevent/core.c: In function ‘__pyx_pf_6gevent_4core_17http_request_base_10connection___get__’:
  82. gevent/core.c:9477: error: dereferencing pointer to incomplete type
  83. gevent/core.c: In function ‘__pyx_pf_6gevent_4core_17http_request_base_11remote_host___get__’:
  84. gevent/core.c:9552: error: dereferencing pointer to incomplete type
  85. gevent/core.c:9563: error: dereferencing pointer to incomplete type
  86. gevent/core.c: In function ‘__pyx_pf_6gevent_4core_17http_request_base_11remote_port___get__’:
  87. gevent/core.c:9633: error: dereferencing pointer to incomplete type
  88. gevent/core.c: In function ‘__pyx_pf_6gevent_4core_17http_request_base_4kind___get__’:
  89. gevent/core.c:9754: error: dereferencing pointer to incomplete type
  90. gevent/core.c: In function ‘__pyx_pf_6gevent_4core_17http_request_base_4type___get__’:
  91. gevent/core.c:9821: error: dereferencing pointer to incomplete type
  92. gevent/core.c: In function ‘__pyx_pf_6gevent_4core_17http_request_base_7typestr___get__’:
  93. gevent/core.c:9895: error: dereferencing pointer to incomplete type
  94. gevent/core.c:9909: error: dereferencing pointer to incomplete type
  95. gevent/core.c: In function ‘__pyx_pf_6gevent_4core_17http_request_base_3uri___get__’:
  96. gevent/core.c:9991: error: dereferencing pointer to incomplete type
  97. gevent/core.c:10002: error: dereferencing pointer to incomplete type
  98. gevent/core.c: In function ‘__pyx_pf_6gevent_4core_17http_request_base_5major___get__’:
  99. gevent/core.c:10072: error: dereferencing pointer to incomplete type
  100. gevent/core.c: In function ‘__pyx_pf_6gevent_4core_17http_request_base_5minor___get__’:
  101. gevent/core.c:10139: error: dereferencing pointer to incomplete type
  102. gevent/core.c: In function ‘__pyx_pf_6gevent_4core_17http_request_base_7version___get__’:
  103. gevent/core.c:10208: error: dereferencing pointer to incomplete type
  104. gevent/core.c:10210: error: dereferencing pointer to incomplete type
  105. gevent/core.c: In function ‘__pyx_pf_6gevent_4core_17http_request_base_13response_code___get__’:
  106. gevent/core.c:10287: error: dereferencing pointer to incomplete type
  107. gevent/core.c: In function ‘__pyx_pf_6gevent_4core_17http_request_base_18response_code_line___get__’:
  108. gevent/core.c:10353: error: dereferencing pointer to incomplete type
  109. gevent/core.c:10364: error: dereferencing pointer to incomplete type
  110. gevent/core.c: In function ‘__pyx_pf_6gevent_4core_17http_request_base_7chunked___get__’:
  111. gevent/core.c:10488: error: dereferencing pointer to incomplete type
  112. gevent/core.c: In function ‘__pyx_pf_6gevent_4core_17http_request_base_12input_buffer___get__’:
  113. gevent/core.c:10580: error: dereferencing pointer to incomplete type
  114. gevent/core.c: In function ‘__pyx_pf_6gevent_4core_17http_request_base_13output_buffer___get__’:
  115. gevent/core.c:10695: error: dereferencing pointer to incomplete type
  116. gevent/core.c: In function ‘__pyx_pf_6gevent_4core_17http_request_base_7find_input_header’:
  117. gevent/core.c:10795: error: dereferencing pointer to incomplete type
  118. gevent/core.c:10795: warning: assignment makes pointer from integer without a cast
  119. gevent/core.c: In function ‘__pyx_pf_6gevent_4core_17http_request_base_8find_output_header’:
  120. gevent/core.c:10895: error: dereferencing pointer to incomplete type
  121. gevent/core.c:10895: warning: assignment makes pointer from integer without a cast
  122. gevent/core.c: In function ‘__pyx_pf_6gevent_4core_17http_request_base_9add_input_header’:
  123. gevent/core.c:11028: error: dereferencing pointer to incomplete type
  124. gevent/core.c: In function ‘__pyx_pf_6gevent_4core_17http_request_base_10add_output_header’:
  125. gevent/core.c:11151: error: dereferencing pointer to incomplete type
  126. gevent/core.c: In function ‘__pyx_pf_6gevent_4core_17http_request_base_11remove_input_header’:
  127. gevent/core.c:11242: error: dereferencing pointer to incomplete type
  128. gevent/core.c: In function ‘__pyx_pf_6gevent_4core_17http_request_base_12remove_output_header’:
  129. gevent/core.c:11325: error: dereferencing pointer to incomplete type
  130. gevent/core.c: In function ‘__pyx_pf_6gevent_4core_17http_request_base_13clear_input_headers’:
  131. gevent/core.c:11396: error: dereferencing pointer to incomplete type
  132. gevent/core.c: In function ‘__pyx_pf_6gevent_4core_17http_request_base_14clear_output_headers’:
  133. gevent/core.c:11458: error: dereferencing pointer to incomplete type
  134. gevent/core.c: In function ‘__pyx_pf_6gevent_4core_12http_request_3send_reply’:
  135. gevent/core.c:12091: warning: assignment makes pointer from integer without a cast
  136. gevent/core.c: In function ‘__pyx_pf_6gevent_4core_12http_request_5send_reply_chunk’:
  137. gevent/core.c:12388: warning: assignment makes pointer from integer without a cast
  138. gevent/core.c: In function ‘__pyx_pf_6gevent_4core_19http_request_client___init__’:
  139. gevent/core.c:12831: warning: assignment makes pointer from integer without a cast
  140. gevent/core.c: In function ‘__pyx_pf_6gevent_4core_15http_connection_1new’:
  141. gevent/core.c:13347: warning: assignment makes pointer from integer without a cast
  142. gevent/core.c: In function ‘__pyx_pf_6gevent_4core_15http_connection_4peer___get__’:
  143. gevent/core.c:13877: error: ‘ev_uint16_t’ undeclared (first use in this function)
  144. gevent/core.c:13877: error: expected ‘;’ before ‘__pyx_v_port’
  145. gevent/core.c:13928: error: ‘__pyx_v_port’ undeclared (first use in this function)
  146. gevent/core.c: In function ‘__pyx_f_6gevent_4core__http_cb_handler’:
  147. gevent/core.c:14846: error: dereferencing pointer to incomplete type
  148. gevent/core.c: In function ‘__pyx_f_6gevent_4core_report_internal_error’:
  149. gevent/core.c:15344: error: dereferencing pointer to incomplete type
  150. gevent/core.c:15358: error: dereferencing pointer to incomplete type
  151. gevent/core.c:15367: error: dereferencing pointer to incomplete type
  152. gevent/core.c:15376: warning: assignment makes pointer from integer without a cast
  153. gevent/core.c:15385: error: dereferencing pointer to incomplete type
  154. gevent/core.c: In function ‘__pyx_pf_6gevent_4core_4http___init__’:
  155. gevent/core.c:15559: warning: assignment makes pointer from integer without a cast
  156. gevent/core.c: At top level:
  157. gevent/core.c:21272: error: expected ‘)’ before ‘val’
  158. In file included from gevent/core.c:225:
  159. gevent/libevent.h:9:19: error: event.h: No such file or directory
  160. gevent/libevent.h:38:20: error: evhttp.h: No such file or directory
  161. gevent/libevent.h:39:19: error: evdns.h: No such file or directory
  162. gevent/core.c:361: error: field ‘ev’ has incomplete type
  163. gevent/core.c:741: warning: parameter names (without types) in function declaration
  164. gevent/core.c: In function ‘__pyx_f_6gevent_4core___event_handler’:
  165. gevent/core.c:1619: error: ‘EV_READ’ undeclared (first use in this function)
  166. gevent/core.c:1619: error: (Each undeclared identifier is reported only once
  167. gevent/core.c:1619: error: for each function it appears in.)
  168. gevent/core.c:1619: error: ‘EV_WRITE’ undeclared (first use in this function)
  169. gevent/core.c:1619: error: ‘EV_SIGNAL’ undeclared (first use in this function)
  170. gevent/core.c:1619: error: ‘EV_TIMEOUT’ undeclared (first use in this function)
  171. gevent/core.c: In function ‘__pyx_pf_6gevent_4core_5event_7pending___get__’:
  172. gevent/core.c:1970: error: ‘EV_TIMEOUT’ undeclared (first use in this function)
  173. gevent/core.c:1970: error: ‘EV_SIGNAL’ undeclared (first use in this function)
  174. gevent/core.c:1970: error: ‘EV_READ’ undeclared (first use in this function)
  175. gevent/core.c:1970: error: ‘EV_WRITE’ undeclared (first use in this function)
  176. gevent/core.c: In function ‘__pyx_pf_6gevent_4core_5event_10events_str___get__’:
  177. gevent/core.c:2126: error: ‘EV_TIMEOUT’ undeclared (first use in this function)
  178. gevent/core.c:2136: error: ‘EV_READ’ undeclared (first use in this function)
  179. gevent/core.c:2146: error: ‘EV_WRITE’ undeclared (first use in this function)
  180. gevent/core.c:2164: error: ‘EV_SIGNAL’ undeclared (first use in this function)
  181. gevent/core.c:2174: error: ‘EV_PERSIST’ undeclared (first use in this function)
  182. gevent/core.c: In function ‘__pyx_pf_6gevent_4core_5event_9flags_str___get__’:
  183. gevent/core.c:2466: error: ‘EVLIST_TIMEOUT’ undeclared (first use in this function)
  184. gevent/core.c:2476: error: ‘EVLIST_INSERTED’ undeclared (first use in this function)
  185. gevent/core.c:2486: error: ‘EVLIST_SIGNAL’ undeclared (first use in this function)
  186. gevent/core.c:2504: error: ‘EVLIST_ACTIVE’ undeclared (first use in this function)
  187. gevent/core.c:2514: error: ‘EVLIST_INTERNAL’ undeclared (first use in this function)
  188. gevent/core.c:2524: error: ‘EVLIST_INIT’ undeclared (first use in this function)
  189. gevent/core.c: In function ‘__pyx_pf_6gevent_4core_5event_2cancel’:
  190. gevent/core.c:3048: error: ‘EV_TIMEOUT’ undeclared (first use in this function)
  191. gevent/core.c:3048: error: ‘EV_SIGNAL’ undeclared (first use in this function)
  192. gevent/core.c:3048: error: ‘EV_READ’ undeclared (first use in this function)
  193. gevent/core.c:3048: error: ‘EV_WRITE’ undeclared (first use in this function)
  194. gevent/core.c: In function ‘__pyx_pf_6gevent_4core_10read_event___init__’:
  195. gevent/core.c:3886: error: ‘EV_READ’ undeclared (first use in this function)
  196. gevent/core.c:3905: error: ‘EV_PERSIST’ undeclared (first use in this function)
  197. gevent/core.c: In function ‘__pyx_pf_6gevent_4core_11write_event___init__’:
  198. gevent/core.c:4088: error: ‘EV_WRITE’ undeclared (first use in this function)
  199. gevent/core.c:4107: error: ‘EV_PERSIST’ undeclared (first use in this function)
  200. gevent/core.c: In function ‘__pyx_pf_6gevent_4core_15readwrite_event___init__’:
  201. gevent/core.c:4302: error: ‘EV_READ’ undeclared (first use in this function)
  202. gevent/core.c:4302: error: ‘EV_WRITE’ undeclared (first use in this function)
  203. gevent/core.c:4321: error: ‘EV_PERSIST’ undeclared (first use in this function)
  204. gevent/core.c: In function ‘__pyx_f_6gevent_4core___simple_handler’:
  205. gevent/core.c:4710: error: ‘EV_READ’ undeclared (first use in this function)
  206. gevent/core.c:4710: error: ‘EV_WRITE’ undeclared (first use in this function)
  207. gevent/core.c:4710: error: ‘EV_SIGNAL’ undeclared (first use in this function)
  208. gevent/core.c:4710: error: ‘EV_TIMEOUT’ undeclared (first use in this function)
  209. gevent/core.c: In function ‘__pyx_pf_6gevent_4core_6signal___init__’:
  210. gevent/core.c:5040: error: ‘EV_SIGNAL’ undeclared (first use in this function)
  211. gevent/core.c:5040: error: ‘EV_PERSIST’ undeclared (first use in this function)
  212. gevent/core.c: In function ‘__pyx_pf_6gevent_4core_12active_event___init__’:
  213. gevent/core.c:5195: error: ‘EV_TIMEOUT’ undeclared (first use in this function)
  214. gevent/core.c: In function ‘__pyx_pf_6gevent_4core_2loop’:
  215. gevent/core.c:5504: error: ‘EVLOOP_ONCE’ undeclared (first use in this function)
  216. gevent/core.c:5523: error: ‘EVLOOP_NONBLOCK’ undeclared (first use in this function)
  217. gevent/core.c: In function ‘__pyx_pf_6gevent_4core_3get_version’:
  218. gevent/core.c:5656: warning: passing argument 1 of ‘PyString_FromString’ makes pointer from integer without a cast
  219. gevent/core.c: In function ‘__pyx_pf_6gevent_4core_4get_method’:
  220. gevent/core.c:5699: warning: passing argument 1 of ‘PyString_FromString’ makes pointer from integer without a cast
  221. gevent/core.c: In function ‘__pyx_pf_6gevent_4core_9dns_err_to_string’:
  222. gevent/core.c:5977: warning: assignment makes pointer from integer without a cast
  223. gevent/core.c: In function ‘__pyx_pf_6gevent_4core_6buffer_6read’:
  224. gevent/core.c:7545: warning: cast to pointer from integer of different size
  225. gevent/core.c: In function ‘__pyx_pf_6gevent_4core_6buffer_7readline’:
  226. gevent/core.c:7849: warning: cast to pointer from integer of different size
  227. gevent/core.c: In function ‘__pyx_pf_6gevent_4core_17http_request_base_6get_input_headers’:
  228. gevent/core.c:9277: error: dereferencing pointer to incomplete type
  229. gevent/core.c:9286: error: dereferencing pointer to incomplete type
  230. gevent/core.c:9319: error: dereferencing pointer to incomplete type
  231. gevent/core.c:9328: error: dereferencing pointer to incomplete type
  232. gevent/core.c:9396: error: dereferencing pointer to incomplete type
  233. gevent/core.c: In function ‘__pyx_pf_6gevent_4core_17http_request_base_10connection___get__’:
  234. gevent/core.c:9477: error: dereferencing pointer to incomplete type
  235. gevent/core.c: In function ‘__pyx_pf_6gevent_4core_17http_request_base_11remote_host___get__’:
  236. gevent/core.c:9552: error: dereferencing pointer to incomplete type
  237. gevent/core.c:9563: error: dereferencing pointer to incomplete type
  238. gevent/core.c: In function ‘__pyx_pf_6gevent_4core_17http_request_base_11remote_port___get__’:
  239. gevent/core.c:9633: error: dereferencing pointer to incomplete type
  240. gevent/core.c: In function ‘__pyx_pf_6gevent_4core_17http_request_base_4kind___get__’:
  241. gevent/core.c:9754: error: dereferencing pointer to incomplete type
  242. gevent/core.c: In function ‘__pyx_pf_6gevent_4core_17http_request_base_4type___get__’:
  243. gevent/core.c:9821: error: dereferencing pointer to incomplete type
  244. gevent/core.c: In function ‘__pyx_pf_6gevent_4core_17http_request_base_7typestr___get__’:
  245. gevent/core.c:9895: error: dereferencing pointer to incomplete type
  246. gevent/core.c:9909: error: dereferencing pointer to incomplete type
  247. gevent/core.c: In function ‘__pyx_pf_6gevent_4core_17http_request_base_3uri___get__’:
  248. gevent/core.c:9991: error: dereferencing pointer to incomplete type
  249. gevent/core.c:10002: error: dereferencing pointer to incomplete type
  250. gevent/core.c: In function ‘__pyx_pf_6gevent_4core_17http_request_base_5major___get__’:
  251. gevent/core.c:10072: error: dereferencing pointer to incomplete type
  252. gevent/core.c: In function ‘__pyx_pf_6gevent_4core_17http_request_base_5minor___get__’:
  253. gevent/core.c:10139: error: dereferencing pointer to incomplete type
  254. gevent/core.c: In function ‘__pyx_pf_6gevent_4core_17http_request_base_7version___get__’:
  255. gevent/core.c:10208: error: dereferencing pointer to incomplete type
  256. gevent/core.c:10210: error: dereferencing pointer to incomplete type
  257. gevent/core.c: In function ‘__pyx_pf_6gevent_4core_17http_request_base_13response_code___get__’:
  258. gevent/core.c:10287: error: dereferencing pointer to incomplete type
  259. gevent/core.c: In function ‘__pyx_pf_6gevent_4core_17http_request_base_18response_code_line___get__’:
  260. gevent/core.c:10353: error: dereferencing pointer to incomplete type
  261. gevent/core.c:10364: error: dereferencing pointer to incomplete type
  262. gevent/core.c: In function ‘__pyx_pf_6gevent_4core_17http_request_base_7chunked___get__’:
  263. gevent/core.c:10488: error: dereferencing pointer to incomplete type
  264. gevent/core.c: In function ‘__pyx_pf_6gevent_4core_17http_request_base_12input_buffer___get__’:
  265. gevent/core.c:10580: error: dereferencing pointer to incomplete type
  266. gevent/core.c: In function ‘__pyx_pf_6gevent_4core_17http_request_base_13output_buffer___get__’:
  267. gevent/core.c:10695: error: dereferencing pointer to incomplete type
  268. gevent/core.c: In function ‘__pyx_pf_6gevent_4core_17http_request_base_7find_input_header’:
  269. gevent/core.c:10795: error: dereferencing pointer to incomplete type
  270. gevent/core.c:10795: warning: assignment makes pointer from integer without a cast
  271. gevent/core.c: In function ‘__pyx_pf_6gevent_4core_17http_request_base_8find_output_header’:
  272. gevent/core.c:10895: error: dereferencing pointer to incomplete type
  273. gevent/core.c:10895: warning: assignment makes pointer from integer without a cast
  274. gevent/core.c: In function ‘__pyx_pf_6gevent_4core_17http_request_base_9add_input_header’:
  275. gevent/core.c:11028: error: dereferencing pointer to incomplete type
  276. gevent/core.c: In function ‘__pyx_pf_6gevent_4core_17http_request_base_10add_output_header’:
  277. gevent/core.c:11151: error: dereferencing pointer to incomplete type
  278. gevent/core.c: In function ‘__pyx_pf_6gevent_4core_17http_request_base_11remove_input_header’:
  279. gevent/core.c:11242: error: dereferencing pointer to incomplete type
  280. gevent/core.c: In function ‘__pyx_pf_6gevent_4core_17http_request_base_12remove_output_header’:
  281. gevent/core.c:11325: error: dereferencing pointer to incomplete type
  282. gevent/core.c: In function ‘__pyx_pf_6gevent_4core_17http_request_base_13clear_input_headers’:
  283. gevent/core.c:11396: error: dereferencing pointer to incomplete type
  284. gevent/core.c: In function ‘__pyx_pf_6gevent_4core_17http_request_base_14clear_output_headers’:
  285. gevent/core.c:11458: error: dereferencing pointer to incomplete type
  286. gevent/core.c: In function ‘__pyx_pf_6gevent_4core_12http_request_3send_reply’:
  287. gevent/core.c:12091: warning: assignment makes pointer from integer without a cast
  288. gevent/core.c: In function ‘__pyx_pf_6gevent_4core_12http_request_5send_reply_chunk’:
  289. gevent/core.c:12388: warning: assignment makes pointer from integer without a cast
  290. gevent/core.c: In function ‘__pyx_pf_6gevent_4core_19http_request_client___init__’:
  291. gevent/core.c:12831: warning: assignment makes pointer from integer without a cast
  292. gevent/core.c: In function ‘__pyx_pf_6gevent_4core_15http_connection_1new’:
  293. gevent/core.c:13347: warning: assignment makes pointer from integer without a cast
  294. gevent/core.c: In function ‘__pyx_pf_6gevent_4core_15http_connection_4peer___get__’:
  295. gevent/core.c:13877: error: ‘ev_uint16_t’ undeclared (first use in this function)
  296. gevent/core.c:13877: error: expected ‘;’ before ‘__pyx_v_port’
  297. gevent/core.c:13928: error: ‘__pyx_v_port’ undeclared (first use in this function)
  298. gevent/core.c: In function ‘__pyx_f_6gevent_4core__http_cb_handler’:
  299. gevent/core.c:14846: error: dereferencing pointer to incomplete type
  300. gevent/core.c: In function ‘__pyx_f_6gevent_4core_report_internal_error’:
  301. gevent/core.c:15344: error: dereferencing pointer to incomplete type
  302. gevent/core.c:15358: error: dereferencing pointer to incomplete type
  303. gevent/core.c:15367: error: dereferencing pointer to incomplete type
  304. gevent/core.c:15376: warning: assignment makes pointer from integer without a cast
  305. gevent/core.c:15385: error: dereferencing pointer to incomplete type
  306. gevent/core.c: In function ‘__pyx_pf_6gevent_4core_4http___init__’:
  307. gevent/core.c:15559: warning: assignment makes pointer from integer without a cast
  308. gevent/core.c: At top level:
  309. gevent/core.c:21272: error: expected ‘)’ before ‘val’
  310. lipo: can't figure out the architecture type of: /var/folders/s5/t94kn0p10hdgxzx9_9sprpg40000gq/T//cczk54q7.out
  311. error: command 'gcc-4.2' failed with exit status 1
  312. Complete output from command /Users/jacob/code/toplevel/tl_env/bin/python -c "import setuptools;__file__='/Users/jacob/code/toplevel/tl_env/build/gevent/setup.py';exec(compile(open(__file__).read().replace('\r\n', '\n'), __file__, 'exec'))" install --single-version-externally-managed --record /var/folders/s5/t94kn0p10hdgxzx9_9sprpg40000gq/T/pip-s2hPd3-record/install-record.txt --install-headers /Users/jacob/code/toplevel/tl_env/bin/../include/site/python2.7:
  313. running install
  314.  
  315. running build
  316.  
  317. running build_py
  318.  
  319. running build_ext
  320.  
  321. building 'gevent.core' extension
  322.  
  323. gcc-4.2 -fno-strict-aliasing -fno-common -dynamic -isysroot /Developer/SDKs/MacOSX10.6.sdk -arch i386 -arch x86_64 -g -O2 -DNDEBUG -g -O3 -I/Library/Frameworks/Python.framework/Versions/2.7/include/python2.7 -c gevent/core.c -o build/temp.macosx-10.6-intel-2.7/gevent/core.o
  324.  
  325. In file included from gevent/core.c:225:
  326.  
  327. gevent/libevent.h:9:19: error: event.h: No such file or directory
  328.  
  329. gevent/libevent.h:38:20: error: evhttp.h: No such file or directory
  330.  
  331. gevent/libevent.h:39:19: error: evdns.h: No such file or directory
  332.  
  333. gevent/core.c:361: error: field ‘ev’ has incomplete type
  334.  
  335. gevent/core.c:741: warning: parameter names (without types) in function declaration
  336.  
  337. gevent/core.c: In function ‘__pyx_f_6gevent_4core___event_handler’:
  338.  
  339. gevent/core.c:1619: error: ‘EV_READ’ undeclared (first use in this function)
  340.  
  341. gevent/core.c:1619: error: (Each undeclared identifier is reported only once
  342.  
  343. gevent/core.c:1619: error: for each function it appears in.)
  344.  
  345. gevent/core.c:1619: error: ‘EV_WRITE’ undeclared (first use in this function)
  346.  
  347. gevent/core.c:1619: error: ‘EV_SIGNAL’ undeclared (first use in this function)
  348.  
  349. gevent/core.c:1619: error: ‘EV_TIMEOUT’ undeclared (first use in this function)
  350.  
  351. gevent/core.c: In function ‘__pyx_pf_6gevent_4core_5event_7pending___get__’:
  352.  
  353. gevent/core.c:1970: error: ‘EV_TIMEOUT’ undeclared (first use in this function)
  354.  
  355. gevent/core.c:1970: error: ‘EV_SIGNAL’ undeclared (first use in this function)
  356.  
  357. gevent/core.c:1970: error: ‘EV_READ’ undeclared (first use in this function)
  358.  
  359. gevent/core.c:1970: error: ‘EV_WRITE’ undeclared (first use in this function)
  360.  
  361. gevent/core.c: In function ‘__pyx_pf_6gevent_4core_5event_10events_str___get__’:
  362.  
  363. gevent/core.c:2126: error: ‘EV_TIMEOUT’ undeclared (first use in this function)
  364.  
  365. gevent/core.c:2136: error: ‘EV_READ’ undeclared (first use in this function)
  366.  
  367. gevent/core.c:2146: error: ‘EV_WRITE’ undeclared (first use in this function)
  368.  
  369. gevent/core.c:2164: error: ‘EV_SIGNAL’ undeclared (first use in this function)
  370.  
  371. gevent/core.c:2174: error: ‘EV_PERSIST’ undeclared (first use in this function)
  372.  
  373. gevent/core.c: In function ‘__pyx_pf_6gevent_4core_5event_9flags_str___get__’:
  374.  
  375. gevent/core.c:2466: error: ‘EVLIST_TIMEOUT’ undeclared (first use in this function)
  376.  
  377. gevent/core.c:2476: error: ‘EVLIST_INSERTED’ undeclared (first use in this function)
  378.  
  379. gevent/core.c:2486: error: ‘EVLIST_SIGNAL’ undeclared (first use in this function)
  380.  
  381. gevent/core.c:2504: error: ‘EVLIST_ACTIVE’ undeclared (first use in this function)
  382.  
  383. gevent/core.c:2514: error: ‘EVLIST_INTERNAL’ undeclared (first use in this function)
  384.  
  385. gevent/core.c:2524: error: ‘EVLIST_INIT’ undeclared (first use in this function)
  386.  
  387. gevent/core.c: In function ‘__pyx_pf_6gevent_4core_5event_2cancel’:
  388.  
  389. gevent/core.c:3048: error: ‘EV_TIMEOUT’ undeclared (first use in this function)
  390.  
  391. gevent/core.c:3048: error: ‘EV_SIGNAL’ undeclared (first use in this function)
  392.  
  393. gevent/core.c:3048: error: ‘EV_READ’ undeclared (first use in this function)
  394.  
  395. gevent/core.c:3048: error: ‘EV_WRITE’ undeclared (first use in this function)
  396.  
  397. gevent/core.c: In function ‘__pyx_pf_6gevent_4core_10read_event___init__’:
  398.  
  399. gevent/core.c:3886: error: ‘EV_READ’ undeclared (first use in this function)
  400.  
  401. gevent/core.c:3905: error: ‘EV_PERSIST’ undeclared (first use in this function)
  402.  
  403. gevent/core.c: In function ‘__pyx_pf_6gevent_4core_11write_event___init__’:
  404.  
  405. gevent/core.c:4088: error: ‘EV_WRITE’ undeclared (first use in this function)
  406.  
  407. gevent/core.c:4107: error: ‘EV_PERSIST’ undeclared (first use in this function)
  408.  
  409. gevent/core.c: In function ‘__pyx_pf_6gevent_4core_15readwrite_event___init__’:
  410.  
  411. gevent/core.c:4302: error: ‘EV_READ’ undeclared (first use in this function)
  412.  
  413. gevent/core.c:4302: error: ‘EV_WRITE’ undeclared (first use in this function)
  414.  
  415. gevent/core.c:4321: error: ‘EV_PERSIST’ undeclared (first use in this function)
  416.  
  417. gevent/core.c: In function ‘__pyx_f_6gevent_4core___simple_handler’:
  418.  
  419. gevent/core.c:4710: error: ‘EV_READ’ undeclared (first use in this function)
  420.  
  421. gevent/core.c:4710: error: ‘EV_WRITE’ undeclared (first use in this function)
  422.  
  423. gevent/core.c:4710: error: ‘EV_SIGNAL’ undeclared (first use in this function)
  424.  
  425. gevent/core.c:4710: error: ‘EV_TIMEOUT’ undeclared (first use in this function)
  426.  
  427. gevent/core.c: In function ‘__pyx_pf_6gevent_4core_6signal___init__’:
  428.  
  429. gevent/core.c:5040: error: ‘EV_SIGNAL’ undeclared (first use in this function)
  430.  
  431. gevent/core.c:5040: error: ‘EV_PERSIST’ undeclared (first use in this function)
  432.  
  433. gevent/core.c: In function ‘__pyx_pf_6gevent_4core_12active_event___init__’:
  434.  
  435. gevent/core.c:5195: error: ‘EV_TIMEOUT’ undeclared (first use in this function)
  436.  
  437. gevent/core.c: In function ‘__pyx_pf_6gevent_4core_2loop’:
  438.  
  439. gevent/core.c:5504: error: ‘EVLOOP_ONCE’ undeclared (first use in this function)
  440.  
  441. gevent/core.c:5523: error: ‘EVLOOP_NONBLOCK’ undeclared (first use in this function)
  442.  
  443. gevent/core.c: In function ‘__pyx_pf_6gevent_4core_3get_version’:
  444.  
  445. gevent/core.c:5656: warning: passing argument 1 of ‘PyString_FromString’ makes pointer from integer without a cast
  446.  
  447. gevent/core.c: In function ‘__pyx_pf_6gevent_4core_4get_method’:
  448.  
  449. gevent/core.c:5699: warning: passing argument 1 of ‘PyString_FromString’ makes pointer from integer without a cast
  450.  
  451. gevent/core.c: In function ‘__pyx_pf_6gevent_4core_9dns_err_to_string’:
  452.  
  453. gevent/core.c:5977: warning: assignment makes pointer from integer without a cast
  454.  
  455. gevent/core.c: In function ‘__pyx_pf_6gevent_4core_17http_request_base_6get_input_headers’:
  456.  
  457. gevent/core.c:9277: error: dereferencing pointer to incomplete type
  458.  
  459. gevent/core.c:9286: error: dereferencing pointer to incomplete type
  460.  
  461. gevent/core.c:9319: error: dereferencing pointer to incomplete type
  462.  
  463. gevent/core.c:9328: error: dereferencing pointer to incomplete type
  464.  
  465. gevent/core.c:9396: error: dereferencing pointer to incomplete type
  466.  
  467. gevent/core.c: In function ‘__pyx_pf_6gevent_4core_17http_request_base_10connection___get__’:
  468.  
  469. gevent/core.c:9477: error: dereferencing pointer to incomplete type
  470.  
  471. gevent/core.c: In function ‘__pyx_pf_6gevent_4core_17http_request_base_11remote_host___get__’:
  472.  
  473. gevent/core.c:9552: error: dereferencing pointer to incomplete type
  474.  
  475. gevent/core.c:9563: error: dereferencing pointer to incomplete type
  476.  
  477. gevent/core.c: In function ‘__pyx_pf_6gevent_4core_17http_request_base_11remote_port___get__’:
  478.  
  479. gevent/core.c:9633: error: dereferencing pointer to incomplete type
  480.  
  481. gevent/core.c: In function ‘__pyx_pf_6gevent_4core_17http_request_base_4kind___get__’:
  482.  
  483. gevent/core.c:9754: error: dereferencing pointer to incomplete type
  484.  
  485. gevent/core.c: In function ‘__pyx_pf_6gevent_4core_17http_request_base_4type___get__’:
  486.  
  487. gevent/core.c:9821: error: dereferencing pointer to incomplete type
  488.  
  489. gevent/core.c: In function ‘__pyx_pf_6gevent_4core_17http_request_base_7typestr___get__’:
  490.  
  491. gevent/core.c:9895: error: dereferencing pointer to incomplete type
  492.  
  493. gevent/core.c:9909: error: dereferencing pointer to incomplete type
  494.  
  495. gevent/core.c: In function ‘__pyx_pf_6gevent_4core_17http_request_base_3uri___get__’:
  496.  
  497. gevent/core.c:9991: error: dereferencing pointer to incomplete type
  498.  
  499. gevent/core.c:10002: error: dereferencing pointer to incomplete type
  500.  
  501. gevent/core.c: In function ‘__pyx_pf_6gevent_4core_17http_request_base_5major___get__’:
  502.  
  503. gevent/core.c:10072: error: dereferencing pointer to incomplete type
  504.  
  505. gevent/core.c: In function ‘__pyx_pf_6gevent_4core_17http_request_base_5minor___get__’:
  506.  
  507. gevent/core.c:10139: error: dereferencing pointer to incomplete type
  508.  
  509. gevent/core.c: In function ‘__pyx_pf_6gevent_4core_17http_request_base_7version___get__’:
  510.  
  511. gevent/core.c:10208: error: dereferencing pointer to incomplete type
  512.  
  513. gevent/core.c:10210: error: dereferencing pointer to incomplete type
  514.  
  515. gevent/core.c: In function ‘__pyx_pf_6gevent_4core_17http_request_base_13response_code___get__’:
  516.  
  517. gevent/core.c:10287: error: dereferencing pointer to incomplete type
  518.  
  519. gevent/core.c: In function ‘__pyx_pf_6gevent_4core_17http_request_base_18response_code_line___get__’:
  520.  
  521. gevent/core.c:10353: error: dereferencing pointer to incomplete type
  522.  
  523. gevent/core.c:10364: error: dereferencing pointer to incomplete type
  524.  
  525. gevent/core.c: In function ‘__pyx_pf_6gevent_4core_17http_request_base_7chunked___get__’:
  526.  
  527. gevent/core.c:10488: error: dereferencing pointer to incomplete type
  528.  
  529. gevent/core.c: In function ‘__pyx_pf_6gevent_4core_17http_request_base_12input_buffer___get__’:
  530.  
  531. gevent/core.c:10580: error: dereferencing pointer to incomplete type
  532.  
  533. gevent/core.c: In function ‘__pyx_pf_6gevent_4core_17http_request_base_13output_buffer___get__’:
  534.  
  535. gevent/core.c:10695: error: dereferencing pointer to incomplete type
  536.  
  537. gevent/core.c: In function ‘__pyx_pf_6gevent_4core_17http_request_base_7find_input_header’:
  538.  
  539. gevent/core.c:10795: error: dereferencing pointer to incomplete type
  540.  
  541. gevent/core.c:10795: warning: assignment makes pointer from integer without a cast
  542.  
  543. gevent/core.c: In function ‘__pyx_pf_6gevent_4core_17http_request_base_8find_output_header’:
  544.  
  545. gevent/core.c:10895: error: dereferencing pointer to incomplete type
  546.  
  547. gevent/core.c:10895: warning: assignment makes pointer from integer without a cast
  548.  
  549. gevent/core.c: In function ‘__pyx_pf_6gevent_4core_17http_request_base_9add_input_header’:
  550.  
  551. gevent/core.c:11028: error: dereferencing pointer to incomplete type
  552.  
  553. gevent/core.c: In function ‘__pyx_pf_6gevent_4core_17http_request_base_10add_output_header’:
  554.  
  555. gevent/core.c:11151: error: dereferencing pointer to incomplete type
  556.  
  557. gevent/core.c: In function ‘__pyx_pf_6gevent_4core_17http_request_base_11remove_input_header’:
  558.  
  559. gevent/core.c:11242: error: dereferencing pointer to incomplete type
  560.  
  561. gevent/core.c: In function ‘__pyx_pf_6gevent_4core_17http_request_base_12remove_output_header’:
  562.  
  563. gevent/core.c:11325: error: dereferencing pointer to incomplete type
  564.  
  565. gevent/core.c: In function ‘__pyx_pf_6gevent_4core_17http_request_base_13clear_input_headers’:
  566.  
  567. gevent/core.c:11396: error: dereferencing pointer to incomplete type
  568.  
  569. gevent/core.c: In function ‘__pyx_pf_6gevent_4core_17http_request_base_14clear_output_headers’:
  570.  
  571. gevent/core.c:11458: error: dereferencing pointer to incomplete type
  572.  
  573. gevent/core.c: In function ‘__pyx_pf_6gevent_4core_12http_request_3send_reply’:
  574.  
  575. gevent/core.c:12091: warning: assignment makes pointer from integer without a cast
  576.  
  577. gevent/core.c: In function ‘__pyx_pf_6gevent_4core_12http_request_5send_reply_chunk’:
  578.  
  579. gevent/core.c:12388: warning: assignment makes pointer from integer without a cast
  580.  
  581. gevent/core.c: In function ‘__pyx_pf_6gevent_4core_19http_request_client___init__’:
  582.  
  583. gevent/core.c:12831: warning: assignment makes pointer from integer without a cast
  584.  
  585. gevent/core.c: In function ‘__pyx_pf_6gevent_4core_15http_connection_1new’:
  586.  
  587. gevent/core.c:13347: warning: assignment makes pointer from integer without a cast
  588.  
  589. gevent/core.c: In function ‘__pyx_pf_6gevent_4core_15http_connection_4peer___get__’:
  590.  
  591. gevent/core.c:13877: error: ‘ev_uint16_t’ undeclared (first use in this function)
  592.  
  593. gevent/core.c:13877: error: expected ‘;’ before ‘__pyx_v_port’
  594.  
  595. gevent/core.c:13928: error: ‘__pyx_v_port’ undeclared (first use in this function)
  596.  
  597. gevent/core.c: In function ‘__pyx_f_6gevent_4core__http_cb_handler’:
  598.  
  599. gevent/core.c:14846: error: dereferencing pointer to incomplete type
  600.  
  601. gevent/core.c: In function ‘__pyx_f_6gevent_4core_report_internal_error’:
  602.  
  603. gevent/core.c:15344: error: dereferencing pointer to incomplete type
  604.  
  605. gevent/core.c:15358: error: dereferencing pointer to incomplete type
  606.  
  607. gevent/core.c:15367: error: dereferencing pointer to incomplete type
  608.  
  609. gevent/core.c:15376: warning: assignment makes pointer from integer without a cast
  610.  
  611. gevent/core.c:15385: error: dereferencing pointer to incomplete type
  612.  
  613. gevent/core.c: In function ‘__pyx_pf_6gevent_4core_4http___init__’:
  614.  
  615. gevent/core.c:15559: warning: assignment makes pointer from integer without a cast
  616.  
  617. gevent/core.c: At top level:
  618.  
  619. gevent/core.c:21272: error: expected ‘)’ before ‘val’
  620.  
  621. In file included from gevent/core.c:225:
  622.  
  623. gevent/libevent.h:9:19: error: event.h: No such file or directory
  624.  
  625. gevent/libevent.h:38:20: error: evhttp.h: No such file or directory
  626.  
  627. gevent/libevent.h:39:19: error: evdns.h: No such file or directory
  628.  
  629. gevent/core.c:361: error: field ‘ev’ has incomplete type
  630.  
  631. gevent/core.c:741: warning: parameter names (without types) in function declaration
  632.  
  633. gevent/core.c: In function ‘__pyx_f_6gevent_4core___event_handler’:
  634.  
  635. gevent/core.c:1619: error: ‘EV_READ’ undeclared (first use in this function)
  636.  
  637. gevent/core.c:1619: error: (Each undeclared identifier is reported only once
  638.  
  639. gevent/core.c:1619: error: for each function it appears in.)
  640.  
  641. gevent/core.c:1619: error: ‘EV_WRITE’ undeclared (first use in this function)
  642.  
  643. gevent/core.c:1619: error: ‘EV_SIGNAL’ undeclared (first use in this function)
  644.  
  645. gevent/core.c:1619: error: ‘EV_TIMEOUT’ undeclared (first use in this function)
  646.  
  647. gevent/core.c: In function ‘__pyx_pf_6gevent_4core_5event_7pending___get__’:
  648.  
  649. gevent/core.c:1970: error: ‘EV_TIMEOUT’ undeclared (first use in this function)
  650.  
  651. gevent/core.c:1970: error: ‘EV_SIGNAL’ undeclared (first use in this function)
  652.  
  653. gevent/core.c:1970: error: ‘EV_READ’ undeclared (first use in this function)
  654.  
  655. gevent/core.c:1970: error: ‘EV_WRITE’ undeclared (first use in this function)
  656.  
  657. gevent/core.c: In function ‘__pyx_pf_6gevent_4core_5event_10events_str___get__’:
  658.  
  659. gevent/core.c:2126: error: ‘EV_TIMEOUT’ undeclared (first use in this function)
  660.  
  661. gevent/core.c:2136: error: ‘EV_READ’ undeclared (first use in this function)
  662.  
  663. gevent/core.c:2146: error: ‘EV_WRITE’ undeclared (first use in this function)
  664.  
  665. gevent/core.c:2164: error: ‘EV_SIGNAL’ undeclared (first use in this function)
  666.  
  667. gevent/core.c:2174: error: ‘EV_PERSIST’ undeclared (first use in this function)
  668.  
  669. gevent/core.c: In function ‘__pyx_pf_6gevent_4core_5event_9flags_str___get__’:
  670.  
  671. gevent/core.c:2466: error: ‘EVLIST_TIMEOUT’ undeclared (first use in this function)
  672.  
  673. gevent/core.c:2476: error: ‘EVLIST_INSERTED’ undeclared (first use in this function)
  674.  
  675. gevent/core.c:2486: error: ‘EVLIST_SIGNAL’ undeclared (first use in this function)
  676.  
  677. gevent/core.c:2504: error: ‘EVLIST_ACTIVE’ undeclared (first use in this function)
  678.  
  679. gevent/core.c:2514: error: ‘EVLIST_INTERNAL’ undeclared (first use in this function)
  680.  
  681. gevent/core.c:2524: error: ‘EVLIST_INIT’ undeclared (first use in this function)
  682.  
  683. gevent/core.c: In function ‘__pyx_pf_6gevent_4core_5event_2cancel’:
  684.  
  685. gevent/core.c:3048: error: ‘EV_TIMEOUT’ undeclared (first use in this function)
  686.  
  687. gevent/core.c:3048: error: ‘EV_SIGNAL’ undeclared (first use in this function)
  688.  
  689. gevent/core.c:3048: error: ‘EV_READ’ undeclared (first use in this function)
  690.  
  691. gevent/core.c:3048: error: ‘EV_WRITE’ undeclared (first use in this function)
  692.  
  693. gevent/core.c: In function ‘__pyx_pf_6gevent_4core_10read_event___init__’:
  694.  
  695. gevent/core.c:3886: error: ‘EV_READ’ undeclared (first use in this function)
  696.  
  697. gevent/core.c:3905: error: ‘EV_PERSIST’ undeclared (first use in this function)
  698.  
  699. gevent/core.c: In function ‘__pyx_pf_6gevent_4core_11write_event___init__’:
  700.  
  701. gevent/core.c:4088: error: ‘EV_WRITE’ undeclared (first use in this function)
  702.  
  703. gevent/core.c:4107: error: ‘EV_PERSIST’ undeclared (first use in this function)
  704.  
  705. gevent/core.c: In function ‘__pyx_pf_6gevent_4core_15readwrite_event___init__’:
  706.  
  707. gevent/core.c:4302: error: ‘EV_READ’ undeclared (first use in this function)
  708.  
  709. gevent/core.c:4302: error: ‘EV_WRITE’ undeclared (first use in this function)
  710.  
  711. gevent/core.c:4321: error: ‘EV_PERSIST’ undeclared (first use in this function)
  712.  
  713. gevent/core.c: In function ‘__pyx_f_6gevent_4core___simple_handler’:
  714.  
  715. gevent/core.c:4710: error: ‘EV_READ’ undeclared (first use in this function)
  716.  
  717. gevent/core.c:4710: error: ‘EV_WRITE’ undeclared (first use in this function)
  718.  
  719. gevent/core.c:4710: error: ‘EV_SIGNAL’ undeclared (first use in this function)
  720.  
  721. gevent/core.c:4710: error: ‘EV_TIMEOUT’ undeclared (first use in this function)
  722.  
  723. gevent/core.c: In function ‘__pyx_pf_6gevent_4core_6signal___init__’:
  724.  
  725. gevent/core.c:5040: error: ‘EV_SIGNAL’ undeclared (first use in this function)
  726.  
  727. gevent/core.c:5040: error: ‘EV_PERSIST’ undeclared (first use in this function)
  728.  
  729. gevent/core.c: In function ‘__pyx_pf_6gevent_4core_12active_event___init__’:
  730.  
  731. gevent/core.c:5195: error: ‘EV_TIMEOUT’ undeclared (first use in this function)
  732.  
  733. gevent/core.c: In function ‘__pyx_pf_6gevent_4core_2loop’:
  734.  
  735. gevent/core.c:5504: error: ‘EVLOOP_ONCE’ undeclared (first use in this function)
  736.  
  737. gevent/core.c:5523: error: ‘EVLOOP_NONBLOCK’ undeclared (first use in this function)
  738.  
  739. gevent/core.c: In function ‘__pyx_pf_6gevent_4core_3get_version’:
  740.  
  741. gevent/core.c:5656: warning: passing argument 1 of ‘PyString_FromString’ makes pointer from integer without a cast
  742.  
  743. gevent/core.c: In function ‘__pyx_pf_6gevent_4core_4get_method’:
  744.  
  745. gevent/core.c:5699: warning: passing argument 1 of ‘PyString_FromString’ makes pointer from integer without a cast
  746.  
  747. gevent/core.c: In function ‘__pyx_pf_6gevent_4core_9dns_err_to_string’:
  748.  
  749. gevent/core.c:5977: warning: assignment makes pointer from integer without a cast
  750.  
  751. gevent/core.c: In function ‘__pyx_pf_6gevent_4core_6buffer_6read’:
  752.  
  753. gevent/core.c:7545: warning: cast to pointer from integer of different size
  754.  
  755. gevent/core.c: In function ‘__pyx_pf_6gevent_4core_6buffer_7readline’:
  756.  
  757. gevent/core.c:7849: warning: cast to pointer from integer of different size
  758.  
  759. gevent/core.c: In function ‘__pyx_pf_6gevent_4core_17http_request_base_6get_input_headers’:
  760.  
  761. gevent/core.c:9277: error: dereferencing pointer to incomplete type
  762.  
  763. gevent/core.c:9286: error: dereferencing pointer to incomplete type
  764.  
  765. gevent/core.c:9319: error: dereferencing pointer to incomplete type
  766.  
  767. gevent/core.c:9328: error: dereferencing pointer to incomplete type
  768.  
  769. gevent/core.c:9396: error: dereferencing pointer to incomplete type
  770.  
  771. gevent/core.c: In function ‘__pyx_pf_6gevent_4core_17http_request_base_10connection___get__’:
  772.  
  773. gevent/core.c:9477: error: dereferencing pointer to incomplete type
  774.  
  775. gevent/core.c: In function ‘__pyx_pf_6gevent_4core_17http_request_base_11remote_host___get__’:
  776.  
  777. gevent/core.c:9552: error: dereferencing pointer to incomplete type
  778.  
  779. gevent/core.c:9563: error: dereferencing pointer to incomplete type
  780.  
  781. gevent/core.c: In function ‘__pyx_pf_6gevent_4core_17http_request_base_11remote_port___get__’:
  782.  
  783. gevent/core.c:9633: error: dereferencing pointer to incomplete type
  784.  
  785. gevent/core.c: In function ‘__pyx_pf_6gevent_4core_17http_request_base_4kind___get__’:
  786.  
  787. gevent/core.c:9754: error: dereferencing pointer to incomplete type
  788.  
  789. gevent/core.c: In function ‘__pyx_pf_6gevent_4core_17http_request_base_4type___get__’:
  790.  
  791. gevent/core.c:9821: error: dereferencing pointer to incomplete type
  792.  
  793. gevent/core.c: In function ‘__pyx_pf_6gevent_4core_17http_request_base_7typestr___get__’:
  794.  
  795. gevent/core.c:9895: error: dereferencing pointer to incomplete type
  796.  
  797. gevent/core.c:9909: error: dereferencing pointer to incomplete type
  798.  
  799. gevent/core.c: In function ‘__pyx_pf_6gevent_4core_17http_request_base_3uri___get__’:
  800.  
  801. gevent/core.c:9991: error: dereferencing pointer to incomplete type
  802.  
  803. gevent/core.c:10002: error: dereferencing pointer to incomplete type
  804.  
  805. gevent/core.c: In function ‘__pyx_pf_6gevent_4core_17http_request_base_5major___get__’:
  806.  
  807. gevent/core.c:10072: error: dereferencing pointer to incomplete type
  808.  
  809. gevent/core.c: In function ‘__pyx_pf_6gevent_4core_17http_request_base_5minor___get__’:
  810.  
  811. gevent/core.c:10139: error: dereferencing pointer to incomplete type
  812.  
  813. gevent/core.c: In function ‘__pyx_pf_6gevent_4core_17http_request_base_7version___get__’:
  814.  
  815. gevent/core.c:10208: error: dereferencing pointer to incomplete type
  816.  
  817. gevent/core.c:10210: error: dereferencing pointer to incomplete type
  818.  
  819. gevent/core.c: In function ‘__pyx_pf_6gevent_4core_17http_request_base_13response_code___get__’:
  820.  
  821. gevent/core.c:10287: error: dereferencing pointer to incomplete type
  822.  
  823. gevent/core.c: In function ‘__pyx_pf_6gevent_4core_17http_request_base_18response_code_line___get__’:
  824.  
  825. gevent/core.c:10353: error: dereferencing pointer to incomplete type
  826.  
  827. gevent/core.c:10364: error: dereferencing pointer to incomplete type
  828.  
  829. gevent/core.c: In function ‘__pyx_pf_6gevent_4core_17http_request_base_7chunked___get__’:
  830.  
  831. gevent/core.c:10488: error: dereferencing pointer to incomplete type
  832.  
  833. gevent/core.c: In function ‘__pyx_pf_6gevent_4core_17http_request_base_12input_buffer___get__’:
  834.  
  835. gevent/core.c:10580: error: dereferencing pointer to incomplete type
  836.  
  837. gevent/core.c: In function ‘__pyx_pf_6gevent_4core_17http_request_base_13output_buffer___get__’:
  838.  
  839. gevent/core.c:10695: error: dereferencing pointer to incomplete type
  840.  
  841. gevent/core.c: In function ‘__pyx_pf_6gevent_4core_17http_request_base_7find_input_header’:
  842.  
  843. gevent/core.c:10795: error: dereferencing pointer to incomplete type
  844.  
  845. gevent/core.c:10795: warning: assignment makes pointer from integer without a cast
  846.  
  847. gevent/core.c: In function ‘__pyx_pf_6gevent_4core_17http_request_base_8find_output_header’:
  848.  
  849. gevent/core.c:10895: error: dereferencing pointer to incomplete type
  850.  
  851. gevent/core.c:10895: warning: assignment makes pointer from integer without a cast
  852.  
  853. gevent/core.c: In function ‘__pyx_pf_6gevent_4core_17http_request_base_9add_input_header’:
  854.  
  855. gevent/core.c:11028: error: dereferencing pointer to incomplete type
  856.  
  857. gevent/core.c: In function ‘__pyx_pf_6gevent_4core_17http_request_base_10add_output_header’:
  858.  
  859. gevent/core.c:11151: error: dereferencing pointer to incomplete type
  860.  
  861. gevent/core.c: In function ‘__pyx_pf_6gevent_4core_17http_request_base_11remove_input_header’:
  862.  
  863. gevent/core.c:11242: error: dereferencing pointer to incomplete type
  864.  
  865. gevent/core.c: In function ‘__pyx_pf_6gevent_4core_17http_request_base_12remove_output_header’:
  866.  
  867. gevent/core.c:11325: error: dereferencing pointer to incomplete type
  868.  
  869. gevent/core.c: In function ‘__pyx_pf_6gevent_4core_17http_request_base_13clear_input_headers’:
  870.  
  871. gevent/core.c:11396: error: dereferencing pointer to incomplete type
  872.  
  873. gevent/core.c: In function ‘__pyx_pf_6gevent_4core_17http_request_base_14clear_output_headers’:
  874.  
  875. gevent/core.c:11458: error: dereferencing pointer to incomplete type
  876.  
  877. gevent/core.c: In function ‘__pyx_pf_6gevent_4core_12http_request_3send_reply’:
  878.  
  879. gevent/core.c:12091: warning: assignment makes pointer from integer without a cast
  880.  
  881. gevent/core.c: In function ‘__pyx_pf_6gevent_4core_12http_request_5send_reply_chunk’:
  882.  
  883. gevent/core.c:12388: warning: assignment makes pointer from integer without a cast
  884.  
  885. gevent/core.c: In function ‘__pyx_pf_6gevent_4core_19http_request_client___init__’:
  886.  
  887. gevent/core.c:12831: warning: assignment makes pointer from integer without a cast
  888.  
  889. gevent/core.c: In function ‘__pyx_pf_6gevent_4core_15http_connection_1new’:
  890.  
  891. gevent/core.c:13347: warning: assignment makes pointer from integer without a cast
  892.  
  893. gevent/core.c: In function ‘__pyx_pf_6gevent_4core_15http_connection_4peer___get__’:
  894.  
  895. gevent/core.c:13877: error: ‘ev_uint16_t’ undeclared (first use in this function)
  896.  
  897. gevent/core.c:13877: error: expected ‘;’ before ‘__pyx_v_port’
  898.  
  899. gevent/core.c:13928: error: ‘__pyx_v_port’ undeclared (first use in this function)
  900.  
  901. gevent/core.c: In function ‘__pyx_f_6gevent_4core__http_cb_handler’:
  902.  
  903. gevent/core.c:14846: error: dereferencing pointer to incomplete type
  904.  
  905. gevent/core.c: In function ‘__pyx_f_6gevent_4core_report_internal_error’:
  906.  
  907. gevent/core.c:15344: error: dereferencing pointer to incomplete type
  908.  
  909. gevent/core.c:15358: error: dereferencing pointer to incomplete type
  910.  
  911. gevent/core.c:15367: error: dereferencing pointer to incomplete type
  912.  
  913. gevent/core.c:15376: warning: assignment makes pointer from integer without a cast
  914.  
  915. gevent/core.c:15385: error: dereferencing pointer to incomplete type
  916.  
  917. gevent/core.c: In function ‘__pyx_pf_6gevent_4core_4http___init__’:
  918.  
  919. gevent/core.c:15559: warning: assignment makes pointer from integer without a cast
  920.  
  921. gevent/core.c: At top level:
  922.  
  923. gevent/core.c:21272: error: expected ‘)’ before ‘val’
  924.  
  925. lipo: can't figure out the architecture type of: /var/folders/s5/t94kn0p10hdgxzx9_9sprpg40000gq/T//cczk54q7.out
  926.  
  927. error: command 'gcc-4.2' failed with exit status 1
  928.  
  929. ----------------------------------------
  930. Command /Users/jacob/code/toplevel/tl_env/bin/python -c "import setuptools;__file__='/Users/jacob/code/toplevel/tl_env/build/gevent/setup.py';exec(compile(open(__file__).read().replace('\r\n', '\n'), __file__, 'exec'))" install --single-version-externally-managed --record /var/folders/s5/t94kn0p10hdgxzx9_9sprpg40000gq/T/pip-s2hPd3-record/install-record.txt --install-headers /Users/jacob/code/toplevel/tl_env/bin/../include/site/python2.7 failed with error code 1
  931.  
Advertisement
Add Comment
Please, Sign In to add comment