Want more features on Pastebin? Sign Up, it's FREE!
Guest

klamav

By: a guest on Feb 11th, 2013  |  syntax: Bash  |  size: 22.08 KB  |  views: 57  |  expires: Never
download  |  raw  |  embed  |  report abuse  |  print
Text below is selected. Please press Ctrl+C to copy to your clipboard. (⌘+C on Mac)
  1. Edit klamav PKGBUILD with $EDITOR? [Y/n] n
  2. ==> Making package: klamav 0.46-5 (Mon 11 Feb 18:23:04 GMT 2013)
  3. ==> Checking runtime dependencies...
  4. ==> Checking buildtime dependencies...
  5. ==> Retrieving Sources...
  6.   -> Found klamav-0.46-source.tar.gz
  7. ==> Validating source files with sha1sums...
  8.     klamav-0.46-source.tar.gz ... Passed
  9. ==> Extracting Sources...
  10.   -> Extracting klamav-0.46-source.tar.gz with bsdtar
  11. ==> Removing existing pkg/ directory...
  12. ==> Entering fakeroot environment...
  13. ==> Starting build()...
  14. checking build system type... x86_64-unknown-linux-gnu
  15. checking host system type... x86_64-unknown-linux-gnu
  16. checking target system type... x86_64-unknown-linux-gnu
  17. checking for a BSD-compatible install... /usr/bin/install -c
  18. checking for -p flag to install... yes
  19. checking whether build environment is sane... yes
  20. checking for gawk... gawk
  21. checking whether make sets $(MAKE)... yes
  22. checking for kde-config... /opt/kde/bin/kde-config
  23. checking where to install... /opt/kde (as requested)
  24. checking for style of include used by make... GNU
  25. checking for gcc... gcc
  26. checking for C compiler default output file name... a.out
  27. checking whether the C compiler works... yes
  28. checking whether we are cross compiling... no
  29. checking for suffix of executables...
  30. checking for suffix of object files... o
  31. checking whether we are using the GNU C compiler... yes
  32. checking whether gcc accepts -g... yes
  33. checking for gcc option to accept ISO C89... none needed
  34. checking dependency style of gcc... gcc3
  35. checking how to run the C preprocessor... gcc -E
  36. checking for g++... g++
  37. checking whether we are using the GNU C++ compiler... yes
  38. checking whether g++ accepts -g... yes
  39. checking dependency style of g++... gcc3
  40. checking whether gcc is blacklisted... no
  41. checking whether g++ supports -Wmissing-format-attribute... yes
  42. checking whether g++ supports -Wundef... yes
  43. checking whether g++ supports -Wno-long-long... yes
  44. checking whether g++ supports -Wno-non-virtual-dtor... yes
  45. checking whether g++ supports -fno-reorder-blocks... yes
  46. checking whether g++ supports -fno-exceptions... yes
  47. checking whether g++ supports -fno-check-new... yes
  48. checking whether g++ supports -fno-common... yes
  49. checking whether g++ supports -fexceptions... yes
  50. checking whether system headers can cope with -O2 -fno-inline... irrelevant
  51. checking how to run the C++ preprocessor... g++ -E
  52. checking whether g++ supports -O0... yes
  53. checking whether g++ supports -Wl,--no-undefined... yes
  54. checking whether g++ supports -Wl,--allow-shlib-undefined... yes
  55. not using lib directory suffix
  56. checking for a sed that does not truncate output... /usr/bin/sed
  57. checking for grep that handles long lines and -e... /usr/bin/grep
  58. checking for egrep... /usr/bin/grep -E
  59. checking for ld used by gcc... /usr/bin/ld
  60. checking if the linker (/usr/bin/ld) is GNU ld... yes
  61. checking for /usr/bin/ld option to reload object files... -r
  62. checking for BSD-compatible nm... /usr/bin/nm -B
  63. checking whether ln -s works... yes
  64. checking how to recognise dependent libraries... pass_all
  65. checking for ANSI C header files... yes
  66. checking for sys/types.h... yes
  67. checking for sys/stat.h... yes
  68. checking for stdlib.h... yes
  69. checking for string.h... yes
  70. checking for memory.h... yes
  71. checking for strings.h... yes
  72. checking for inttypes.h... yes
  73. checking for stdint.h... yes
  74. checking for unistd.h... yes
  75. checking dlfcn.h usability... yes
  76. checking dlfcn.h presence... yes
  77. checking for dlfcn.h... yes
  78. checking for g77... no
  79. checking for xlf... no
  80. checking for f77... no
  81. checking for frt... no
  82. checking for pgf77... no
  83. checking for cf77... no
  84. checking for fort77... no
  85. checking for fl32... no
  86. checking for af77... no
  87. checking for xlf90... no
  88. checking for f90... no
  89. checking for pgf90... no
  90. checking for pghpf... no
  91. checking for epcf90... no
  92. checking for gfortran... no
  93. checking for g95... no
  94. checking for xlf95... no
  95. checking for f95... no
  96. checking for fort... no
  97. checking for ifort... no
  98. checking for ifc... no
  99. checking for efc... no
  100. checking for pgf95... no
  101. checking for lf95... no
  102. checking for ftn... no
  103. checking whether we are using the GNU Fortran 77 compiler... no
  104. checking whether  accepts -g... no
  105. checking the maximum length of command line arguments... 32768
  106. checking command to parse /usr/bin/nm -B output from gcc object... ok
  107. checking for objdir... .libs
  108. checking for ar... ar
  109. checking for ranlib... ranlib
  110. checking for strip... strip
  111. checking if gcc static flag  works... yes
  112. checking if gcc supports -fno-rtti -fno-exceptions... no
  113. checking for gcc option to produce PIC... -fPIC
  114. checking if gcc PIC flag -fPIC works... yes
  115. checking if gcc supports -c -o file.o... yes
  116. checking whether the gcc linker (/usr/bin/ld -m elf_x86_64) supports shared libraries... yes
  117. checking whether -lc should be explicitly linked in... no
  118. checking dynamic linker characteristics... GNU/Linux ld.so
  119. checking how to hardcode library paths into programs... immediate
  120. checking whether stripping libraries is possible... yes
  121. checking for shl_load... no
  122. checking for shl_load in -ldld... no
  123. checking for dlopen... no
  124. checking for dlopen in -ldl... yes
  125. checking whether a program can dlopen itself... yes
  126. checking whether a statically linked program can dlopen itself... yes
  127. checking if libtool supports shared libraries... yes
  128. checking whether to build shared libraries... yes
  129. checking whether to build static libraries... no
  130. configure: creating libtool
  131. appending configuration tag "CXX" to libtool
  132. checking for ld used by g++... /usr/bin/ld -m elf_x86_64
  133. checking if the linker (/usr/bin/ld -m elf_x86_64) is GNU ld... yes
  134. checking whether the g++ linker (/usr/bin/ld -m elf_x86_64) supports shared libraries... yes
  135. checking for g++ option to produce PIC... -fPIC
  136. checking if g++ PIC flag -fPIC works... yes
  137. checking if g++ supports -c -o file.o... yes
  138. checking whether the g++ linker (/usr/bin/ld -m elf_x86_64) supports shared libraries... yes
  139. checking dynamic linker characteristics... GNU/Linux ld.so
  140. checking how to hardcode library paths into programs... immediate
  141. checking whether stripping libraries is possible... yes
  142. checking for shl_load... (cached) no
  143. checking for shl_load in -ldld... (cached) no
  144. checking for dlopen... (cached) no
  145. checking for dlopen in -ldl... (cached) yes
  146. checking whether a program can dlopen itself... (cached) yes
  147. checking whether a statically linked program can dlopen itself... (cached) yes
  148. appending configuration tag "F77" to libtool
  149. checking for msgfmt... /usr/bin/msgfmt
  150. checking for gmsgfmt... /usr/bin/msgfmt
  151. checking for xgettext... /usr/bin/xgettext
  152. checking if C++ programs can be compiled... yes
  153. checking for strlcat... no
  154. checking if strlcat needs custom prototype... yes - in libkdefakes
  155. checking for strlcpy... no
  156. checking if strlcpy needs custom prototype... yes - in libkdefakes
  157. checking for main in -lutil... yes
  158. checking for main in -lcompat... no
  159. checking for crypt in -lcrypt... yes
  160. checking for socklen_t... yes
  161. checking for dnet_ntoa in -ldnet... no
  162. checking for dnet_ntoa in -ldnet_stub... no
  163. checking for inet_ntoa... yes
  164. checking for connect... yes
  165. checking for remove... yes
  166. checking for shmat... yes
  167. checking for sys/types.h... (cached) yes
  168. checking for stdint.h... (cached) yes
  169. checking sys/bitypes.h usability... yes
  170. checking sys/bitypes.h presence... yes
  171. checking for sys/bitypes.h... yes
  172. checking for poll in -lpoll... no
  173. checking Carbon/Carbon.h usability... no
  174. checking Carbon/Carbon.h presence... no
  175. checking for Carbon/Carbon.h... no
  176. checking CoreAudio/CoreAudio.h usability... no
  177. checking CoreAudio/CoreAudio.h presence... no
  178. checking for CoreAudio/CoreAudio.h... no
  179. checking if res_init needs -lresolv... yes
  180. checking for res_init... yes
  181. checking if res_init needs custom prototype... no
  182. checking for killpg in -lucb... no
  183. checking for int... yes
  184. checking size of int... 4
  185. checking for short... yes
  186. checking size of short... 2
  187. checking for long... yes
  188. checking size of long... 8
  189. checking for char *... yes
  190. checking size of char *... 8
  191. checking for dlopen in -ldl... (cached) yes
  192. checking for shl_unload in -ldld... no
  193. checking for size_t... yes
  194. checking size of size_t... 8
  195. checking for unsigned long... yes
  196. checking size of unsigned long... 8
  197. checking sizeof size_t == sizeof unsigned long... yes
  198. checking for PIE support... yes
  199. checking if enabling -pie/fPIE support... yes
  200. checking crt_externs.h usability... no
  201. checking crt_externs.h presence... no
  202. checking for crt_externs.h... no
  203. checking for _NSGetEnviron... no
  204. checking for vsnprintf... yes
  205. checking for snprintf... yes
  206. checking for X... libraries /usr/lib, headers .
  207. checking for IceConnectionNumber in -lICE... yes
  208. checking for libXext... yes
  209. checking for pthread_create in -lpthread... yes
  210. checking for extra includes... no
  211. checking for extra libs... no
  212. checking for libz... -lz
  213. checking for libpng... -lpng -lz -lm
  214. checking for libjpeg6b... no
  215. checking for libjpeg... -ljpeg
  216. checking for perl... /usr/bin/perl
  217. checking for Qt... libraries /opt/qt/lib, headers /opt/qt/include using -mt
  218. checking for moc... /opt/qt/bin/moc
  219. checking for uic... /opt/qt/bin/uic
  220. checking whether uic supports -L ... yes
  221. checking whether uic supports -nounload ... yes
  222. checking if Qt needs -ljpeg... no
  223. checking for rpath... yes
  224. checking for KDE... libraries /opt/kde/lib, headers /opt/kde/include
  225. checking if UIC has KDE plugins available... yes
  226. checking for KDE paths... defaults
  227. checking for dcopidl... /opt/kde/bin/dcopidl
  228. checking for dcopidl2cpp... /opt/kde/bin/dcopidl2cpp
  229. checking for meinproc... /opt/kde/bin/meinproc
  230. checking for kconfig_compiler... /opt/kde/bin/kconfig_compiler
  231. checking for dcopidlng... /opt/kde/bin/dcopidlng
  232. checking for makekdewidgets... /opt/kde/bin/makekdewidgets
  233. checking for xmllint... /usr/bin/xmllint
  234. checking whether byte ordering is bigendian... no
  235. checking for MAXPATHLEN... 4096
  236. checking for pkg-config... yes
  237. checking for int... (cached) yes
  238. checking size of int... (cached) 4
  239. checking for short... (cached) yes
  240. checking size of short... (cached) 2
  241. checking for long... (cached) yes
  242. checking size of long... (cached) 8
  243. checking for char *... (cached) yes
  244. checking size of char *... (cached) 8
  245. checking for KDE version... KDE 3.5.x (x >=2) or SVN trunk
  246. checking for cl_scanfile in -lclamav... yes
  247. checking for cl_free in -lclamav... no
  248. checking whether to use disable-updates (build KlamAV with GUI updates disabled )... no
  249. checking if doc should be compiled... yes
  250. checking if po should be compiled... yes
  251. checking if src should be compiled... yes
  252. configure: creating ./config.status
  253. wrong input (flag != 4) at admin/conf.change.pl line 117, <> line 1263.
  254. config.status: creating Makefile
  255. config.status: creating doc/Makefile
  256. config.status: creating doc/en/Makefile
  257. config.status: creating po/Makefile
  258. config.status: creating src/Makefile
  259. config.status: creating src/about/Makefile
  260. config.status: creating src/action/Makefile
  261. config.status: creating src/arkollon/Makefile
  262. config.status: creating src/icons/Makefile
  263. config.status: creating src/klammail/Makefile
  264. config.status: creating src/sqlite/Makefile
  265. config.status: creating config.h
  266. config.status: config.h is unchanged
  267. config.status: executing depfiles commands
  268.  
  269. Good - your configure finished. Start make now
  270.  
  271. make  all-recursive
  272. make[1]: Entering directory `/tmp/packerbuild-1000/klamav/klamav/src/klamav-0.46-source/klamav-0.46'
  273. Making all in doc
  274. make[2]: Entering directory `/tmp/packerbuild-1000/klamav/klamav/src/klamav-0.46-source/klamav-0.46/doc'
  275. Making all in .
  276. make[3]: Entering directory `/tmp/packerbuild-1000/klamav/klamav/src/klamav-0.46-source/klamav-0.46/doc'
  277. make[3]: Nothing to be done for `all-am'.
  278. make[3]: Leaving directory `/tmp/packerbuild-1000/klamav/klamav/src/klamav-0.46-source/klamav-0.46/doc'
  279. Making all in en
  280. make[3]: Entering directory `/tmp/packerbuild-1000/klamav/klamav/src/klamav-0.46-source/klamav-0.46/doc/en'
  281. make[3]: Nothing to be done for `all'.
  282. make[3]: Leaving directory `/tmp/packerbuild-1000/klamav/klamav/src/klamav-0.46-source/klamav-0.46/doc/en'
  283. make[2]: Leaving directory `/tmp/packerbuild-1000/klamav/klamav/src/klamav-0.46-source/klamav-0.46/doc'
  284. Making all in po
  285. make[2]: Entering directory `/tmp/packerbuild-1000/klamav/klamav/src/klamav-0.46-source/klamav-0.46/po'
  286. make[2]: Nothing to be done for `all'.
  287. make[2]: Leaving directory `/tmp/packerbuild-1000/klamav/klamav/src/klamav-0.46-source/klamav-0.46/po'
  288. Making all in src
  289. make[2]: Entering directory `/tmp/packerbuild-1000/klamav/klamav/src/klamav-0.46-source/klamav-0.46/src'
  290. Making all in icons
  291. make[3]: Entering directory `/tmp/packerbuild-1000/klamav/klamav/src/klamav-0.46-source/klamav-0.46/src/icons'
  292. make[3]: Nothing to be done for `all'.
  293. make[3]: Leaving directory `/tmp/packerbuild-1000/klamav/klamav/src/klamav-0.46-source/klamav-0.46/src/icons'
  294. Making all in about
  295. make[3]: Entering directory `/tmp/packerbuild-1000/klamav/klamav/src/klamav-0.46-source/klamav-0.46/src/about'
  296. make[3]: Nothing to be done for `all'.
  297. make[3]: Leaving directory `/tmp/packerbuild-1000/klamav/klamav/src/klamav-0.46-source/klamav-0.46/src/about'
  298. Making all in action
  299. make[3]: Entering directory `/tmp/packerbuild-1000/klamav/klamav/src/klamav-0.46-source/klamav-0.46/src/action'
  300. make[3]: Nothing to be done for `all'.
  301. make[3]: Leaving directory `/tmp/packerbuild-1000/klamav/klamav/src/klamav-0.46-source/klamav-0.46/src/action'
  302. Making all in arkollon
  303. make[3]: Entering directory `/tmp/packerbuild-1000/klamav/klamav/src/klamav-0.46-source/klamav-0.46/src/arkollon'
  304. make[3]: Nothing to be done for `all'.
  305. make[3]: Leaving directory `/tmp/packerbuild-1000/klamav/klamav/src/klamav-0.46-source/klamav-0.46/src/arkollon'
  306. Making all in sqlite
  307. make[3]: Entering directory `/tmp/packerbuild-1000/klamav/klamav/src/klamav-0.46-source/klamav-0.46/src/sqlite'
  308. make[3]: Nothing to be done for `all'.
  309. make[3]: Leaving directory `/tmp/packerbuild-1000/klamav/klamav/src/klamav-0.46-source/klamav-0.46/src/sqlite'
  310. Making all in klammail
  311. make[3]: Entering directory `/tmp/packerbuild-1000/klamav/klamav/src/klamav-0.46-source/klamav-0.46/src/klammail'
  312. make[3]: Nothing to be done for `all'.
  313. make[3]: Leaving directory `/tmp/packerbuild-1000/klamav/klamav/src/klamav-0.46-source/klamav-0.46/src/klammail'
  314. Making all in .
  315. make[3]: Entering directory `/tmp/packerbuild-1000/klamav/klamav/src/klamav-0.46-source/klamav-0.46/src'
  316. if g++ -DHAVE_CONFIG_H -I. -I. -I.. -I/opt/kde/include -I/opt/qt/include -I.   -DQT_THREAD_SUPPORT  -D_REENTRANT  -Wno-long-long -Wundef -ansi -D_XOPEN_SOURCE=500 -D_BSD_SOURCE -Wcast-align -Wconversion -Wchar-subscripts -Wall -W -Wpointer-arith -O2 -march=x86-64 -mtune=generic -O2 -pipe -fstack-protector --param=ssp-buffer-size=4 -D_FORTIFY_SOURCE=2 -Wformat-security -Wmissing-format-attribute -Wno-non-virtual-dtor -fno-exceptions -fno-check-new -fno-common  -MT dbviewer.o -MD -MP -MF ".deps/dbviewer.Tpo" -c -o dbviewer.o dbviewer.cpp; \
  317. then mv -f ".deps/dbviewer.Tpo" ".deps/dbviewer.Po"; else rm -f ".deps/dbviewer.Tpo"; exit 1; fi
  318. In file included from /opt/qt/include/qvariant.h:45:0,
  319.                  from dbviewer.h:13,
  320.                  from dbviewer.cpp:9:
  321. /opt/qt/include/qstring.h: In member function ‘char QChar::latin1() const’:
  322. /opt/qt/include/qstring.h:197:58: warning: conversion to ‘char’ from ‘int’ may alter its value [-Wconversion]
  323. /opt/qt/include/qstring.h: In member function ‘void QChar::setCell(uchar)’:
  324. /opt/qt/include/qstring.h:222:57: warning: conversion to ‘ushort {aka short unsigned int}’ from ‘int’ may alter its value [-Wconversion]
  325. /opt/qt/include/qstring.h: In member function ‘void QChar::setRow(uchar)’:
  326. /opt/qt/include/qstring.h:223:69: warning: conversion to ‘ushort {aka short unsigned int}’ from ‘int’ may alter its value [-Wconversion]
  327. /opt/qt/include/qstring.h: In constructor ‘QChar::QChar(uchar, uchar)’:
  328. /opt/qt/include/qstring.h:267:61: warning: conversion to ‘ushort {aka short unsigned int}’ from ‘int’ may alter its value [-Wconversion]
  329. /opt/qt/include/qstring.h: In constructor ‘QStringData::QStringData(QChar*, uint, uint)’:
  330. /opt/qt/include/qstring.h:365:94: warning: conversion to ‘unsigned int:30’ from ‘uint {aka unsigned int}’ may alter its value [-Wconversion]
  331. /opt/qt/include/qstring.h:365:94: warning: conversion to ‘unsigned int:30’ from ‘uint {aka unsigned int}’ may alter its value [-Wconversion]
  332. In file included from /opt/qt/include/qobject.h:48:0,
  333.                  from /opt/qt/include/qwidget.h:46,
  334.                  from /opt/qt/include/qdialog.h:45,
  335.                  from dbviewer.h:14,
  336.                  from dbviewer.cpp:9:
  337. /opt/qt/include/qevent.h: In constructor ‘QContextMenuEvent::QContextMenuEvent(QContextMenuEvent::Reason, const QPoint&, const QPoint&, int)’:
  338. /opt/qt/include/qevent.h:432:33: warning: conversion to ‘unsigned char’ from ‘uint {aka unsigned int}’ may alter its value [-Wconversion]
  339. /opt/qt/include/qevent.h: In member function ‘void QDropEvent::setAction(QDropEvent::Action)’:
  340. /opt/qt/include/qevent.h:523:46: warning: conversion to ‘unsigned char’ from ‘uint {aka unsigned int}’ may alter its value [-Wconversion]
  341. In file included from /opt/qt/include/qwidget.h:52:0,
  342.                  from /opt/qt/include/qdialog.h:45,
  343.                  from dbviewer.h:14,
  344.                  from dbviewer.cpp:9:
  345. /opt/qt/include/qsizepolicy.h: In member function ‘void QSizePolicy::transpose()’:
  346. /opt/qt/include/qsizepolicy.h:124:59: warning: conversion to ‘uchar {aka unsigned char}’ from ‘uint {aka unsigned int}’ may alter its value [-Wconversion]
  347. /opt/qt/include/qsizepolicy.h:124:73: warning: conversion to ‘uchar {aka unsigned char}’ from ‘uint {aka unsigned int}’ may alter its value [-Wconversion]
  348. In file included from /opt/kde/include/klistbox.h:21:0,
  349.                  from /opt/kde/include/kjanuswidget.h:27,
  350.                  from /opt/kde/include/kdialogbase.h:27,
  351.                  from /opt/kde/include/kfinddialog.h:24,
  352.                  from /opt/kde/include/khtml_part.h:35,
  353.                  from viewer.h:11,
  354.                  from pageviewer.h:17,
  355.                  from dbviewer.cpp:12:
  356. /opt/qt/include/qlistbox.h: In member function ‘int QListBox::cellWidth() const’:
  357. /opt/qt/include/qlistbox.h:194:49: warning: conversion to ‘int’ from ‘long int’ may alter its value [-Wconversion]
  358. /opt/qt/include/qlistbox.h: In member function ‘int QListBox::cellWidth(int) const’:
  359. /opt/qt/include/qlistbox.h:195:82: warning: conversion to ‘int’ from ‘long int’ may alter its value [-Wconversion]
  360. In file included from /opt/kde/include/kservicetype.h:24:0,
  361.                  from /opt/kde/include/kmimetype.h:33,
  362.                  from /opt/kde/include/kfileitem.h:30,
  363.                  from /opt/kde/include/kdirlister.h:24,
  364.                  from freshklam.h:14,
  365.                  from dbviewer.cpp:14:
  366. /opt/kde/include/ksycocaentry.h: In member function ‘virtual void KSycocaEntry::save(QDataStream&)’:
  367. /opt/kde/include/ksycocaentry.h:104:33: warning: conversion to ‘int’ from ‘QIODevice::Offset {aka long unsigned int}’ may alter its value [-Wconversion]
  368. In file included from /opt/kde/include/kfileitem.h:31:0,
  369.                  from /opt/kde/include/kdirlister.h:24,
  370.                  from freshklam.h:14,
  371.                  from dbviewer.cpp:14:
  372. /opt/kde/include/kfilemetainfo.h: At global scope:
  373. /opt/kde/include/kfilemetainfo.h:1237:34: warning: type qualifiers ignored on function return type [-Wignored-qualifiers]
  374. dbviewer.cpp: In member function ‘int KlamDB::listdb(const char*)’:
  375. dbviewer.cpp:228:49: warning: conversion to ‘int’ from ‘size_t {aka long unsigned int}’ may alter its value [-Wconversion]
  376. dbviewer.cpp: In function ‘int cli_untgz(int, const char*)’:
  377. dbviewer.cpp:447:48: error: cannot convert ‘gzFile_s**’ to ‘gzFile’ for argument ‘1’ to ‘int gzread(gzFile, voidp, unsigned int)
  378. dbviewer.cpp:455:23: error: cannot convert ‘gzFile_s**’ to ‘gzFile’ for argument ‘1’ to ‘int gzclose(gzFile)
  379. dbviewer.cpp:478:31: error: cannot convert ‘gzFile_s**’ to ‘gzFile’ for argument ‘1’ to ‘int gzclose(gzFile)
  380. dbviewer.cpp:483:31: error: cannot convert ‘gzFile_s**’ to ‘gzFile’ for argument ‘1’ to ‘int gzclose(gzFile)
  381. dbviewer.cpp:493:31: error: cannot convert ‘gzFile_s**’ to ‘gzFile’ for argument ‘1’ to ‘int gzclose(gzFile)
  382. dbviewer.cpp:502:27: error: cannot convert ‘gzFile_s**’ to ‘gzFile’ for argument ‘1’ to ‘int gzclose(gzFile)
  383. dbviewer.cpp:512:27: error: cannot convert ‘gzFile_s**’ to ‘gzFile’ for argument ‘1’ to ‘int gzclose(gzFile)
  384. dbviewer.cpp:519:52: warning: conversion to ‘int’ from ‘size_t {aka long unsigned int}’ may alter its value [-Wconversion]
  385. dbviewer.cpp:524:27: error: cannot convert ‘gzFile_s**’ to ‘gzFile’ for argument ‘1’ to ‘int gzclose(gzFile)
  386. dbviewer.cpp:537:19: error: cannot convert ‘gzFile_s**’ to ‘gzFile’ for argument ‘1’ to ‘int gzclose(gzFile)
  387. dbviewer.cpp: In function ‘int cli_strbcasestr(const char*, const char*)’:
  388. dbviewer.cpp:614:24: warning: conversion to ‘int’ from ‘size_t {aka long unsigned int}’ may alter its value [-Wconversion]
  389. dbviewer.cpp:615:22: warning: conversion to ‘int’ from ‘size_t {aka long unsigned int}’ may alter its value [-Wconversion]
  390. dbviewer.cpp: In function ‘int cli_chomp(char*)’:
  391. dbviewer.cpp:637:23: warning: conversion to ‘int’ from ‘size_t {aka long unsigned int}’ may alter its value [-Wconversion]
  392. dbviewer.cpp: In member function ‘int KlamDB::listdb(const char*)’:
  393. dbviewer.cpp:190:26: warning: ignoring return value of ‘char* fgets(char*, int, FILE*)’, declared with attribute warn_unused_result [-Wunused-result]
  394. make[3]: *** [dbviewer.o] Error 1
  395. make[3]: Leaving directory `/tmp/packerbuild-1000/klamav/klamav/src/klamav-0.46-source/klamav-0.46/src'
  396. make[2]: *** [all-recursive] Error 1
  397. make[2]: Leaving directory `/tmp/packerbuild-1000/klamav/klamav/src/klamav-0.46-source/klamav-0.46/src'
  398. make[1]: *** [all-recursive] Error 1
  399. make[1]: Leaving directory `/tmp/packerbuild-1000/klamav/klamav/src/klamav-0.46-source/klamav-0.46'
  400. make: *** [all] Error 2
  401. ==> ERROR: A failure occurred in build().
  402.    Aborting...
  403. The build failed.
clone this paste RAW Paste Data