Want more features on Pastebin? Sign Up, it's FREE!
Guest

Untitled

By: a guest on Jan 17th, 2012  |  syntax: None  |  size: 159.20 KB  |  views: 174  |  expires: Never
download  |  raw  |  embed  |  report abuse  |  print
Text below is selected. Please press Ctrl+C to copy to your clipboard. (⌘+C on Mac)
  1.  
  2.  
  3.  
  4.  
  5.  
  6. [root@rt ~]# perl -MCPAN -e shell
  7. Terminal does not support AddHistory.
  8.  
  9. cpan shell -- CPAN exploration and modules installation (v1.9800)
  10. Enter 'h' for help.
  11.  
  12. cpan[1]> install IO::Uncompress::Gunzip
  13. Reading '/root/.cpan/Metadata'
  14.   Database was generated on Tue, 17 Jan 2012 10:10:29 GMT
  15. Running install for module 'IO::Uncompress::Gunzip'
  16. Running make for P/PM/PMQS/IO-Compress-2.046.tar.gz
  17. Checksum for /root/.cpan/sources/authors/id/P/PM/PMQS/IO-Compress-2.046.tar.gz ok
  18. Scanning cache /root/.cpan/build for sizes
  19. ............................................................................DONE
  20.  
  21.   CPAN.pm: Building P/PM/PMQS/IO-Compress-2.046.tar.gz
  22.  
  23. Up/Downgrade not needed.
  24. Checking if your kit is complete...
  25. Looks good
  26. Warning: prerequisite Compress::Raw::Bzip2 2.045 not found.
  27. Warning: prerequisite Compress::Raw::Zlib 2.045 not found.
  28. JSON::PP 2.27103 is not available
  29.  at /usr/lib/perl5/5.8.8/CPAN/Meta/Converter.pm line 22
  30.  at /usr/lib/perl5/5.8.8/ExtUtils/MM_Any.pm line 767
  31. Writing Makefile for IO::Compress
  32. Writing MYMETA.yml and MYMETA.json
  33. ---- Unsatisfied dependencies detected during ----
  34. ----       PMQS/IO-Compress-2.046.tar.gz      ----
  35.     Compress::Raw::Bzip2 [requires]
  36.     Compress::Raw::Zlib [requires]
  37. Shall I follow them and prepend them to the queue
  38. of modules we are processing right now? [yes]
  39. Running make test
  40.   Delayed until after prerequisites
  41. Running make install
  42.   Delayed until after prerequisites
  43. Running install for module 'Compress::Raw::Bzip2'
  44. Running make for P/PM/PMQS/Compress-Raw-Bzip2-2.045.tar.gz
  45. Checksum for /root/.cpan/sources/authors/id/P/PM/PMQS/Compress-Raw-Bzip2-2.045.tar.gz ok
  46.  
  47.   CPAN.pm: Building P/PM/PMQS/Compress-Raw-Bzip2-2.045.tar.gz
  48.  
  49. Up/Downgrade not needed.
  50. Checking if your kit is complete...
  51. Looks good
  52. JSON::PP 2.27103 is not available
  53.  at /usr/lib/perl5/5.8.8/CPAN/Meta/Converter.pm line 22
  54.  at /usr/lib/perl5/5.8.8/ExtUtils/MM_Any.pm line 767
  55. Writing Makefile for Compress::Raw::Bzip2
  56. Writing MYMETA.yml and MYMETA.json
  57. cp lib/Compress/Raw/Bzip2.pm blib/lib/Compress/Raw/Bzip2.pm
  58. AutoSplitting blib/lib/Compress/Raw/Bzip2.pm (blib/lib/auto/Compress/Raw/Bzip2)
  59. gcc -c  -I. -D_REENTRANT -D_GNU_SOURCE -fno-strict-aliasing -pipe -Wdeclaration-after-statement -I/usr/local/include -D_LARGEFILE_SOURCE -D_FILE_OFFSET_BITS=64 -I/usr/include/gdbm -O2 -g -pipe -Wall -Wp,-D_FORTIFY_SOURCE=2 -fexceptions -fstack-protector --param=ssp-buffer-size=4 -m64 -mtune=generic   -DVERSION=\"2.045\" -DXS_VERSION=\"2.045\" -fPIC "-I/usr/lib64/perl5/5.8.8/x86_64-linux-thread-multi/CORE"  -Wall -Wno-comment  -DBZ_NO_STDIO -DUSE_PPPORT_H blocksort.c
  60. /bin/sh: gcc: command not found
  61. make: *** [blocksort.o] Error 127
  62.   PMQS/Compress-Raw-Bzip2-2.045.tar.gz
  63.   /usr/bin/make -- NOT OK
  64. 'YAML' not installed, will not store persistent state
  65. Running make test
  66.   Can't test without successful make
  67. Running make install
  68.   Make had returned bad status, install seems impossible
  69. Running install for module 'Compress::Raw::Zlib'
  70. Running make for P/PM/PMQS/Compress-Raw-Zlib-2.045.tar.gz
  71. Checksum for /root/.cpan/sources/authors/id/P/PM/PMQS/Compress-Raw-Zlib-2.045.tar.gz ok
  72.  
  73.   CPAN.pm: Building P/PM/PMQS/Compress-Raw-Zlib-2.045.tar.gz
  74.  
  75. Parsing config.in...
  76. Building Zlib enabled
  77. Auto Detect Gzip OS Code..
  78. Setting Gzip OS Code to 3 [Unix/Default]
  79. Looks Good.
  80. Up/Downgrade not needed.
  81. Checking if your kit is complete...
  82. Looks good
  83. JSON::PP 2.27103 is not available
  84.  at /usr/lib/perl5/5.8.8/CPAN/Meta/Converter.pm line 22
  85.  at /usr/lib/perl5/5.8.8/ExtUtils/MM_Any.pm line 767
  86. Writing Makefile for Compress::Raw::Zlib
  87. Writing MYMETA.yml and MYMETA.json
  88. cp lib/Compress/Raw/Zlib.pm blib/lib/Compress/Raw/Zlib.pm
  89. AutoSplitting blib/lib/Compress/Raw/Zlib.pm (blib/lib/auto/Compress/Raw/Zlib)
  90. /usr/bin/perl /usr/lib/perl5/5.8.8/ExtUtils/xsubpp  -typemap /usr/lib/perl5/5.8.8/ExtUtils/typemap -typemap typemap  Zlib.xs > Zlib.xsc && mv Zlib.xsc Zlib.c
  91. gcc -c  -I./zlib-src -D_REENTRANT -D_GNU_SOURCE -fno-strict-aliasing -pipe -Wdeclaration-after-statement -I/usr/local/include -D_LARGEFILE_SOURCE -D_FILE_OFFSET_BITS=64 -I/usr/include/gdbm -O2 -g -pipe -Wall -Wp,-D_FORTIFY_SOURCE=2 -fexceptions -fstack-protector --param=ssp-buffer-size=4 -m64 -mtune=generic   -DVERSION=\"2.045\" -DXS_VERSION=\"2.045\" -fPIC "-I/usr/lib64/perl5/5.8.8/x86_64-linux-thread-multi/CORE"  -DNO_VIZ   -DGZIP_OS_CODE=3 -DUSE_PPPORT_H Zlib.c
  92. /bin/sh: gcc: command not found
  93. make: *** [Zlib.o] Error 127
  94.   PMQS/Compress-Raw-Zlib-2.045.tar.gz
  95.   /usr/bin/make -- NOT OK
  96. Running make test
  97.   Can't test without successful make
  98. Running make install
  99.   Make had returned bad status, install seems impossible
  100. Running make for P/PM/PMQS/IO-Compress-2.046.tar.gz
  101.   Has already been unwrapped into directory /root/.cpan/build/IO-Compress-2.046-IKeaEA
  102.  
  103.   CPAN.pm: Building P/PM/PMQS/IO-Compress-2.046.tar.gz
  104.  
  105. Warning: Prerequisite 'Compress::Raw::Bzip2 => 2.045' for 'PMQS/IO-Compress-2.046.tar.gz' failed when processing 'PMQS/Compress-Raw-Bzip2-2.045.tar.gz' with 'make => NO'. Continuing, but chances to succeed are limited.
  106. Warning: Prerequisite 'Compress::Raw::Zlib => 2.045' for 'PMQS/IO-Compress-2.046.tar.gz' failed when processing 'PMQS/Compress-Raw-Zlib-2.045.tar.gz' with 'make => NO'. Continuing, but chances to succeed are limited.
  107. cp lib/IO/Uncompress/Adapter/Bunzip2.pm blib/lib/IO/Uncompress/Adapter/Bunzip2.pm
  108. cp lib/IO/Uncompress/RawInflate.pm blib/lib/IO/Uncompress/RawInflate.pm
  109. cp lib/Compress/Zlib.pm blib/lib/Compress/Zlib.pm
  110. cp lib/IO/Uncompress/Inflate.pm blib/lib/IO/Uncompress/Inflate.pm
  111. cp lib/IO/Compress/Deflate.pm blib/lib/IO/Compress/Deflate.pm
  112. cp lib/IO/Compress/Adapter/Deflate.pm blib/lib/IO/Compress/Adapter/Deflate.pm
  113. cp lib/IO/Compress/Zip.pm blib/lib/IO/Compress/Zip.pm
  114. cp lib/IO/Uncompress/Adapter/Identity.pm blib/lib/IO/Uncompress/Adapter/Identity.pm
  115. cp lib/IO/Uncompress/Base.pm blib/lib/IO/Uncompress/Base.pm
  116. cp lib/IO/Compress/Gzip/Constants.pm blib/lib/IO/Compress/Gzip/Constants.pm
  117. cp lib/IO/Compress/Zlib/Extra.pm blib/lib/IO/Compress/Zlib/Extra.pm
  118. cp lib/IO/Compress/Base.pm blib/lib/IO/Compress/Base.pm
  119. cp lib/IO/Compress/Zip/Constants.pm blib/lib/IO/Compress/Zip/Constants.pm
  120. cp lib/File/GlobMapper.pm blib/lib/File/GlobMapper.pm
  121. cp lib/IO/Compress/Zlib/Constants.pm blib/lib/IO/Compress/Zlib/Constants.pm
  122. cp lib/IO/Compress/Adapter/Identity.pm blib/lib/IO/Compress/Adapter/Identity.pm
  123. cp lib/IO/Uncompress/Unzip.pm blib/lib/IO/Uncompress/Unzip.pm
  124. cp lib/IO/Uncompress/Adapter/Inflate.pm blib/lib/IO/Uncompress/Adapter/Inflate.pm
  125. cp lib/IO/Compress/Base/Common.pm blib/lib/IO/Compress/Base/Common.pm
  126. cp lib/IO/Uncompress/Bunzip2.pm blib/lib/IO/Uncompress/Bunzip2.pm
  127. cp lib/IO/Uncompress/Gunzip.pm blib/lib/IO/Uncompress/Gunzip.pm
  128. cp lib/IO/Compress/Adapter/Bzip2.pm blib/lib/IO/Compress/Adapter/Bzip2.pm
  129. cp lib/IO/Uncompress/AnyUncompress.pm blib/lib/IO/Uncompress/AnyUncompress.pm
  130. cp lib/IO/Compress/RawDeflate.pm blib/lib/IO/Compress/RawDeflate.pm
  131. cp lib/IO/Compress/FAQ.pod blib/lib/IO/Compress/FAQ.pod
  132. cp lib/IO/Uncompress/AnyInflate.pm blib/lib/IO/Uncompress/AnyInflate.pm
  133. cp lib/IO/Compress/Gzip.pm blib/lib/IO/Compress/Gzip.pm
  134. cp lib/IO/Compress/Bzip2.pm blib/lib/IO/Compress/Bzip2.pm
  135. cp bin/zipdetails blib/script/zipdetails
  136. /usr/bin/perl -MExtUtils::MY -e 'MY->fixin(shift)' -- blib/script/zipdetails
  137. Manifying blib/man1/zipdetails.1
  138. Manifying blib/man3/IO::Uncompress::RawInflate.3pm
  139. Manifying blib/man3/IO::Uncompress::Unzip.3pm
  140. Manifying blib/man3/Compress::Zlib.3pm
  141. Manifying blib/man3/IO::Uncompress::Inflate.3pm
  142. Manifying blib/man3/IO::Compress::Deflate.3pm
  143. Manifying blib/man3/IO::Uncompress::Bunzip2.3pm
  144. Manifying blib/man3/IO::Compress::Zip.3pm
  145. Manifying blib/man3/IO::Uncompress::Gunzip.3pm
  146. Manifying blib/man3/IO::Uncompress::Base.3pm
  147. Manifying blib/man3/IO::Uncompress::AnyUncompress.3pm
  148. Manifying blib/man3/IO::Compress::RawDeflate.3pm
  149. Manifying blib/man3/IO::Compress::FAQ.3pm
  150. Manifying blib/man3/IO::Compress::Base.3pm
  151. Manifying blib/man3/File::GlobMapper.3pm
  152. Manifying blib/man3/IO::Uncompress::AnyInflate.3pm
  153. Manifying blib/man3/IO::Compress::Gzip.3pm
  154. Manifying blib/man3/IO::Compress::Bzip2.3pm
  155.   PMQS/IO-Compress-2.046.tar.gz
  156.   /usr/bin/make -- OK
  157. Running make test
  158. PERL_DL_NONLAZY=1 /usr/bin/perl "-MExtUtils::Command::MM" "-e" "test_harness(0, 'blib/lib', 'blib/arch')" t/*.t
  159. t/000prereq.t ................... 1/31
  160. #     Failed test (t/000prereq.t at line 71)
  161. #     Tried to use 'Compress::Raw::Bzip2'.
  162. #     Error:  Can't locate Compress/Raw/Bzip2.pm in @INC (@INC contains: t t/compress /root/.cpan/build/IO-Compress-2.046-IKeaEA/blib/lib /root/.cpan/build/IO-Compress-2.046-IKeaEA/blib/arch /usr/lib64/perl5/site_perl/5.8.8/x86_64-linux-thread-multi /usr/lib/perl5/site_perl/5.8.8 /usr/lib/perl5/site_perl /usr/lib64/perl5/vendor_perl/5.8.8/x86_64-linux-thread-multi /usr/lib/perl5/vendor_perl/5.8.8 /usr/lib/perl5/vendor_perl /usr/lib64/perl5/5.8.8/x86_64-linux-thread-multi /usr/lib/perl5/5.8.8 .) at (eval 7) line 2.
  163. # BEGIN failed--compilation aborted at t/000prereq.t line 71.
  164.  
  165. #     Failed test (t/000prereq.t at line 71)
  166. #     Tried to use 'Compress::Raw::Zlib'.
  167. #     Error:  Can't locate Compress/Raw/Zlib.pm in @INC (@INC contains: t t/compress /root/.cpan/build/IO-Compress-2.046-IKeaEA/blib/lib /root/.cpan/build/IO-Compress-2.046-IKeaEA/blib/arch /usr/lib64/perl5/site_perl/5.8.8/x86_64-linux-thread-multi /usr/lib/perl5/site_perl/5.8.8 /usr/lib/perl5/site_perl /usr/lib64/perl5/vendor_perl/5.8.8/x86_64-linux-thread-multi /usr/lib/perl5/vendor_perl/5.8.8 /usr/lib/perl5/vendor_perl /usr/lib64/perl5/5.8.8/x86_64-linux-thread-multi /usr/lib/perl5/5.8.8 .) at (eval 8) line 2.
  168. # BEGIN failed--compilation aborted at t/000prereq.t line 71.
  169.  
  170. #     Failed test (t/000prereq.t at line 71)
  171. #     Tried to use 'Compress::Zlib'.
  172. #     Error:  Can't locate Compress/Raw/Zlib.pm in @INC (@INC contains: t t/compress /root/.cpan/build/IO-Compress-2.046-IKeaEA/blib/lib /root/.cpan/build/IO-Compress-2.046-IKeaEA/blib/arch /usr/lib64/perl5/site_perl/5.8.8/x86_64-linux-thread-multi /usr/lib/perl5/site_perl/5.8.8 /usr/lib/perl5/site_perl /usr/lib64/perl5/vendor_perl/5.8.8/x86_64-linux-thread-multi /usr/lib/perl5/vendor_perl/5.8.8 /usr/lib/perl5/vendor_perl /usr/lib64/perl5/5.8.8/x86_64-linux-thread-multi /usr/lib/perl5/5.8.8 .) at /root/.cpan/build/IO-Compress-2.046-IKeaEA/blib/lib/Compress/Zlib.pm line 11.
  173. # BEGIN failed--compilation aborted at t/000prereq.t line 71.
  174. # Compilation failed in require at (eval 9) line 2.
  175. # BEGIN failed--compilation aborted at (eval 9) line 2.
  176.  
  177. #     Failed test (t/000prereq.t at line 71)
  178. #     Tried to use 'IO::Compress::Adapter::Bzip2'.
  179. #     Error:  Can't locate Compress/Raw/Bzip2.pm in @INC (@INC contains: t t/compress /root/.cpan/build/IO-Compress-2.046-IKeaEA/blib/lib /root/.cpan/build/IO-Compress-2.046-IKeaEA/blib/arch /usr/lib64/perl5/site_perl/5.8.8/x86_64-linux-thread-multi /usr/lib/perl5/site_perl/5.8.8 /usr/lib/perl5/site_perl /usr/lib64/perl5/vendor_perl/5.8.8/x86_64-linux-thread-multi /usr/lib/perl5/vendor_perl/5.8.8 /usr/lib/perl5/vendor_perl /usr/lib64/perl5/5.8.8/x86_64-linux-thread-multi /usr/lib/perl5/5.8.8 .) at /root/.cpan/build/IO-Compress-2.046-IKeaEA/blib/lib/IO/Compress/Adapter/Bzip2.pm line 9.
  180. # BEGIN failed--compilation aborted at t/000prereq.t line 71.
  181. # Compilation failed in require at (eval 17) line 2.
  182. # BEGIN failed--compilation aborted at (eval 17) line 2.
  183.  
  184. #     Failed test (t/000prereq.t at line 71)
  185. #     Tried to use 'IO::Compress::Adapter::Deflate'.
  186. #     Error:  Can't locate Compress/Raw/Zlib.pm in @INC (@INC contains: t t/compress /root/.cpan/build/IO-Compress-2.046-IKeaEA/blib/lib /root/.cpan/build/IO-Compress-2.046-IKeaEA/blib/arch /usr/lib64/perl5/site_perl/5.8.8/x86_64-linux-thread-multi /usr/lib/perl5/site_perl/5.8.8 /usr/lib/perl5/site_perl /usr/lib64/perl5/vendor_perl/5.8.8/x86_64-linux-thread-multi /usr/lib/perl5/vendor_perl/5.8.8 /usr/lib/perl5/vendor_perl /usr/lib64/perl5/5.8.8/x86_64-linux-thread-multi /usr/lib/perl5/5.8.8 .) at /root/.cpan/build/IO-Compress-2.046-IKeaEA/blib/lib/IO/Compress/Adapter/Deflate.pm line 9.
  187. # BEGIN failed--compilation aborted at t/000prereq.t line 71.
  188. # Compilation failed in require at (eval 18) line 2.
  189. # BEGIN failed--compilation aborted at (eval 18) line 2.
  190.  
  191. #     Failed test (t/000prereq.t at line 71)
  192. #     Tried to use 'IO::Compress::Bzip2'.
  193. #     Error:  IO::Compress::Adapter::Bzip2 does not define $IO::Compress::Adapter::Bzip2::VERSION--version check failed at /root/.cpan/build/IO-Compress-2.046-IKeaEA/blib/lib/IO/Compress/Bzip2.pm line 11.
  194. # BEGIN failed--compilation aborted at t/000prereq.t line 71.
  195. # Compilation failed in require at (eval 23) line 2.
  196. # BEGIN failed--compilation aborted at (eval 23) line 2.
  197.  
  198. #     Failed test (t/000prereq.t at line 71)
  199. #     Tried to use 'IO::Compress::Deflate'.
  200. #     Error:  IO::Compress::Adapter::Deflate does not define $IO::Compress::Adapter::Deflate::VERSION--version check failed at /root/.cpan/build/IO-Compress-2.046-IKeaEA/blib/lib/IO/Compress/RawDeflate.pm line 12.
  201. # BEGIN failed--compilation aborted at t/000prereq.t line 71.
  202. # Compilation failed in require at /root/.cpan/build/IO-Compress-2.046-IKeaEA/blib/lib/IO/Compress/Deflate.pm line 9.
  203. # BEGIN failed--compilation aborted at /root/.cpan/build/IO-Compress-2.046-IKeaEA/blib/lib/IO/Compress/Deflate.pm line 9.
  204. # Compilation failed in require at (eval 24) line 2.
  205. # BEGIN failed--compilation aborted at (eval 24) line 2.
  206.  
  207. #     Failed test (t/000prereq.t at line 71)
  208. #     Tried to use 'IO::Compress::Gzip'.
  209. #     Error:  IO::Compress::RawDeflate does not define $IO::Compress::RawDeflate::VERSION--version check failed at /root/.cpan/build/IO-Compress-2.046-IKeaEA/blib/lib/IO/Compress/Gzip.pm line 11.
  210. # BEGIN failed--compilation aborted at t/000prereq.t line 71.
  211. # Compilation failed in require at (eval 26) line 2.
  212. # BEGIN failed--compilation aborted at (eval 26) line 2.
  213.  
  214. #     Failed test (t/000prereq.t at line 71)
  215. #     Tried to use 'IO::Compress::RawDeflate'.
  216. #     Error:  IO::Compress::RawDeflate does not define $IO::Compress::RawDeflate::VERSION--version check failed at (eval 27) line 2.
  217. # BEGIN failed--compilation aborted at t/000prereq.t line 71.
  218.  
  219. #     Failed test (t/000prereq.t at line 71)
  220. #     Tried to use 'IO::Compress::Zip'.
  221. #     Error:  IO::Compress::RawDeflate does not define $IO::Compress::RawDeflate::VERSION--version check failed at /root/.cpan/build/IO-Compress-2.046-IKeaEA/blib/lib/IO/Compress/Zip.pm line 8.
  222. # BEGIN failed--compilation aborted at t/000prereq.t line 71.
  223. # Compilation failed in require at (eval 29) line 2.
  224. # BEGIN failed--compilation aborted at (eval 29) line 2.
  225.  
  226. #     Failed test (t/000prereq.t at line 71)
  227. #     Tried to use 'IO::Uncompress::Adapter::Bunzip2'.
  228. #     Error:  Can't locate Compress/Raw/Bzip2.pm in @INC (@INC contains: t t/compress /root/.cpan/build/IO-Compress-2.046-IKeaEA/blib/lib /root/.cpan/build/IO-Compress-2.046-IKeaEA/blib/arch /usr/lib64/perl5/site_perl/5.8.8/x86_64-linux-thread-multi /usr/lib/perl5/site_perl/5.8.8 /usr/lib/perl5/site_perl /usr/lib64/perl5/vendor_perl/5.8.8/x86_64-linux-thread-multi /usr/lib/perl5/vendor_perl/5.8.8 /usr/lib/perl5/vendor_perl /usr/lib64/perl5/5.8.8/x86_64-linux-thread-multi /usr/lib/perl5/5.8.8 .) at /root/.cpan/build/IO-Compress-2.046-IKeaEA/blib/lib/IO/Uncompress/Adapter/Bunzip2.pm line 9.
  229. # BEGIN failed--compilation aborted at t/000prereq.t line 71.
  230. # Compilation failed in require at (eval 32) line 2.
  231. # BEGIN failed--compilation aborted at (eval 32) line 2.
  232.  
  233. #     Failed test (t/000prereq.t at line 71)
  234. #     Tried to use 'IO::Uncompress::Adapter::Identity'.
  235. #     Error:  Can't locate Compress/Raw/Zlib.pm in @INC (@INC contains: t t/compress /root/.cpan/build/IO-Compress-2.046-IKeaEA/blib/lib /root/.cpan/build/IO-Compress-2.046-IKeaEA/blib/arch /usr/lib64/perl5/site_perl/5.8.8/x86_64-linux-thread-multi /usr/lib/perl5/site_perl/5.8.8 /usr/lib/perl5/site_perl /usr/lib64/perl5/vendor_perl/5.8.8/x86_64-linux-thread-multi /usr/lib/perl5/vendor_perl/5.8.8 /usr/lib/perl5/vendor_perl /usr/lib64/perl5/5.8.8/x86_64-linux-thread-multi /usr/lib/perl5/5.8.8 .) at /root/.cpan/build/IO-Compress-2.046-IKeaEA/blib/lib/IO/Uncompress/Adapter/Identity.pm line 14.
  236. # BEGIN failed--compilation aborted at t/000prereq.t line 71.
  237. # Compilation failed in require at (eval 33) line 2.
  238. # BEGIN failed--compilation aborted at (eval 33) line 2.
  239.  
  240. #     Failed test (t/000prereq.t at line 71)
  241. #     Tried to use 'IO::Uncompress::Adapter::Inflate'.
  242. #     Error:  Can't locate Compress/Raw/Zlib.pm in @INC (@INC contains: t t/compress /root/.cpan/build/IO-Compress-2.046-IKeaEA/blib/lib /root/.cpan/build/IO-Compress-2.046-IKeaEA/blib/arch /usr/lib64/perl5/site_perl/5.8.8/x86_64-linux-thread-multi /usr/lib/perl5/site_perl/5.8.8 /usr/lib/perl5/site_perl /usr/lib64/perl5/vendor_perl/5.8.8/x86_64-linux-thread-multi /usr/lib/perl5/vendor_perl/5.8.8 /usr/lib/perl5/vendor_perl /usr/lib64/perl5/5.8.8/x86_64-linux-thread-multi /usr/lib/perl5/5.8.8 .) at /root/.cpan/build/IO-Compress-2.046-IKeaEA/blib/lib/IO/Uncompress/Adapter/Inflate.pm line 8.
  243. # BEGIN failed--compilation aborted at t/000prereq.t line 71.
  244. # Compilation failed in require at (eval 34) line 2.
  245. # BEGIN failed--compilation aborted at (eval 34) line 2.
  246.  
  247. #     Failed test (t/000prereq.t at line 71)
  248. #     Tried to use 'IO::Uncompress::AnyInflate'.
  249. #     Error:  IO::Uncompress::Adapter::Inflate does not define $IO::Uncompress::Adapter::Inflate::VERSION--version check failed at /root/.cpan/build/IO-Compress-2.046-IKeaEA/blib/lib/IO/Uncompress/AnyInflate.pm line 11.
  250. # BEGIN failed--compilation aborted at t/000prereq.t line 71.
  251. # Compilation failed in require at (eval 35) line 2.
  252. # BEGIN failed--compilation aborted at (eval 35) line 2.
  253.  
  254. #     Failed test (t/000prereq.t at line 71)
  255. #     Tried to use 'IO::Uncompress::Bunzip2'.
  256. #     Error:  IO::Uncompress::Bunzip2 does not define $IO::Uncompress::Bunzip2::VERSION--version check failed at (eval 53) line 2.
  257. # BEGIN failed--compilation aborted at t/000prereq.t line 71.
  258.  
  259. #     Failed test (t/000prereq.t at line 71)
  260. #     Tried to use 'IO::Uncompress::Gunzip'.
  261. #     Error:  IO::Uncompress::Gunzip does not define $IO::Uncompress::Gunzip::VERSION--version check failed at (eval 54) line 2.
  262. # BEGIN failed--compilation aborted at t/000prereq.t line 71.
  263.  
  264. #     Failed test (t/000prereq.t at line 71)
  265. #     Tried to use 'IO::Uncompress::Inflate'.
  266. #     Error:  IO::Uncompress::Inflate does not define $IO::Uncompress::Inflate::VERSION--version check failed at (eval 55) line 2.
  267. # BEGIN failed--compilation aborted at t/000prereq.t line 71.
  268.  
  269. #     Failed test (t/000prereq.t at line 71)
  270. #     Tried to use 'IO::Uncompress::RawInflate'.
  271. #     Error:  IO::Uncompress::RawInflate does not define $IO::Uncompress::RawInflate::VERSION--version check failed at (eval 56) line 2.
  272. # BEGIN failed--compilation aborted at t/000prereq.t line 71.
  273.  
  274. #     Failed test (t/000prereq.t at line 71)
  275. #     Tried to use 'IO::Uncompress::Unzip'.
  276. #     Error:  IO::Uncompress::Unzip does not define $IO::Uncompress::Unzip::VERSION--version check failed at (eval 57) line 2.
  277. # BEGIN failed--compilation aborted at t/000prereq.t line 71.
  278. # Looks like you failed 19 tests of 31.
  279. t/000prereq.t ................... Dubious, test returned 19 (wstat 4864, 0x1300)
  280. Failed 19/31 subtests
  281. t/001bzip2.t .................... Can't locate Compress/Raw/Bzip2.pm in @INC (@INC contains: t t/compress /root/.cpan/build/IO-Compress-2.046-IKeaEA/blib/lib /root/.cpan/build/IO-Compress-2.046-IKeaEA/blib/arch /usr/lib64/perl5/site_perl/5.8.8/x86_64-linux-thread-multi /usr/lib/perl5/site_perl/5.8.8 /usr/lib/perl5/site_perl /usr/lib64/perl5/vendor_perl/5.8.8/x86_64-linux-thread-multi /usr/lib/perl5/vendor_perl/5.8.8 /usr/lib/perl5/vendor_perl /usr/lib64/perl5/5.8.8/x86_64-linux-thread-multi /usr/lib/perl5/5.8.8 .) at /root/.cpan/build/IO-Compress-2.046-IKeaEA/blib/lib/IO/Compress/Adapter/Bzip2.pm line 9.
  282. BEGIN failed--compilation aborted at /root/.cpan/build/IO-Compress-2.046-IKeaEA/blib/lib/IO/Compress/Adapter/Bzip2.pm line 9.
  283. Compilation failed in require at /root/.cpan/build/IO-Compress-2.046-IKeaEA/blib/lib/IO/Compress/Bzip2.pm line 11.
  284. BEGIN failed--compilation aborted at /root/.cpan/build/IO-Compress-2.046-IKeaEA/blib/lib/IO/Compress/Bzip2.pm line 11.
  285. Compilation failed in require at t/001bzip2.t line 28.
  286. BEGIN failed--compilation aborted at t/001bzip2.t line 28.
  287. t/001bzip2.t .................... 1/842 # Looks like you planned 842 tests but only ran 1.
  288. # Looks like your test died just after 1.
  289. t/001bzip2.t .................... Dubious, test returned 255 (wstat 65280, 0xff00)
  290. Failed 841/842 subtests
  291. t/001zlib-generic-deflate.t ..... Can't locate Compress/Raw/Zlib.pm in @INC (@INC contains: t t/compress /root/.cpan/build/IO-Compress-2.046-IKeaEA/blib/lib /root/.cpan/build/IO-Compress-2.046-IKeaEA/blib/arch /usr/lib64/perl5/site_perl/5.8.8/x86_64-linux-thread-multi /usr/lib/perl5/site_perl/5.8.8 /usr/lib/perl5/site_perl /usr/lib64/perl5/vendor_perl/5.8.8/x86_64-linux-thread-multi /usr/lib/perl5/vendor_perl/5.8.8 /usr/lib/perl5/vendor_perl /usr/lib64/perl5/5.8.8/x86_64-linux-thread-multi /usr/lib/perl5/5.8.8 .) at /root/.cpan/build/IO-Compress-2.046-IKeaEA/blib/lib/IO/Compress/Adapter/Deflate.pm line 9.
  292. BEGIN failed--compilation aborted at /root/.cpan/build/IO-Compress-2.046-IKeaEA/blib/lib/IO/Compress/Adapter/Deflate.pm line 9.
  293. Compilation failed in require at /root/.cpan/build/IO-Compress-2.046-IKeaEA/blib/lib/IO/Compress/RawDeflate.pm line 12.
  294. BEGIN failed--compilation aborted at /root/.cpan/build/IO-Compress-2.046-IKeaEA/blib/lib/IO/Compress/RawDeflate.pm line 12.
  295. Compilation failed in require at /root/.cpan/build/IO-Compress-2.046-IKeaEA/blib/lib/IO/Compress/Deflate.pm line 9.
  296. BEGIN failed--compilation aborted at /root/.cpan/build/IO-Compress-2.046-IKeaEA/blib/lib/IO/Compress/Deflate.pm line 9.
  297. Compilation failed in require at t/001zlib-generic-deflate.t line 12.
  298. BEGIN failed--compilation aborted at t/001zlib-generic-deflate.t line 12.
  299. t/001zlib-generic-deflate.t ..... Dubious, test returned 2 (wstat 512, 0x200)
  300. No subtests run
  301. t/001zlib-generic-gzip.t ........ Can't locate Compress/Raw/Zlib.pm in @INC (@INC contains: t t/compress /root/.cpan/build/IO-Compress-2.046-IKeaEA/blib/lib /root/.cpan/build/IO-Compress-2.046-IKeaEA/blib/arch /usr/lib64/perl5/site_perl/5.8.8/x86_64-linux-thread-multi /usr/lib/perl5/site_perl/5.8.8 /usr/lib/perl5/site_perl /usr/lib64/perl5/vendor_perl/5.8.8/x86_64-linux-thread-multi /usr/lib/perl5/vendor_perl/5.8.8 /usr/lib/perl5/vendor_perl /usr/lib64/perl5/5.8.8/x86_64-linux-thread-multi /usr/lib/perl5/5.8.8 .) at /root/.cpan/build/IO-Compress-2.046-IKeaEA/blib/lib/IO/Compress/Adapter/Deflate.pm line 9.
  302. BEGIN failed--compilation aborted at /root/.cpan/build/IO-Compress-2.046-IKeaEA/blib/lib/IO/Compress/Adapter/Deflate.pm line 9.
  303. Compilation failed in require at /root/.cpan/build/IO-Compress-2.046-IKeaEA/blib/lib/IO/Compress/RawDeflate.pm line 12.
  304. BEGIN failed--compilation aborted at /root/.cpan/build/IO-Compress-2.046-IKeaEA/blib/lib/IO/Compress/RawDeflate.pm line 12.
  305. Compilation failed in require at /root/.cpan/build/IO-Compress-2.046-IKeaEA/blib/lib/IO/Compress/Gzip.pm line 11.
  306. BEGIN failed--compilation aborted at /root/.cpan/build/IO-Compress-2.046-IKeaEA/blib/lib/IO/Compress/Gzip.pm line 11.
  307. Compilation failed in require at t/001zlib-generic-gzip.t line 12.
  308. BEGIN failed--compilation aborted at t/001zlib-generic-gzip.t line 12.
  309. t/001zlib-generic-gzip.t ........ Dubious, test returned 2 (wstat 512, 0x200)
  310. No subtests run
  311. t/001zlib-generic-rawdeflate.t .. Can't locate Compress/Raw/Zlib.pm in @INC (@INC contains: t t/compress /root/.cpan/build/IO-Compress-2.046-IKeaEA/blib/lib /root/.cpan/build/IO-Compress-2.046-IKeaEA/blib/arch /usr/lib64/perl5/site_perl/5.8.8/x86_64-linux-thread-multi /usr/lib/perl5/site_perl/5.8.8 /usr/lib/perl5/site_perl /usr/lib64/perl5/vendor_perl/5.8.8/x86_64-linux-thread-multi /usr/lib/perl5/vendor_perl/5.8.8 /usr/lib/perl5/vendor_perl /usr/lib64/perl5/5.8.8/x86_64-linux-thread-multi /usr/lib/perl5/5.8.8 .) at /root/.cpan/build/IO-Compress-2.046-IKeaEA/blib/lib/IO/Compress/Adapter/Deflate.pm line 9.
  312. BEGIN failed--compilation aborted at /root/.cpan/build/IO-Compress-2.046-IKeaEA/blib/lib/IO/Compress/Adapter/Deflate.pm line 9.
  313. Compilation failed in require at /root/.cpan/build/IO-Compress-2.046-IKeaEA/blib/lib/IO/Compress/RawDeflate.pm line 12.
  314. BEGIN failed--compilation aborted at /root/.cpan/build/IO-Compress-2.046-IKeaEA/blib/lib/IO/Compress/RawDeflate.pm line 12.
  315. Compilation failed in require at t/001zlib-generic-rawdeflate.t line 12.
  316. BEGIN failed--compilation aborted at t/001zlib-generic-rawdeflate.t line 12.
  317. t/001zlib-generic-rawdeflate.t .. Dubious, test returned 2 (wstat 512, 0x200)
  318. No subtests run
  319. t/001zlib-generic-zip.t ......... Can't locate Compress/Raw/Zlib.pm in @INC (@INC contains: t t/compress /root/.cpan/build/IO-Compress-2.046-IKeaEA/blib/lib /root/.cpan/build/IO-Compress-2.046-IKeaEA/blib/arch /usr/lib64/perl5/site_perl/5.8.8/x86_64-linux-thread-multi /usr/lib/perl5/site_perl/5.8.8 /usr/lib/perl5/site_perl /usr/lib64/perl5/vendor_perl/5.8.8/x86_64-linux-thread-multi /usr/lib/perl5/vendor_perl/5.8.8 /usr/lib/perl5/vendor_perl /usr/lib64/perl5/5.8.8/x86_64-linux-thread-multi /usr/lib/perl5/5.8.8 .) at /root/.cpan/build/IO-Compress-2.046-IKeaEA/blib/lib/IO/Compress/Adapter/Deflate.pm line 9.
  320. BEGIN failed--compilation aborted at /root/.cpan/build/IO-Compress-2.046-IKeaEA/blib/lib/IO/Compress/Adapter/Deflate.pm line 9.
  321. Compilation failed in require at /root/.cpan/build/IO-Compress-2.046-IKeaEA/blib/lib/IO/Compress/RawDeflate.pm line 12.
  322. BEGIN failed--compilation aborted at /root/.cpan/build/IO-Compress-2.046-IKeaEA/blib/lib/IO/Compress/RawDeflate.pm line 12.
  323. Compilation failed in require at /root/.cpan/build/IO-Compress-2.046-IKeaEA/blib/lib/IO/Compress/Zip.pm line 8.
  324. BEGIN failed--compilation aborted at /root/.cpan/build/IO-Compress-2.046-IKeaEA/blib/lib/IO/Compress/Zip.pm line 8.
  325. Compilation failed in require at t/001zlib-generic-zip.t line 12.
  326. BEGIN failed--compilation aborted at t/001zlib-generic-zip.t line 12.
  327. t/001zlib-generic-zip.t ......... Dubious, test returned 2 (wstat 512, 0x200)
  328. No subtests run
  329. t/002any-deflate.t .............. Can't locate Compress/Raw/Zlib.pm in @INC (@INC contains: t t/compress /root/.cpan/build/IO-Compress-2.046-IKeaEA/blib/lib /root/.cpan/build/IO-Compress-2.046-IKeaEA/blib/arch /usr/lib64/perl5/site_perl/5.8.8/x86_64-linux-thread-multi /usr/lib/perl5/site_perl/5.8.8 /usr/lib/perl5/site_perl /usr/lib64/perl5/vendor_perl/5.8.8/x86_64-linux-thread-multi /usr/lib/perl5/vendor_perl/5.8.8 /usr/lib/perl5/vendor_perl /usr/lib64/perl5/5.8.8/x86_64-linux-thread-multi /usr/lib/perl5/5.8.8 .) at /root/.cpan/build/IO-Compress-2.046-IKeaEA/blib/lib/IO/Uncompress/Adapter/Inflate.pm line 8.
  330. BEGIN failed--compilation aborted at /root/.cpan/build/IO-Compress-2.046-IKeaEA/blib/lib/IO/Uncompress/Adapter/Inflate.pm line 8.
  331. Compilation failed in require at /root/.cpan/build/IO-Compress-2.046-IKeaEA/blib/lib/IO/Uncompress/AnyInflate.pm line 11.
  332. BEGIN failed--compilation aborted at /root/.cpan/build/IO-Compress-2.046-IKeaEA/blib/lib/IO/Uncompress/AnyInflate.pm line 11.
  333. Compilation failed in require at t/002any-deflate.t line 13.
  334. BEGIN failed--compilation aborted at t/002any-deflate.t line 13.
  335. t/002any-deflate.t .............. Dubious, test returned 2 (wstat 512, 0x200)
  336. No subtests run
  337. t/002any-gzip.t ................. Can't locate Compress/Raw/Zlib.pm in @INC (@INC contains: t t/compress /root/.cpan/build/IO-Compress-2.046-IKeaEA/blib/lib /root/.cpan/build/IO-Compress-2.046-IKeaEA/blib/arch /usr/lib64/perl5/site_perl/5.8.8/x86_64-linux-thread-multi /usr/lib/perl5/site_perl/5.8.8 /usr/lib/perl5/site_perl /usr/lib64/perl5/vendor_perl/5.8.8/x86_64-linux-thread-multi /usr/lib/perl5/vendor_perl/5.8.8 /usr/lib/perl5/vendor_perl /usr/lib64/perl5/5.8.8/x86_64-linux-thread-multi /usr/lib/perl5/5.8.8 .) at /root/.cpan/build/IO-Compress-2.046-IKeaEA/blib/lib/IO/Uncompress/Adapter/Inflate.pm line 8.
  338. BEGIN failed--compilation aborted at /root/.cpan/build/IO-Compress-2.046-IKeaEA/blib/lib/IO/Uncompress/Adapter/Inflate.pm line 8.
  339. Compilation failed in require at /root/.cpan/build/IO-Compress-2.046-IKeaEA/blib/lib/IO/Uncompress/AnyInflate.pm line 11.
  340. BEGIN failed--compilation aborted at /root/.cpan/build/IO-Compress-2.046-IKeaEA/blib/lib/IO/Uncompress/AnyInflate.pm line 11.
  341. Compilation failed in require at t/002any-gzip.t line 12.
  342. BEGIN failed--compilation aborted at t/002any-gzip.t line 12.
  343. t/002any-gzip.t ................. Dubious, test returned 2 (wstat 512, 0x200)
  344. No subtests run
  345. t/002any-rawdeflate.t ........... Can't locate Compress/Raw/Zlib.pm in @INC (@INC contains: t t/compress /root/.cpan/build/IO-Compress-2.046-IKeaEA/blib/lib /root/.cpan/build/IO-Compress-2.046-IKeaEA/blib/arch /usr/lib64/perl5/site_perl/5.8.8/x86_64-linux-thread-multi /usr/lib/perl5/site_perl/5.8.8 /usr/lib/perl5/site_perl /usr/lib64/perl5/vendor_perl/5.8.8/x86_64-linux-thread-multi /usr/lib/perl5/vendor_perl/5.8.8 /usr/lib/perl5/vendor_perl /usr/lib64/perl5/5.8.8/x86_64-linux-thread-multi /usr/lib/perl5/5.8.8 .) at /root/.cpan/build/IO-Compress-2.046-IKeaEA/blib/lib/IO/Uncompress/Adapter/Inflate.pm line 8.
  346. BEGIN failed--compilation aborted at /root/.cpan/build/IO-Compress-2.046-IKeaEA/blib/lib/IO/Uncompress/Adapter/Inflate.pm line 8.
  347. Compilation failed in require at /root/.cpan/build/IO-Compress-2.046-IKeaEA/blib/lib/IO/Uncompress/AnyInflate.pm line 11.
  348. BEGIN failed--compilation aborted at /root/.cpan/build/IO-Compress-2.046-IKeaEA/blib/lib/IO/Uncompress/AnyInflate.pm line 11.
  349. Compilation failed in require at t/002any-rawdeflate.t line 12.
  350. BEGIN failed--compilation aborted at t/002any-rawdeflate.t line 12.
  351. t/002any-rawdeflate.t ........... Dubious, test returned 2 (wstat 512, 0x200)
  352. No subtests run
  353. t/002any-transparent.t .......... 1/16
  354. #     Failed test (t/002any-transparent.t at line 25)
  355. #     Tried to use 'IO::Uncompress::AnyInflate'.
  356. #     Error:  IO::Uncompress::Adapter::Inflate does not define $IO::Uncompress::Adapter::Inflate::VERSION--version check failed at /root/.cpan/build/IO-Compress-2.046-IKeaEA/blib/lib/IO/Uncompress/AnyInflate.pm line 11.
  357. # BEGIN failed--compilation aborted at t/002any-transparent.t line 25.
  358. # Compilation failed in require at (eval 32) line 2.
  359. # BEGIN failed--compilation aborted at (eval 32) line 2.
  360. Can't locate object method "new" via package "IO::Uncompress::AnyInflate" at t/002any-transparent.t line 55.
  361. # Looks like you planned 16 tests but only ran 3.
  362. # Looks like your test died just after 3.
  363. t/002any-transparent.t .......... Dubious, test returned 255 (wstat 65280, 0xff00)
  364. Failed 14/16 subtests
  365. t/002any-zip.t .................. Can't locate Compress/Raw/Zlib.pm in @INC (@INC contains: t t/compress /root/.cpan/build/IO-Compress-2.046-IKeaEA/blib/lib /root/.cpan/build/IO-Compress-2.046-IKeaEA/blib/arch /usr/lib64/perl5/site_perl/5.8.8/x86_64-linux-thread-multi /usr/lib/perl5/site_perl/5.8.8 /usr/lib/perl5/site_perl /usr/lib64/perl5/vendor_perl/5.8.8/x86_64-linux-thread-multi /usr/lib/perl5/vendor_perl/5.8.8 /usr/lib/perl5/vendor_perl /usr/lib64/perl5/5.8.8/x86_64-linux-thread-multi /usr/lib/perl5/5.8.8 .) at /root/.cpan/build/IO-Compress-2.046-IKeaEA/blib/lib/IO/Uncompress/Adapter/Inflate.pm line 8.
  366. BEGIN failed--compilation aborted at /root/.cpan/build/IO-Compress-2.046-IKeaEA/blib/lib/IO/Uncompress/Adapter/Inflate.pm line 8.
  367. Compilation failed in require at /root/.cpan/build/IO-Compress-2.046-IKeaEA/blib/lib/IO/Uncompress/AnyInflate.pm line 11.
  368. BEGIN failed--compilation aborted at /root/.cpan/build/IO-Compress-2.046-IKeaEA/blib/lib/IO/Uncompress/AnyInflate.pm line 11.
  369. Compilation failed in require at t/002any-zip.t line 12.
  370. BEGIN failed--compilation aborted at t/002any-zip.t line 12.
  371. t/002any-zip.t .................. Dubious, test returned 2 (wstat 512, 0x200)
  372. No subtests run
  373. t/004gziphdr.t .................. 1/919
  374. #     Failed test (t/004gziphdr.t at line 25)
  375. #     Tried to use 'Compress::Raw::Zlib'.
  376. #     Error:  Can't locate Compress/Raw/Zlib.pm in @INC (@INC contains: t t/compress /root/.cpan/build/IO-Compress-2.046-IKeaEA/blib/lib /root/.cpan/build/IO-Compress-2.046-IKeaEA/blib/arch /usr/lib64/perl5/site_perl/5.8.8/x86_64-linux-thread-multi /usr/lib/perl5/site_perl/5.8.8 /usr/lib/perl5/site_perl /usr/lib64/perl5/vendor_perl/5.8.8/x86_64-linux-thread-multi /usr/lib/perl5/vendor_perl/5.8.8 /usr/lib/perl5/vendor_perl /usr/lib64/perl5/5.8.8/x86_64-linux-thread-multi /usr/lib/perl5/5.8.8 .) at (eval 32) line 2.
  377. # BEGIN failed--compilation aborted at t/004gziphdr.t line 25.
  378.  
  379. #     Failed test (t/004gziphdr.t at line 28)
  380. #     Tried to use 'IO::Compress::Gzip'.
  381. #     Error:  Can't locate Compress/Raw/Zlib.pm in @INC (@INC contains: t t/compress /root/.cpan/build/IO-Compress-2.046-IKeaEA/blib/lib /root/.cpan/build/IO-Compress-2.046-IKeaEA/blib/arch /usr/lib64/perl5/site_perl/5.8.8/x86_64-linux-thread-multi /usr/lib/perl5/site_perl/5.8.8 /usr/lib/perl5/site_perl /usr/lib64/perl5/vendor_perl/5.8.8/x86_64-linux-thread-multi /usr/lib/perl5/vendor_perl/5.8.8 /usr/lib/perl5/vendor_perl /usr/lib64/perl5/5.8.8/x86_64-linux-thread-multi /usr/lib/perl5/5.8.8 .) at /root/.cpan/build/IO-Compress-2.046-IKeaEA/blib/lib/IO/Compress/Adapter/Deflate.pm line 9.
  382. # BEGIN failed--compilation aborted at t/004gziphdr.t line 28.
  383. # Compilation failed in require at /root/.cpan/build/IO-Compress-2.046-IKeaEA/blib/lib/IO/Compress/RawDeflate.pm line 12.
  384. # BEGIN failed--compilation aborted at /root/.cpan/build/IO-Compress-2.046-IKeaEA/blib/lib/IO/Compress/RawDeflate.pm line 12.
  385. # Compilation failed in require at /root/.cpan/build/IO-Compress-2.046-IKeaEA/blib/lib/IO/Compress/Gzip.pm line 11.
  386. # BEGIN failed--compilation aborted at /root/.cpan/build/IO-Compress-2.046-IKeaEA/blib/lib/IO/Compress/Gzip.pm line 11.
  387. # Compilation failed in require at (eval 34) line 2.
  388. # BEGIN failed--compilation aborted at (eval 34) line 2.
  389. Global symbol "$GzipError" requires explicit package name at t/004gziphdr.t line 262.
  390. Global symbol "$GzipError" requires explicit package name at t/004gziphdr.t line 307.
  391. Global symbol "$GunzipError" requires explicit package name at t/004gziphdr.t line 316.
  392. Global symbol "$GzipError" requires explicit package name at t/004gziphdr.t line 370.
  393. Global symbol "$GzipError" requires explicit package name at t/004gziphdr.t line 423.
  394. Global symbol "$GzipError" requires explicit package name at t/004gziphdr.t line 426.
  395. Global symbol "$GzipError" requires explicit package name at t/004gziphdr.t line 433.
  396. Global symbol "$GunzipError" requires explicit package name at t/004gziphdr.t line 445.
  397. Global symbol "$GunzipError" requires explicit package name at t/004gziphdr.t line 541.
  398. Global symbol "$GunzipError" requires explicit package name at t/004gziphdr.t line 550.
  399. Global symbol "$GunzipError" requires explicit package name at t/004gziphdr.t line 560.
  400. Global symbol "$GunzipError" requires explicit package name at t/004gziphdr.t line 569.
  401. Global symbol "$GunzipError" requires explicit package name at t/004gziphdr.t line 578.
  402. Global symbol "$GunzipError" requires explicit package name at t/004gziphdr.t line 579.
  403. Global symbol "$GzipError" requires explicit package name at t/004gziphdr.t line 606.
  404. Global symbol "$GzipError" requires explicit package name at t/004gziphdr.t line 615.
  405. Global symbol "$GunzipError" requires explicit package name at t/004gziphdr.t line 626.
  406. Global symbol "$GzipError" requires explicit package name at t/004gziphdr.t line 641.
  407. Global symbol "$GzipError" requires explicit package name at t/004gziphdr.t line 645.
  408. Global symbol "$GzipError" requires explicit package name at t/004gziphdr.t line 666.
  409. Global symbol "$GunzipError" requires explicit package name at t/004gziphdr.t line 676.
  410. Global symbol "$GzipError" requires explicit package name at t/004gziphdr.t line 690.
  411. Global symbol "$GzipError" requires explicit package name at t/004gziphdr.t line 694.
  412. Global symbol "$GunzipError" requires explicit package name at t/004gziphdr.t line 732.
  413. Global symbol "$GunzipError" requires explicit package name at t/004gziphdr.t line 757.
  414. Global symbol "$GunzipError" requires explicit package name at t/004gziphdr.t line 783.
  415. Global symbol "$GunzipError" requires explicit package name at t/004gziphdr.t line 808.
  416. Global symbol "$GunzipError" requires explicit package name at t/004gziphdr.t line 858.
  417. Global symbol "$GunzipError" requires explicit package name at t/004gziphdr.t line 863.
  418. Global symbol "$GunzipError" requires explicit package name at t/004gziphdr.t line 893.
  419. Global symbol "$GunzipError" requires explicit package name at t/004gziphdr.t line 898.
  420. Global symbol "$GunzipError" requires explicit package name at t/004gziphdr.t line 927.
  421. Global symbol "$GunzipError" requires explicit package name at t/004gziphdr.t line 932.
  422. Global symbol "$GunzipError" requires explicit package name at t/004gziphdr.t line 962.
  423. Global symbol "$GunzipError" requires explicit package name at t/004gziphdr.t line 967.
  424. Global symbol "$GzipError" requires explicit package name at t/004gziphdr.t line 986.
  425. Bareword "Z_DEFLATED" not allowed while "strict subs" in use at t/004gziphdr.t line 53.
  426. Bareword "Z_BEST_SPEED" not allowed while "strict subs" in use at t/004gziphdr.t line 212.
  427. Bareword "Z_BEST_COMPRESSION" not allowed while "strict subs" in use at t/004gziphdr.t line 222.
  428. Bareword "Z_BEST_COMPRESSION" not allowed while "strict subs" in use at t/004gziphdr.t line 232.
  429. Execution of t/004gziphdr.t aborted due to compilation errors.
  430. # Looks like you planned 919 tests but only ran 5.
  431. # Looks like your test died just after 5.
  432. t/004gziphdr.t .................. Dubious, test returned 255 (wstat 65280, 0xff00)
  433. Failed 916/919 subtests
  434. t/005defhdr.t ................... 1/596
  435. #     Failed test (t/005defhdr.t at line 24)
  436. #     Tried to use 'Compress::Raw::Zlib'.
  437. #     Error:  Can't locate Compress/Raw/Zlib.pm in @INC (@INC contains: t t/compress /root/.cpan/build/IO-Compress-2.046-IKeaEA/blib/lib /root/.cpan/build/IO-Compress-2.046-IKeaEA/blib/arch /usr/lib64/perl5/site_perl/5.8.8/x86_64-linux-thread-multi /usr/lib/perl5/site_perl/5.8.8 /usr/lib/perl5/site_perl /usr/lib64/perl5/vendor_perl/5.8.8/x86_64-linux-thread-multi /usr/lib/perl5/vendor_perl/5.8.8 /usr/lib/perl5/vendor_perl /usr/lib64/perl5/5.8.8/x86_64-linux-thread-multi /usr/lib/perl5/5.8.8 .) at (eval 32) line 2.
  438. # BEGIN failed--compilation aborted at t/005defhdr.t line 24.
  439.  
  440. #     Failed test (t/005defhdr.t at line 26)
  441. #     Tried to use 'IO::Compress::Deflate'.
  442. #     Error:  Can't locate Compress/Raw/Zlib.pm in @INC (@INC contains: t t/compress /root/.cpan/build/IO-Compress-2.046-IKeaEA/blib/lib /root/.cpan/build/IO-Compress-2.046-IKeaEA/blib/arch /usr/lib64/perl5/site_perl/5.8.8/x86_64-linux-thread-multi /usr/lib/perl5/site_perl/5.8.8 /usr/lib/perl5/site_perl /usr/lib64/perl5/vendor_perl/5.8.8/x86_64-linux-thread-multi /usr/lib/perl5/vendor_perl/5.8.8 /usr/lib/perl5/vendor_perl /usr/lib64/perl5/5.8.8/x86_64-linux-thread-multi /usr/lib/perl5/5.8.8 .) at /root/.cpan/build/IO-Compress-2.046-IKeaEA/blib/lib/IO/Compress/Adapter/Deflate.pm line 9.
  443. # BEGIN failed--compilation aborted at t/005defhdr.t line 26.
  444. # Compilation failed in require at /root/.cpan/build/IO-Compress-2.046-IKeaEA/blib/lib/IO/Compress/RawDeflate.pm line 12.
  445. # BEGIN failed--compilation aborted at /root/.cpan/build/IO-Compress-2.046-IKeaEA/blib/lib/IO/Compress/RawDeflate.pm line 12.
  446. # Compilation failed in require at /root/.cpan/build/IO-Compress-2.046-IKeaEA/blib/lib/IO/Compress/Deflate.pm line 9.
  447. # BEGIN failed--compilation aborted at /root/.cpan/build/IO-Compress-2.046-IKeaEA/blib/lib/IO/Compress/Deflate.pm line 9.
  448. # Compilation failed in require at (eval 33) line 2.
  449. # BEGIN failed--compilation aborted at (eval 33) line 2.
  450. Bareword "Z_OK" not allowed while "strict subs" in use at t/005defhdr.t line 71.
  451. Bareword "Z_OK" not allowed while "strict subs" in use at t/005defhdr.t line 72.
  452. BEGIN not safe after errors--compilation aborted at t/005defhdr.t line 100.
  453. # Looks like you planned 596 tests but only ran 5.
  454. # Looks like your test died just after 5.
  455. t/005defhdr.t ................... Dubious, test returned 255 (wstat 65280, 0xff00)
  456. Failed 593/596 subtests
  457. t/006zip.t ...................... 1/92
  458. #     Failed test (t/006zip.t at line 24)
  459. #     Tried to use 'IO::Compress::Zip'.
  460. #     Error:  Can't locate Compress/Raw/Zlib.pm in @INC (@INC contains: t t/compress /root/.cpan/build/IO-Compress-2.046-IKeaEA/blib/lib /root/.cpan/build/IO-Compress-2.046-IKeaEA/blib/arch /usr/lib64/perl5/site_perl/5.8.8/x86_64-linux-thread-multi /usr/lib/perl5/site_perl/5.8.8 /usr/lib/perl5/site_perl /usr/lib64/perl5/vendor_perl/5.8.8/x86_64-linux-thread-multi /usr/lib/perl5/vendor_perl/5.8.8 /usr/lib/perl5/vendor_perl /usr/lib64/perl5/5.8.8/x86_64-linux-thread-multi /usr/lib/perl5/5.8.8 .) at /root/.cpan/build/IO-Compress-2.046-IKeaEA/blib/lib/IO/Compress/Adapter/Deflate.pm line 9.
  461. # BEGIN failed--compilation aborted at t/006zip.t line 24.
  462. # Compilation failed in require at /root/.cpan/build/IO-Compress-2.046-IKeaEA/blib/lib/IO/Compress/RawDeflate.pm line 12.
  463. # BEGIN failed--compilation aborted at /root/.cpan/build/IO-Compress-2.046-IKeaEA/blib/lib/IO/Compress/RawDeflate.pm line 12.
  464. # Compilation failed in require at /root/.cpan/build/IO-Compress-2.046-IKeaEA/blib/lib/IO/Compress/Zip.pm line 8.
  465. # BEGIN failed--compilation aborted at /root/.cpan/build/IO-Compress-2.046-IKeaEA/blib/lib/IO/Compress/Zip.pm line 8.
  466. # Compilation failed in require at (eval 32) line 2.
  467. # BEGIN failed--compilation aborted at (eval 32) line 2.
  468. Global symbol "$UnzipError" requires explicit package name at t/006zip.t line 42.
  469. syntax error at t/006zip.t line 309, near "zip \"
  470. Bareword "ZIP_CM_DEFLATE" not allowed while "strict subs" in use at t/006zip.t line 79.
  471. Bareword "ZIP_CM_DEFLATE" not allowed while "strict subs" in use at t/006zip.t line 84.
  472. Bareword "ZIP_CM_DEFLATE" not allowed while "strict subs" in use at t/006zip.t line 86.
  473. Bareword "ZIP_CM_BZIP2" not allowed while "strict subs" in use at t/006zip.t line 112.
  474. Bareword "ZIP_CM_BZIP2" not allowed while "strict subs" in use at t/006zip.t line 117.
  475. Bareword "ZIP_CM_BZIP2" not allowed while "strict subs" in use at t/006zip.t line 119.
  476. Bareword "ZIP_CM_DEFLATE" not allowed while "strict subs" in use at t/006zip.t line 145.
  477. Bareword "ZIP_CM_BZIP2" not allowed while "strict subs" in use at t/006zip.t line 150.
  478. Bareword "ZIP_CM_DEFLATE" not allowed while "strict subs" in use at t/006zip.t line 152.
  479. Bareword "ZIP_CM_STORE" not allowed while "strict subs" in use at t/006zip.t line 174.
  480. Bareword "ZIP_CM_STORE" not allowed while "strict subs" in use at t/006zip.t line 179.
  481. Bareword "ZIP_CM_STORE" not allowed while "strict subs" in use at t/006zip.t line 181.
  482. Bareword "ZIP_CM_DEFLATE" not allowed while "strict subs" in use at t/006zip.t line 203.
  483. Bareword "ZIP_CM_STORE" not allowed while "strict subs" in use at t/006zip.t line 208.
  484. Bareword "ZIP_CM_DEFLATE" not allowed while "strict subs" in use at t/006zip.t line 210.
  485. Bareword "ZIP_CM_DEFLATE" not allowed while "strict subs" in use at t/006zip.t line 232.
  486. Bareword "ZIP_CM_STORE" not allowed while "strict subs" in use at t/006zip.t line 237.
  487. Bareword "ZIP_CM_DEFLATE" not allowed while "strict subs" in use at t/006zip.t line 239.
  488. Bareword "ZIP_CM_STORE" not allowed while "strict subs" in use at t/006zip.t line 262.
  489. Bareword "ZIP_CM_STORE" not allowed while "strict subs" in use at t/006zip.t line 268.
  490. Bareword "ZIP_CM_STORE" not allowed while "strict subs" in use at t/006zip.t line 285.
  491. Bareword "ZIP_CM_STORE" not allowed while "strict subs" in use at t/006zip.t line 289.
  492. Bareword "ZIP_CM_DEFLATE" not allowed while "strict subs" in use at t/006zip.t line 299.
  493. Bareword "ZIP_CM_STORE" not allowed while "strict subs" in use at t/006zip.t line 299.
  494. Bareword "ZIP_CM_BZIP2" not allowed while "strict subs" in use at t/006zip.t line 299.
  495. Execution of t/006zip.t aborted due to compilation errors.
  496.  
  497. #     Failed test (/usr/lib/perl5/site_perl/5.8.8/Test/NoWarnings.pm at line 45)
  498. # There were 2 warning(s)
  499. #       Previous test 2 'use IO::Uncompress::Unzip;'
  500. #       Backslash found where operator expected at t/006zip.t line 309, near "zip \"
  501. #  at t/006zip.t line 309
  502. #
  503. # ----------
  504. #       Previous test 2 'use IO::Uncompress::Unzip;'
  505. #               (Do you need to predeclare zip?)
  506. #  at t/006zip.t line 309
  507. #
  508. # Looks like you planned 92 tests but only ran 3.
  509. # Looks like your test died just after 3.
  510. t/006zip.t ...................... Dubious, test returned 255 (wstat 65280, 0xff00)
  511. Failed 91/92 subtests
  512. t/010examples-bzip2.t ........... Can't locate Compress/Raw/Bzip2.pm in @INC (@INC contains: t t/compress /root/.cpan/build/IO-Compress-2.046-IKeaEA/blib/lib /root/.cpan/build/IO-Compress-2.046-IKeaEA/blib/arch /usr/lib64/perl5/site_perl/5.8.8/x86_64-linux-thread-multi /usr/lib/perl5/site_perl/5.8.8 /usr/lib/perl5/site_perl /usr/lib64/perl5/vendor_perl/5.8.8/x86_64-linux-thread-multi /usr/lib/perl5/vendor_perl/5.8.8 /usr/lib/perl5/vendor_perl /usr/lib64/perl5/5.8.8/x86_64-linux-thread-multi /usr/lib/perl5/5.8.8 .) at /root/.cpan/build/IO-Compress-2.046-IKeaEA/blib/lib/IO/Compress/Adapter/Bzip2.pm line 9.
  513. BEGIN failed--compilation aborted at /root/.cpan/build/IO-Compress-2.046-IKeaEA/blib/lib/IO/Compress/Adapter/Bzip2.pm line 9.
  514. Compilation failed in require at /root/.cpan/build/IO-Compress-2.046-IKeaEA/blib/lib/IO/Compress/Bzip2.pm line 11.
  515. BEGIN failed--compilation aborted at /root/.cpan/build/IO-Compress-2.046-IKeaEA/blib/lib/IO/Compress/Bzip2.pm line 11.
  516. Compilation failed in require at t/010examples-bzip2.t line 16.
  517. BEGIN failed--compilation aborted at t/010examples-bzip2.t line 16.
  518. # Looks like your test died before it could output anything.
  519. t/010examples-bzip2.t ........... Dubious, test returned 255 (wstat 65280, 0xff00)
  520. No subtests run
  521. t/010examples-zlib.t ............ Can't locate Compress/Raw/Zlib.pm in @INC (@INC contains: t t/compress /root/.cpan/build/IO-Compress-2.046-IKeaEA/blib/lib /root/.cpan/build/IO-Compress-2.046-IKeaEA/blib/arch /usr/lib64/perl5/site_perl/5.8.8/x86_64-linux-thread-multi /usr/lib/perl5/site_perl/5.8.8 /usr/lib/perl5/site_perl /usr/lib64/perl5/vendor_perl/5.8.8/x86_64-linux-thread-multi /usr/lib/perl5/vendor_perl/5.8.8 /usr/lib/perl5/vendor_perl /usr/lib64/perl5/5.8.8/x86_64-linux-thread-multi /usr/lib/perl5/5.8.8 .) at /root/.cpan/build/IO-Compress-2.046-IKeaEA/blib/lib/IO/Compress/Adapter/Deflate.pm line 9.
  522. BEGIN failed--compilation aborted at /root/.cpan/build/IO-Compress-2.046-IKeaEA/blib/lib/IO/Compress/Adapter/Deflate.pm line 9.
  523. Compilation failed in require at /root/.cpan/build/IO-Compress-2.046-IKeaEA/blib/lib/IO/Compress/RawDeflate.pm line 12.
  524. BEGIN failed--compilation aborted at /root/.cpan/build/IO-Compress-2.046-IKeaEA/blib/lib/IO/Compress/RawDeflate.pm line 12.
  525. Compilation failed in require at /root/.cpan/build/IO-Compress-2.046-IKeaEA/blib/lib/IO/Compress/Gzip.pm line 11.
  526. BEGIN failed--compilation aborted at /root/.cpan/build/IO-Compress-2.046-IKeaEA/blib/lib/IO/Compress/Gzip.pm line 11.
  527. Compilation failed in require at t/010examples-zlib.t line 16.
  528. BEGIN failed--compilation aborted at t/010examples-zlib.t line 16.
  529. # Looks like your test died before it could output anything.
  530. t/010examples-zlib.t ............ Dubious, test returned 255 (wstat 65280, 0xff00)
  531. No subtests run
  532. t/01misc.t ...................... ok      
  533. t/020isize.t .................... skipped: Lengthy Tests Disabled
  534. t/050interop-gzip.t ............. 1/8
  535. #     Failed test (t/050interop-gzip.t at line 116)
  536. #     Tried to use 'IO::Compress::Gzip'.
  537. #     Error:  Can't locate Compress/Raw/Zlib.pm in @INC (@INC contains: t t/compress /root/.cpan/build/IO-Compress-2.046-IKeaEA/blib/lib /root/.cpan/build/IO-Compress-2.046-IKeaEA/blib/arch /usr/lib64/perl5/site_perl/5.8.8/x86_64-linux-thread-multi /usr/lib/perl5/site_perl/5.8.8 /usr/lib/perl5/site_perl /usr/lib64/perl5/vendor_perl/5.8.8/x86_64-linux-thread-multi /usr/lib/perl5/vendor_perl/5.8.8 /usr/lib/perl5/vendor_perl /usr/lib64/perl5/5.8.8/x86_64-linux-thread-multi /usr/lib/perl5/5.8.8 .) at /root/.cpan/build/IO-Compress-2.046-IKeaEA/blib/lib/IO/Compress/Adapter/Deflate.pm line 9.
  538. # BEGIN failed--compilation aborted at t/050interop-gzip.t line 116.
  539. # Compilation failed in require at /root/.cpan/build/IO-Compress-2.046-IKeaEA/blib/lib/IO/Compress/RawDeflate.pm line 12.
  540. # BEGIN failed--compilation aborted at /root/.cpan/build/IO-Compress-2.046-IKeaEA/blib/lib/IO/Compress/RawDeflate.pm line 12.
  541. # Compilation failed in require at /root/.cpan/build/IO-Compress-2.046-IKeaEA/blib/lib/IO/Compress/Gzip.pm line 11.
  542. # BEGIN failed--compilation aborted at /root/.cpan/build/IO-Compress-2.046-IKeaEA/blib/lib/IO/Compress/Gzip.pm line 11.
  543. # Compilation failed in require at (eval 32) line 2.
  544. # BEGIN failed--compilation aborted at (eval 32) line 2.
  545. syntax error at t/050interop-gzip.t line 141, near "gzip \"
  546. Execution of t/050interop-gzip.t aborted due to compilation errors.
  547.  
  548. #     Failed test (/usr/lib/perl5/site_perl/5.8.8/Test/NoWarnings.pm at line 45)
  549. # There were 2 warning(s)
  550. #       Previous test 2 'use IO::Uncompress::Gunzip;'
  551. #       Backslash found where operator expected at t/050interop-gzip.t line 141, near "gzip \"
  552. #  at t/050interop-gzip.t line 141
  553. #
  554. # ----------
  555. #       Previous test 2 'use IO::Uncompress::Gunzip;'
  556. #               (Do you need to predeclare gzip?)
  557. #  at t/050interop-gzip.t line 141
  558. #
  559. # Looks like you planned 8 tests but only ran 3.
  560. # Looks like your test died just after 3.
  561. t/050interop-gzip.t ............. Dubious, test returned 255 (wstat 65280, 0xff00)
  562. Failed 7/8 subtests
  563. t/100generic-bzip2.t ............ Can't locate Compress/Raw/Bzip2.pm in @INC (@INC contains: t t/compress /root/.cpan/build/IO-Compress-2.046-IKeaEA/blib/lib /root/.cpan/build/IO-Compress-2.046-IKeaEA/blib/arch /usr/lib64/perl5/site_perl/5.8.8/x86_64-linux-thread-multi /usr/lib/perl5/site_perl/5.8.8 /usr/lib/perl5/site_perl /usr/lib64/perl5/vendor_perl/5.8.8/x86_64-linux-thread-multi /usr/lib/perl5/vendor_perl/5.8.8 /usr/lib/perl5/vendor_perl /usr/lib64/perl5/5.8.8/x86_64-linux-thread-multi /usr/lib/perl5/5.8.8 .) at /root/.cpan/build/IO-Compress-2.046-IKeaEA/blib/lib/IO/Compress/Adapter/Bzip2.pm line 9.
  564. BEGIN failed--compilation aborted at /root/.cpan/build/IO-Compress-2.046-IKeaEA/blib/lib/IO/Compress/Adapter/Bzip2.pm line 9.
  565. Compilation failed in require at /root/.cpan/build/IO-Compress-2.046-IKeaEA/blib/lib/IO/Compress/Bzip2.pm line 11.
  566. BEGIN failed--compilation aborted at /root/.cpan/build/IO-Compress-2.046-IKeaEA/blib/lib/IO/Compress/Bzip2.pm line 11.
  567. Compilation failed in require at t/100generic-bzip2.t line 12.
  568. BEGIN failed--compilation aborted at t/100generic-bzip2.t line 12.
  569. t/100generic-bzip2.t ............ Dubious, test returned 2 (wstat 512, 0x200)
  570. No subtests run
  571. t/100generic-deflate.t .......... Can't locate Compress/Raw/Zlib.pm in @INC (@INC contains: t t/compress /root/.cpan/build/IO-Compress-2.046-IKeaEA/blib/lib /root/.cpan/build/IO-Compress-2.046-IKeaEA/blib/arch /usr/lib64/perl5/site_perl/5.8.8/x86_64-linux-thread-multi /usr/lib/perl5/site_perl/5.8.8 /usr/lib/perl5/site_perl /usr/lib64/perl5/vendor_perl/5.8.8/x86_64-linux-thread-multi /usr/lib/perl5/vendor_perl/5.8.8 /usr/lib/perl5/vendor_perl /usr/lib64/perl5/5.8.8/x86_64-linux-thread-multi /usr/lib/perl5/5.8.8 .) at /root/.cpan/build/IO-Compress-2.046-IKeaEA/blib/lib/IO/Compress/Adapter/Deflate.pm line 9.
  572. BEGIN failed--compilation aborted at /root/.cpan/build/IO-Compress-2.046-IKeaEA/blib/lib/IO/Compress/Adapter/Deflate.pm line 9.
  573. Compilation failed in require at /root/.cpan/build/IO-Compress-2.046-IKeaEA/blib/lib/IO/Compress/RawDeflate.pm line 12.
  574. BEGIN failed--compilation aborted at /root/.cpan/build/IO-Compress-2.046-IKeaEA/blib/lib/IO/Compress/RawDeflate.pm line 12.
  575. Compilation failed in require at /root/.cpan/build/IO-Compress-2.046-IKeaEA/blib/lib/IO/Compress/Deflate.pm line 9.
  576. BEGIN failed--compilation aborted at /root/.cpan/build/IO-Compress-2.046-IKeaEA/blib/lib/IO/Compress/Deflate.pm line 9.
  577. Compilation failed in require at t/100generic-deflate.t line 13.
  578. BEGIN failed--compilation aborted at t/100generic-deflate.t line 13.
  579. t/100generic-deflate.t .......... Dubious, test returned 2 (wstat 512, 0x200)
  580. No subtests run
  581. t/100generic-gzip.t ............. Can't locate Compress/Raw/Zlib.pm in @INC (@INC contains: t t/compress /root/.cpan/build/IO-Compress-2.046-IKeaEA/blib/lib /root/.cpan/build/IO-Compress-2.046-IKeaEA/blib/arch /usr/lib64/perl5/site_perl/5.8.8/x86_64-linux-thread-multi /usr/lib/perl5/site_perl/5.8.8 /usr/lib/perl5/site_perl /usr/lib64/perl5/vendor_perl/5.8.8/x86_64-linux-thread-multi /usr/lib/perl5/vendor_perl/5.8.8 /usr/lib/perl5/vendor_perl /usr/lib64/perl5/5.8.8/x86_64-linux-thread-multi /usr/lib/perl5/5.8.8 .) at /root/.cpan/build/IO-Compress-2.046-IKeaEA/blib/lib/IO/Compress/Adapter/Deflate.pm line 9.
  582. BEGIN failed--compilation aborted at /root/.cpan/build/IO-Compress-2.046-IKeaEA/blib/lib/IO/Compress/Adapter/Deflate.pm line 9.
  583. Compilation failed in require at /root/.cpan/build/IO-Compress-2.046-IKeaEA/blib/lib/IO/Compress/RawDeflate.pm line 12.
  584. BEGIN failed--compilation aborted at /root/.cpan/build/IO-Compress-2.046-IKeaEA/blib/lib/IO/Compress/RawDeflate.pm line 12.
  585. Compilation failed in require at /root/.cpan/build/IO-Compress-2.046-IKeaEA/blib/lib/IO/Compress/Gzip.pm line 11.
  586. BEGIN failed--compilation aborted at /root/.cpan/build/IO-Compress-2.046-IKeaEA/blib/lib/IO/Compress/Gzip.pm line 11.
  587. Compilation failed in require at t/100generic-gzip.t line 12.
  588. BEGIN failed--compilation aborted at t/100generic-gzip.t line 12.
  589. t/100generic-gzip.t ............. Dubious, test returned 2 (wstat 512, 0x200)
  590. No subtests run
  591. t/100generic-rawdeflate.t ....... Can't locate Compress/Raw/Zlib.pm in @INC (@INC contains: t t/compress /root/.cpan/build/IO-Compress-2.046-IKeaEA/blib/lib /root/.cpan/build/IO-Compress-2.046-IKeaEA/blib/arch /usr/lib64/perl5/site_perl/5.8.8/x86_64-linux-thread-multi /usr/lib/perl5/site_perl/5.8.8 /usr/lib/perl5/site_perl /usr/lib64/perl5/vendor_perl/5.8.8/x86_64-linux-thread-multi /usr/lib/perl5/vendor_perl/5.8.8 /usr/lib/perl5/vendor_perl /usr/lib64/perl5/5.8.8/x86_64-linux-thread-multi /usr/lib/perl5/5.8.8 .) at /root/.cpan/build/IO-Compress-2.046-IKeaEA/blib/lib/IO/Compress/Adapter/Deflate.pm line 9.
  592. BEGIN failed--compilation aborted at /root/.cpan/build/IO-Compress-2.046-IKeaEA/blib/lib/IO/Compress/Adapter/Deflate.pm line 9.
  593. Compilation failed in require at /root/.cpan/build/IO-Compress-2.046-IKeaEA/blib/lib/IO/Compress/RawDeflate.pm line 12.
  594. BEGIN failed--compilation aborted at /root/.cpan/build/IO-Compress-2.046-IKeaEA/blib/lib/IO/Compress/RawDeflate.pm line 12.
  595. Compilation failed in require at t/100generic-rawdeflate.t line 12.
  596. BEGIN failed--compilation aborted at t/100generic-rawdeflate.t line 12.
  597. t/100generic-rawdeflate.t ....... Dubious, test returned 2 (wstat 512, 0x200)
  598. No subtests run
  599. t/100generic-zip.t .............. Can't locate Compress/Raw/Zlib.pm in @INC (@INC contains: t t/compress /root/.cpan/build/IO-Compress-2.046-IKeaEA/blib/lib /root/.cpan/build/IO-Compress-2.046-IKeaEA/blib/arch /usr/lib64/perl5/site_perl/5.8.8/x86_64-linux-thread-multi /usr/lib/perl5/site_perl/5.8.8 /usr/lib/perl5/site_perl /usr/lib64/perl5/vendor_perl/5.8.8/x86_64-linux-thread-multi /usr/lib/perl5/vendor_perl/5.8.8 /usr/lib/perl5/vendor_perl /usr/lib64/perl5/5.8.8/x86_64-linux-thread-multi /usr/lib/perl5/5.8.8 .) at /root/.cpan/build/IO-Compress-2.046-IKeaEA/blib/lib/IO/Compress/Adapter/Deflate.pm line 9.
  600. BEGIN failed--compilation aborted at /root/.cpan/build/IO-Compress-2.046-IKeaEA/blib/lib/IO/Compress/Adapter/Deflate.pm line 9.
  601. Compilation failed in require at /root/.cpan/build/IO-Compress-2.046-IKeaEA/blib/lib/IO/Compress/RawDeflate.pm line 12.
  602. BEGIN failed--compilation aborted at /root/.cpan/build/IO-Compress-2.046-IKeaEA/blib/lib/IO/Compress/RawDeflate.pm line 12.
  603. Compilation failed in require at /root/.cpan/build/IO-Compress-2.046-IKeaEA/blib/lib/IO/Compress/Zip.pm line 8.
  604. BEGIN failed--compilation aborted at /root/.cpan/build/IO-Compress-2.046-IKeaEA/blib/lib/IO/Compress/Zip.pm line 8.
  605. Compilation failed in require at t/100generic-zip.t line 12.
  606. BEGIN failed--compilation aborted at t/100generic-zip.t line 12.
  607. t/100generic-zip.t .............. Dubious, test returned 2 (wstat 512, 0x200)
  608. No subtests run
  609. t/101truncate-bzip2.t ........... Can't locate Compress/Raw/Bzip2.pm in @INC (@INC contains: t t/compress /root/.cpan/build/IO-Compress-2.046-IKeaEA/blib/lib /root/.cpan/build/IO-Compress-2.046-IKeaEA/blib/arch /usr/lib64/perl5/site_perl/5.8.8/x86_64-linux-thread-multi /usr/lib/perl5/site_perl/5.8.8 /usr/lib/perl5/site_perl /usr/lib64/perl5/vendor_perl/5.8.8/x86_64-linux-thread-multi /usr/lib/perl5/vendor_perl/5.8.8 /usr/lib/perl5/vendor_perl /usr/lib64/perl5/5.8.8/x86_64-linux-thread-multi /usr/lib/perl5/5.8.8 .) at /root/.cpan/build/IO-Compress-2.046-IKeaEA/blib/lib/IO/Compress/Adapter/Bzip2.pm line 9.
  610. BEGIN failed--compilation aborted at /root/.cpan/build/IO-Compress-2.046-IKeaEA/blib/lib/IO/Compress/Adapter/Bzip2.pm line 9.
  611. Compilation failed in require at /root/.cpan/build/IO-Compress-2.046-IKeaEA/blib/lib/IO/Compress/Bzip2.pm line 11.
  612. BEGIN failed--compilation aborted at /root/.cpan/build/IO-Compress-2.046-IKeaEA/blib/lib/IO/Compress/Bzip2.pm line 11.
  613. Compilation failed in require at t/101truncate-bzip2.t line 28.
  614. BEGIN failed--compilation aborted at t/101truncate-bzip2.t line 28.
  615. t/101truncate-bzip2.t ........... 1/4013 # Looks like you planned 4013 tests but only ran 1.
  616. # Looks like your test died just after 1.
  617. t/101truncate-bzip2.t ........... Dubious, test returned 255 (wstat 65280, 0xff00)
  618. Failed 4012/4013 subtests
  619. t/101truncate-deflate.t ......... Can't locate Compress/Raw/Zlib.pm in @INC (@INC contains: t t/compress /root/.cpan/build/IO-Compress-2.046-IKeaEA/blib/lib /root/.cpan/build/IO-Compress-2.046-IKeaEA/blib/arch /usr/lib64/perl5/site_perl/5.8.8/x86_64-linux-thread-multi /usr/lib/perl5/site_perl/5.8.8 /usr/lib/perl5/site_perl /usr/lib64/perl5/vendor_perl/5.8.8/x86_64-linux-thread-multi /usr/lib/perl5/vendor_perl/5.8.8 /usr/lib/perl5/vendor_perl /usr/lib64/perl5/5.8.8/x86_64-linux-thread-multi /usr/lib/perl5/5.8.8 .) at /root/.cpan/build/IO-Compress-2.046-IKeaEA/blib/lib/IO/Compress/Adapter/Deflate.pm line 9.
  620. BEGIN failed--compilation aborted at /root/.cpan/build/IO-Compress-2.046-IKeaEA/blib/lib/IO/Compress/Adapter/Deflate.pm line 9.
  621. Compilation failed in require at /root/.cpan/build/IO-Compress-2.046-IKeaEA/blib/lib/IO/Compress/RawDeflate.pm line 12.
  622. BEGIN failed--compilation aborted at /root/.cpan/build/IO-Compress-2.046-IKeaEA/blib/lib/IO/Compress/RawDeflate.pm line 12.
  623. Compilation failed in require at /root/.cpan/build/IO-Compress-2.046-IKeaEA/blib/lib/IO/Compress/Deflate.pm line 9.
  624. BEGIN failed--compilation aborted at /root/.cpan/build/IO-Compress-2.046-IKeaEA/blib/lib/IO/Compress/Deflate.pm line 9.
  625. Compilation failed in require at t/101truncate-deflate.t line 28.
  626. BEGIN failed--compilation aborted at t/101truncate-deflate.t line 28.
  627. t/101truncate-deflate.t ......... 1/3057 # Looks like you planned 3057 tests but only ran 1.
  628. # Looks like your test died just after 1.
  629. t/101truncate-deflate.t ......... Dubious, test returned 255 (wstat 65280, 0xff00)
  630. Failed 3056/3057 subtests
  631. t/101truncate-gzip.t ............ Can't locate Compress/Raw/Zlib.pm in @INC (@INC contains: t t/compress /root/.cpan/build/IO-Compress-2.046-IKeaEA/blib/lib /root/.cpan/build/IO-Compress-2.046-IKeaEA/blib/arch /usr/lib64/perl5/site_perl/5.8.8/x86_64-linux-thread-multi /usr/lib/perl5/site_perl/5.8.8 /usr/lib/perl5/site_perl /usr/lib64/perl5/vendor_perl/5.8.8/x86_64-linux-thread-multi /usr/lib/perl5/vendor_perl/5.8.8 /usr/lib/perl5/vendor_perl /usr/lib64/perl5/5.8.8/x86_64-linux-thread-multi /usr/lib/perl5/5.8.8 .) at /root/.cpan/build/IO-Compress-2.046-IKeaEA/blib/lib/IO/Compress/Adapter/Deflate.pm line 9.
  632. BEGIN failed--compilation aborted at /root/.cpan/build/IO-Compress-2.046-IKeaEA/blib/lib/IO/Compress/Adapter/Deflate.pm line 9.
  633. Compilation failed in require at /root/.cpan/build/IO-Compress-2.046-IKeaEA/blib/lib/IO/Compress/RawDeflate.pm line 12.
  634. BEGIN failed--compilation aborted at /root/.cpan/build/IO-Compress-2.046-IKeaEA/blib/lib/IO/Compress/RawDeflate.pm line 12.
  635. Compilation failed in require at /root/.cpan/build/IO-Compress-2.046-IKeaEA/blib/lib/IO/Compress/Gzip.pm line 11.
  636. BEGIN failed--compilation aborted at /root/.cpan/build/IO-Compress-2.046-IKeaEA/blib/lib/IO/Compress/Gzip.pm line 11.
  637. Compilation failed in require at t/101truncate-gzip.t line 27.
  638. BEGIN failed--compilation aborted at t/101truncate-gzip.t line 27.
  639. t/101truncate-gzip.t ............ 1/3545 # Looks like you planned 3545 tests but only ran 1.
  640. # Looks like your test died just after 1.
  641. t/101truncate-gzip.t ............ Dubious, test returned 255 (wstat 65280, 0xff00)
  642. Failed 3544/3545 subtests
  643. t/101truncate-rawdeflate.t ...... Can't locate Compress/Raw/Zlib.pm in @INC (@INC contains: t t/compress /root/.cpan/build/IO-Compress-2.046-IKeaEA/blib/lib /root/.cpan/build/IO-Compress-2.046-IKeaEA/blib/arch /usr/lib64/perl5/site_perl/5.8.8/x86_64-linux-thread-multi /usr/lib/perl5/site_perl/5.8.8 /usr/lib/perl5/site_perl /usr/lib64/perl5/vendor_perl/5.8.8/x86_64-linux-thread-multi /usr/lib/perl5/vendor_perl/5.8.8 /usr/lib/perl5/vendor_perl /usr/lib64/perl5/5.8.8/x86_64-linux-thread-multi /usr/lib/perl5/5.8.8 .) at /root/.cpan/build/IO-Compress-2.046-IKeaEA/blib/lib/IO/Compress/Adapter/Deflate.pm line 9.
  644. BEGIN failed--compilation aborted at /root/.cpan/build/IO-Compress-2.046-IKeaEA/blib/lib/IO/Compress/Adapter/Deflate.pm line 9.
  645. Compilation failed in require at /root/.cpan/build/IO-Compress-2.046-IKeaEA/blib/lib/IO/Compress/RawDeflate.pm line 12.
  646. BEGIN failed--compilation aborted at /root/.cpan/build/IO-Compress-2.046-IKeaEA/blib/lib/IO/Compress/RawDeflate.pm line 12.
  647. Compilation failed in require at t/101truncate-rawdeflate.t line 25.
  648. BEGIN failed--compilation aborted at t/101truncate-rawdeflate.t line 25.
  649. t/101truncate-rawdeflate.t ...... 1/626 # Looks like you planned 626 tests but only ran 1.
  650. # Looks like your test died just after 1.
  651. t/101truncate-rawdeflate.t ...... Dubious, test returned 255 (wstat 65280, 0xff00)
  652. Failed 625/626 subtests
  653. t/101truncate-zip.t ............. Can't locate Compress/Raw/Zlib.pm in @INC (@INC contains: t t/compress /root/.cpan/build/IO-Compress-2.046-IKeaEA/blib/lib /root/.cpan/build/IO-Compress-2.046-IKeaEA/blib/arch /usr/lib64/perl5/site_perl/5.8.8/x86_64-linux-thread-multi /usr/lib/perl5/site_perl/5.8.8 /usr/lib/perl5/site_perl /usr/lib64/perl5/vendor_perl/5.8.8/x86_64-linux-thread-multi /usr/lib/perl5/vendor_perl/5.8.8 /usr/lib/perl5/vendor_perl /usr/lib64/perl5/5.8.8/x86_64-linux-thread-multi /usr/lib/perl5/5.8.8 .) at /root/.cpan/build/IO-Compress-2.046-IKeaEA/blib/lib/IO/Compress/Adapter/Deflate.pm line 9.
  654. BEGIN failed--compilation aborted at /root/.cpan/build/IO-Compress-2.046-IKeaEA/blib/lib/IO/Compress/Adapter/Deflate.pm line 9.
  655. Compilation failed in require at /root/.cpan/build/IO-Compress-2.046-IKeaEA/blib/lib/IO/Compress/RawDeflate.pm line 12.
  656. BEGIN failed--compilation aborted at /root/.cpan/build/IO-Compress-2.046-IKeaEA/blib/lib/IO/Compress/RawDeflate.pm line 12.
  657. Compilation failed in require at /root/.cpan/build/IO-Compress-2.046-IKeaEA/blib/lib/IO/Compress/Zip.pm line 8.
  658. BEGIN failed--compilation aborted at /root/.cpan/build/IO-Compress-2.046-IKeaEA/blib/lib/IO/Compress/Zip.pm line 8.
  659. Compilation failed in require at t/101truncate-zip.t line 29.
  660. BEGIN failed--compilation aborted at t/101truncate-zip.t line 29.
  661. t/101truncate-zip.t ............. 1/9157 # Looks like you planned 9157 tests but only ran 1.
  662. # Looks like your test died just after 1.
  663. t/101truncate-zip.t ............. Dubious, test returned 255 (wstat 65280, 0xff00)
  664. Failed 9156/9157 subtests
  665. t/102tied-bzip2.t ............... Can't locate Compress/Raw/Bzip2.pm in @INC (@INC contains: t t/compress /root/.cpan/build/IO-Compress-2.046-IKeaEA/blib/lib /root/.cpan/build/IO-Compress-2.046-IKeaEA/blib/arch /usr/lib64/perl5/site_perl/5.8.8/x86_64-linux-thread-multi /usr/lib/perl5/site_perl/5.8.8 /usr/lib/perl5/site_perl /usr/lib64/perl5/vendor_perl/5.8.8/x86_64-linux-thread-multi /usr/lib/perl5/vendor_perl/5.8.8 /usr/lib/perl5/vendor_perl /usr/lib64/perl5/5.8.8/x86_64-linux-thread-multi /usr/lib/perl5/5.8.8 .) at /root/.cpan/build/IO-Compress-2.046-IKeaEA/blib/lib/IO/Compress/Adapter/Bzip2.pm line 9.
  666. BEGIN failed--compilation aborted at /root/.cpan/build/IO-Compress-2.046-IKeaEA/blib/lib/IO/Compress/Adapter/Bzip2.pm line 9.
  667. Compilation failed in require at /root/.cpan/build/IO-Compress-2.046-IKeaEA/blib/lib/IO/Compress/Bzip2.pm line 11.
  668. BEGIN failed--compilation aborted at /root/.cpan/build/IO-Compress-2.046-IKeaEA/blib/lib/IO/Compress/Bzip2.pm line 11.
  669. Compilation failed in require at t/102tied-bzip2.t line 12.
  670. BEGIN failed--compilation aborted at t/102tied-bzip2.t line 12.
  671. t/102tied-bzip2.t ............... Dubious, test returned 2 (wstat 512, 0x200)
  672. No subtests run
  673. t/102tied-deflate.t ............. Can't locate Compress/Raw/Zlib.pm in @INC (@INC contains: t t/compress /root/.cpan/build/IO-Compress-2.046-IKeaEA/blib/lib /root/.cpan/build/IO-Compress-2.046-IKeaEA/blib/arch /usr/lib64/perl5/site_perl/5.8.8/x86_64-linux-thread-multi /usr/lib/perl5/site_perl/5.8.8 /usr/lib/perl5/site_perl /usr/lib64/perl5/vendor_perl/5.8.8/x86_64-linux-thread-multi /usr/lib/perl5/vendor_perl/5.8.8 /usr/lib/perl5/vendor_perl /usr/lib64/perl5/5.8.8/x86_64-linux-thread-multi /usr/lib/perl5/5.8.8 .) at /root/.cpan/build/IO-Compress-2.046-IKeaEA/blib/lib/IO/Compress/Adapter/Deflate.pm line 9.
  674. BEGIN failed--compilation aborted at /root/.cpan/build/IO-Compress-2.046-IKeaEA/blib/lib/IO/Compress/Adapter/Deflate.pm line 9.
  675. Compilation failed in require at /root/.cpan/build/IO-Compress-2.046-IKeaEA/blib/lib/IO/Compress/RawDeflate.pm line 12.
  676. BEGIN failed--compilation aborted at /root/.cpan/build/IO-Compress-2.046-IKeaEA/blib/lib/IO/Compress/RawDeflate.pm line 12.
  677. Compilation failed in require at /root/.cpan/build/IO-Compress-2.046-IKeaEA/blib/lib/IO/Compress/Deflate.pm line 9.
  678. BEGIN failed--compilation aborted at /root/.cpan/build/IO-Compress-2.046-IKeaEA/blib/lib/IO/Compress/Deflate.pm line 9.
  679. Compilation failed in require at t/102tied-deflate.t line 12.
  680. BEGIN failed--compilation aborted at t/102tied-deflate.t line 12.
  681. t/102tied-deflate.t ............. Dubious, test returned 2 (wstat 512, 0x200)
  682. No subtests run
  683. t/102tied-gzip.t ................ Can't locate Compress/Raw/Zlib.pm in @INC (@INC contains: t t/compress /root/.cpan/build/IO-Compress-2.046-IKeaEA/blib/lib /root/.cpan/build/IO-Compress-2.046-IKeaEA/blib/arch /usr/lib64/perl5/site_perl/5.8.8/x86_64-linux-thread-multi /usr/lib/perl5/site_perl/5.8.8 /usr/lib/perl5/site_perl /usr/lib64/perl5/vendor_perl/5.8.8/x86_64-linux-thread-multi /usr/lib/perl5/vendor_perl/5.8.8 /usr/lib/perl5/vendor_perl /usr/lib64/perl5/5.8.8/x86_64-linux-thread-multi /usr/lib/perl5/5.8.8 .) at /root/.cpan/build/IO-Compress-2.046-IKeaEA/blib/lib/IO/Compress/Adapter/Deflate.pm line 9.
  684. BEGIN failed--compilation aborted at /root/.cpan/build/IO-Compress-2.046-IKeaEA/blib/lib/IO/Compress/Adapter/Deflate.pm line 9.
  685. Compilation failed in require at /root/.cpan/build/IO-Compress-2.046-IKeaEA/blib/lib/IO/Compress/RawDeflate.pm line 12.
  686. BEGIN failed--compilation aborted at /root/.cpan/build/IO-Compress-2.046-IKeaEA/blib/lib/IO/Compress/RawDeflate.pm line 12.
  687. Compilation failed in require at /root/.cpan/build/IO-Compress-2.046-IKeaEA/blib/lib/IO/Compress/Gzip.pm line 11.
  688. BEGIN failed--compilation aborted at /root/.cpan/build/IO-Compress-2.046-IKeaEA/blib/lib/IO/Compress/Gzip.pm line 11.
  689. Compilation failed in require at t/102tied-gzip.t line 12.
  690. BEGIN failed--compilation aborted at t/102tied-gzip.t line 12.
  691. t/102tied-gzip.t ................ Dubious, test returned 2 (wstat 512, 0x200)
  692. No subtests run
  693. t/102tied-rawdeflate.t .......... Can't locate Compress/Raw/Zlib.pm in @INC (@INC contains: t t/compress /root/.cpan/build/IO-Compress-2.046-IKeaEA/blib/lib /root/.cpan/build/IO-Compress-2.046-IKeaEA/blib/arch /usr/lib64/perl5/site_perl/5.8.8/x86_64-linux-thread-multi /usr/lib/perl5/site_perl/5.8.8 /usr/lib/perl5/site_perl /usr/lib64/perl5/vendor_perl/5.8.8/x86_64-linux-thread-multi /usr/lib/perl5/vendor_perl/5.8.8 /usr/lib/perl5/vendor_perl /usr/lib64/perl5/5.8.8/x86_64-linux-thread-multi /usr/lib/perl5/5.8.8 .) at /root/.cpan/build/IO-Compress-2.046-IKeaEA/blib/lib/IO/Compress/Adapter/Deflate.pm line 9.
  694. BEGIN failed--compilation aborted at /root/.cpan/build/IO-Compress-2.046-IKeaEA/blib/lib/IO/Compress/Adapter/Deflate.pm line 9.
  695. Compilation failed in require at /root/.cpan/build/IO-Compress-2.046-IKeaEA/blib/lib/IO/Compress/RawDeflate.pm line 12.
  696. BEGIN failed--compilation aborted at /root/.cpan/build/IO-Compress-2.046-IKeaEA/blib/lib/IO/Compress/RawDeflate.pm line 12.
  697. Compilation failed in require at t/102tied-rawdeflate.t line 12.
  698. BEGIN failed--compilation aborted at t/102tied-rawdeflate.t line 12.
  699. t/102tied-rawdeflate.t .......... Dubious, test returned 2 (wstat 512, 0x200)
  700. No subtests run
  701. t/102tied-zip.t ................. Can't locate Compress/Raw/Zlib.pm in @INC (@INC contains: t t/compress /root/.cpan/build/IO-Compress-2.046-IKeaEA/blib/lib /root/.cpan/build/IO-Compress-2.046-IKeaEA/blib/arch /usr/lib64/perl5/site_perl/5.8.8/x86_64-linux-thread-multi /usr/lib/perl5/site_perl/5.8.8 /usr/lib/perl5/site_perl /usr/lib64/perl5/vendor_perl/5.8.8/x86_64-linux-thread-multi /usr/lib/perl5/vendor_perl/5.8.8 /usr/lib/perl5/vendor_perl /usr/lib64/perl5/5.8.8/x86_64-linux-thread-multi /usr/lib/perl5/5.8.8 .) at /root/.cpan/build/IO-Compress-2.046-IKeaEA/blib/lib/IO/Compress/Adapter/Deflate.pm line 9.
  702. BEGIN failed--compilation aborted at /root/.cpan/build/IO-Compress-2.046-IKeaEA/blib/lib/IO/Compress/Adapter/Deflate.pm line 9.
  703. Compilation failed in require at /root/.cpan/build/IO-Compress-2.046-IKeaEA/blib/lib/IO/Compress/RawDeflate.pm line 12.
  704. BEGIN failed--compilation aborted at /root/.cpan/build/IO-Compress-2.046-IKeaEA/blib/lib/IO/Compress/RawDeflate.pm line 12.
  705. Compilation failed in require at /root/.cpan/build/IO-Compress-2.046-IKeaEA/blib/lib/IO/Compress/Zip.pm line 8.
  706. BEGIN failed--compilation aborted at /root/.cpan/build/IO-Compress-2.046-IKeaEA/blib/lib/IO/Compress/Zip.pm line 8.
  707. Compilation failed in require at t/102tied-zip.t line 12.
  708. BEGIN failed--compilation aborted at t/102tied-zip.t line 12.
  709. t/102tied-zip.t ................. Dubious, test returned 2 (wstat 512, 0x200)
  710. No subtests run
  711. t/103newtied-bzip2.t ............ Can't locate Compress/Raw/Bzip2.pm in @INC (@INC contains: t t/compress /root/.cpan/build/IO-Compress-2.046-IKeaEA/blib/lib /root/.cpan/build/IO-Compress-2.046-IKeaEA/blib/arch /usr/lib64/perl5/site_perl/5.8.8/x86_64-linux-thread-multi /usr/lib/perl5/site_perl/5.8.8 /usr/lib/perl5/site_perl /usr/lib64/perl5/vendor_perl/5.8.8/x86_64-linux-thread-multi /usr/lib/perl5/vendor_perl/5.8.8 /usr/lib/perl5/vendor_perl /usr/lib64/perl5/5.8.8/x86_64-linux-thread-multi /usr/lib/perl5/5.8.8 .) at /root/.cpan/build/IO-Compress-2.046-IKeaEA/blib/lib/IO/Compress/Adapter/Bzip2.pm line 9.
  712. BEGIN failed--compilation aborted at /root/.cpan/build/IO-Compress-2.046-IKeaEA/blib/lib/IO/Compress/Adapter/Bzip2.pm line 9.
  713. Compilation failed in require at /root/.cpan/build/IO-Compress-2.046-IKeaEA/blib/lib/IO/Compress/Bzip2.pm line 11.
  714. BEGIN failed--compilation aborted at /root/.cpan/build/IO-Compress-2.046-IKeaEA/blib/lib/IO/Compress/Bzip2.pm line 11.
  715. Compilation failed in require at t/103newtied-bzip2.t line 12.
  716. BEGIN failed--compilation aborted at t/103newtied-bzip2.t line 12.
  717. t/103newtied-bzip2.t ............ Dubious, test returned 2 (wstat 512, 0x200)
  718. No subtests run
  719. t/103newtied-deflate.t .......... Can't locate Compress/Raw/Zlib.pm in @INC (@INC contains: t t/compress /root/.cpan/build/IO-Compress-2.046-IKeaEA/blib/lib /root/.cpan/build/IO-Compress-2.046-IKeaEA/blib/arch /usr/lib64/perl5/site_perl/5.8.8/x86_64-linux-thread-multi /usr/lib/perl5/site_perl/5.8.8 /usr/lib/perl5/site_perl /usr/lib64/perl5/vendor_perl/5.8.8/x86_64-linux-thread-multi /usr/lib/perl5/vendor_perl/5.8.8 /usr/lib/perl5/vendor_perl /usr/lib64/perl5/5.8.8/x86_64-linux-thread-multi /usr/lib/perl5/5.8.8 .) at /root/.cpan/build/IO-Compress-2.046-IKeaEA/blib/lib/IO/Compress/Adapter/Deflate.pm line 9.
  720. BEGIN failed--compilation aborted at /root/.cpan/build/IO-Compress-2.046-IKeaEA/blib/lib/IO/Compress/Adapter/Deflate.pm line 9.
  721. Compilation failed in require at /root/.cpan/build/IO-Compress-2.046-IKeaEA/blib/lib/IO/Compress/RawDeflate.pm line 12.
  722. BEGIN failed--compilation aborted at /root/.cpan/build/IO-Compress-2.046-IKeaEA/blib/lib/IO/Compress/RawDeflate.pm line 12.
  723. Compilation failed in require at /root/.cpan/build/IO-Compress-2.046-IKeaEA/blib/lib/IO/Compress/Deflate.pm line 9.
  724. BEGIN failed--compilation aborted at /root/.cpan/build/IO-Compress-2.046-IKeaEA/blib/lib/IO/Compress/Deflate.pm line 9.
  725. Compilation failed in require at t/103newtied-deflate.t line 12.
  726. BEGIN failed--compilation aborted at t/103newtied-deflate.t line 12.
  727. t/103newtied-deflate.t .......... Dubious, test returned 2 (wstat 512, 0x200)
  728. No subtests run
  729. t/103newtied-gzip.t ............. Can't locate Compress/Raw/Zlib.pm in @INC (@INC contains: t t/compress /root/.cpan/build/IO-Compress-2.046-IKeaEA/blib/lib /root/.cpan/build/IO-Compress-2.046-IKeaEA/blib/arch /usr/lib64/perl5/site_perl/5.8.8/x86_64-linux-thread-multi /usr/lib/perl5/site_perl/5.8.8 /usr/lib/perl5/site_perl /usr/lib64/perl5/vendor_perl/5.8.8/x86_64-linux-thread-multi /usr/lib/perl5/vendor_perl/5.8.8 /usr/lib/perl5/vendor_perl /usr/lib64/perl5/5.8.8/x86_64-linux-thread-multi /usr/lib/perl5/5.8.8 .) at /root/.cpan/build/IO-Compress-2.046-IKeaEA/blib/lib/IO/Compress/Adapter/Deflate.pm line 9.
  730. BEGIN failed--compilation aborted at /root/.cpan/build/IO-Compress-2.046-IKeaEA/blib/lib/IO/Compress/Adapter/Deflate.pm line 9.
  731. Compilation failed in require at /root/.cpan/build/IO-Compress-2.046-IKeaEA/blib/lib/IO/Compress/RawDeflate.pm line 12.
  732. BEGIN failed--compilation aborted at /root/.cpan/build/IO-Compress-2.046-IKeaEA/blib/lib/IO/Compress/RawDeflate.pm line 12.
  733. Compilation failed in require at /root/.cpan/build/IO-Compress-2.046-IKeaEA/blib/lib/IO/Compress/Gzip.pm line 11.
  734. BEGIN failed--compilation aborted at /root/.cpan/build/IO-Compress-2.046-IKeaEA/blib/lib/IO/Compress/Gzip.pm line 11.
  735. Compilation failed in require at t/103newtied-gzip.t line 12.
  736. BEGIN failed--compilation aborted at t/103newtied-gzip.t line 12.
  737. t/103newtied-gzip.t ............. Dubious, test returned 2 (wstat 512, 0x200)
  738. No subtests run
  739. t/103newtied-rawdeflate.t ....... Can't locate Compress/Raw/Zlib.pm in @INC (@INC contains: t t/compress /root/.cpan/build/IO-Compress-2.046-IKeaEA/blib/lib /root/.cpan/build/IO-Compress-2.046-IKeaEA/blib/arch /usr/lib64/perl5/site_perl/5.8.8/x86_64-linux-thread-multi /usr/lib/perl5/site_perl/5.8.8 /usr/lib/perl5/site_perl /usr/lib64/perl5/vendor_perl/5.8.8/x86_64-linux-thread-multi /usr/lib/perl5/vendor_perl/5.8.8 /usr/lib/perl5/vendor_perl /usr/lib64/perl5/5.8.8/x86_64-linux-thread-multi /usr/lib/perl5/5.8.8 .) at /root/.cpan/build/IO-Compress-2.046-IKeaEA/blib/lib/IO/Compress/Adapter/Deflate.pm line 9.
  740. BEGIN failed--compilation aborted at /root/.cpan/build/IO-Compress-2.046-IKeaEA/blib/lib/IO/Compress/Adapter/Deflate.pm line 9.
  741. Compilation failed in require at /root/.cpan/build/IO-Compress-2.046-IKeaEA/blib/lib/IO/Compress/RawDeflate.pm line 12.
  742. BEGIN failed--compilation aborted at /root/.cpan/build/IO-Compress-2.046-IKeaEA/blib/lib/IO/Compress/RawDeflate.pm line 12.
  743. Compilation failed in require at t/103newtied-rawdeflate.t line 12.
  744. BEGIN failed--compilation aborted at t/103newtied-rawdeflate.t line 12.
  745. t/103newtied-rawdeflate.t ....... Dubious, test returned 2 (wstat 512, 0x200)
  746. No subtests run
  747. t/103newtied-zip.t .............. Can't locate Compress/Raw/Zlib.pm in @INC (@INC contains: t t/compress /root/.cpan/build/IO-Compress-2.046-IKeaEA/blib/lib /root/.cpan/build/IO-Compress-2.046-IKeaEA/blib/arch /usr/lib64/perl5/site_perl/5.8.8/x86_64-linux-thread-multi /usr/lib/perl5/site_perl/5.8.8 /usr/lib/perl5/site_perl /usr/lib64/perl5/vendor_perl/5.8.8/x86_64-linux-thread-multi /usr/lib/perl5/vendor_perl/5.8.8 /usr/lib/perl5/vendor_perl /usr/lib64/perl5/5.8.8/x86_64-linux-thread-multi /usr/lib/perl5/5.8.8 .) at /root/.cpan/build/IO-Compress-2.046-IKeaEA/blib/lib/IO/Compress/Adapter/Deflate.pm line 9.
  748. BEGIN failed--compilation aborted at /root/.cpan/build/IO-Compress-2.046-IKeaEA/blib/lib/IO/Compress/Adapter/Deflate.pm line 9.
  749. Compilation failed in require at /root/.cpan/build/IO-Compress-2.046-IKeaEA/blib/lib/IO/Compress/RawDeflate.pm line 12.
  750. BEGIN failed--compilation aborted at /root/.cpan/build/IO-Compress-2.046-IKeaEA/blib/lib/IO/Compress/RawDeflate.pm line 12.
  751. Compilation failed in require at /root/.cpan/build/IO-Compress-2.046-IKeaEA/blib/lib/IO/Compress/Zip.pm line 8.
  752. BEGIN failed--compilation aborted at /root/.cpan/build/IO-Compress-2.046-IKeaEA/blib/lib/IO/Compress/Zip.pm line 8.
  753. Compilation failed in require at t/103newtied-zip.t line 12.
  754. BEGIN failed--compilation aborted at t/103newtied-zip.t line 12.
  755. t/103newtied-zip.t .............. Dubious, test returned 2 (wstat 512, 0x200)
  756. No subtests run
  757. t/104destroy-bzip2.t ............ Can't locate Compress/Raw/Bzip2.pm in @INC (@INC contains: t t/compress /root/.cpan/build/IO-Compress-2.046-IKeaEA/blib/lib /root/.cpan/build/IO-Compress-2.046-IKeaEA/blib/arch /usr/lib64/perl5/site_perl/5.8.8/x86_64-linux-thread-multi /usr/lib/perl5/site_perl/5.8.8 /usr/lib/perl5/site_perl /usr/lib64/perl5/vendor_perl/5.8.8/x86_64-linux-thread-multi /usr/lib/perl5/vendor_perl/5.8.8 /usr/lib/perl5/vendor_perl /usr/lib64/perl5/5.8.8/x86_64-linux-thread-multi /usr/lib/perl5/5.8.8 .) at /root/.cpan/build/IO-Compress-2.046-IKeaEA/blib/lib/IO/Compress/Adapter/Bzip2.pm line 9.
  758. BEGIN failed--compilation aborted at /root/.cpan/build/IO-Compress-2.046-IKeaEA/blib/lib/IO/Compress/Adapter/Bzip2.pm line 9.
  759. Compilation failed in require at /root/.cpan/build/IO-Compress-2.046-IKeaEA/blib/lib/IO/Compress/Bzip2.pm line 11.
  760. BEGIN failed--compilation aborted at /root/.cpan/build/IO-Compress-2.046-IKeaEA/blib/lib/IO/Compress/Bzip2.pm line 11.
  761. Compilation failed in require at t/104destroy-bzip2.t line 12.
  762. BEGIN failed--compilation aborted at t/104destroy-bzip2.t line 12.
  763. t/104destroy-bzip2.t ............ Dubious, test returned 2 (wstat 512, 0x200)
  764. No subtests run
  765. t/104destroy-deflate.t .......... Can't locate Compress/Raw/Zlib.pm in @INC (@INC contains: t t/compress /root/.cpan/build/IO-Compress-2.046-IKeaEA/blib/lib /root/.cpan/build/IO-Compress-2.046-IKeaEA/blib/arch /usr/lib64/perl5/site_perl/5.8.8/x86_64-linux-thread-multi /usr/lib/perl5/site_perl/5.8.8 /usr/lib/perl5/site_perl /usr/lib64/perl5/vendor_perl/5.8.8/x86_64-linux-thread-multi /usr/lib/perl5/vendor_perl/5.8.8 /usr/lib/perl5/vendor_perl /usr/lib64/perl5/5.8.8/x86_64-linux-thread-multi /usr/lib/perl5/5.8.8 .) at /root/.cpan/build/IO-Compress-2.046-IKeaEA/blib/lib/IO/Compress/Adapter/Deflate.pm line 9.
  766. BEGIN failed--compilation aborted at /root/.cpan/build/IO-Compress-2.046-IKeaEA/blib/lib/IO/Compress/Adapter/Deflate.pm line 9.
  767. Compilation failed in require at /root/.cpan/build/IO-Compress-2.046-IKeaEA/blib/lib/IO/Compress/RawDeflate.pm line 12.
  768. BEGIN failed--compilation aborted at /root/.cpan/build/IO-Compress-2.046-IKeaEA/blib/lib/IO/Compress/RawDeflate.pm line 12.
  769. Compilation failed in require at /root/.cpan/build/IO-Compress-2.046-IKeaEA/blib/lib/IO/Compress/Deflate.pm line 9.
  770. BEGIN failed--compilation aborted at /root/.cpan/build/IO-Compress-2.046-IKeaEA/blib/lib/IO/Compress/Deflate.pm line 9.
  771. Compilation failed in require at t/104destroy-deflate.t line 12.
  772. BEGIN failed--compilation aborted at t/104destroy-deflate.t line 12.
  773. t/104destroy-deflate.t .......... Dubious, test returned 2 (wstat 512, 0x200)
  774. No subtests run
  775. t/104destroy-gzip.t ............. Can't locate Compress/Raw/Zlib.pm in @INC (@INC contains: t t/compress /root/.cpan/build/IO-Compress-2.046-IKeaEA/blib/lib /root/.cpan/build/IO-Compress-2.046-IKeaEA/blib/arch /usr/lib64/perl5/site_perl/5.8.8/x86_64-linux-thread-multi /usr/lib/perl5/site_perl/5.8.8 /usr/lib/perl5/site_perl /usr/lib64/perl5/vendor_perl/5.8.8/x86_64-linux-thread-multi /usr/lib/perl5/vendor_perl/5.8.8 /usr/lib/perl5/vendor_perl /usr/lib64/perl5/5.8.8/x86_64-linux-thread-multi /usr/lib/perl5/5.8.8 .) at /root/.cpan/build/IO-Compress-2.046-IKeaEA/blib/lib/IO/Compress/Adapter/Deflate.pm line 9.
  776. BEGIN failed--compilation aborted at /root/.cpan/build/IO-Compress-2.046-IKeaEA/blib/lib/IO/Compress/Adapter/Deflate.pm line 9.
  777. Compilation failed in require at /root/.cpan/build/IO-Compress-2.046-IKeaEA/blib/lib/IO/Compress/RawDeflate.pm line 12.
  778. BEGIN failed--compilation aborted at /root/.cpan/build/IO-Compress-2.046-IKeaEA/blib/lib/IO/Compress/RawDeflate.pm line 12.
  779. Compilation failed in require at /root/.cpan/build/IO-Compress-2.046-IKeaEA/blib/lib/IO/Compress/Gzip.pm line 11.
  780. BEGIN failed--compilation aborted at /root/.cpan/build/IO-Compress-2.046-IKeaEA/blib/lib/IO/Compress/Gzip.pm line 11.
  781. Compilation failed in require at t/104destroy-gzip.t line 12.
  782. BEGIN failed--compilation aborted at t/104destroy-gzip.t line 12.
  783. t/104destroy-gzip.t ............. Dubious, test returned 2 (wstat 512, 0x200)
  784. No subtests run
  785. t/104destroy-rawdeflate.t ....... Can't locate Compress/Raw/Zlib.pm in @INC (@INC contains: t t/compress /root/.cpan/build/IO-Compress-2.046-IKeaEA/blib/lib /root/.cpan/build/IO-Compress-2.046-IKeaEA/blib/arch /usr/lib64/perl5/site_perl/5.8.8/x86_64-linux-thread-multi /usr/lib/perl5/site_perl/5.8.8 /usr/lib/perl5/site_perl /usr/lib64/perl5/vendor_perl/5.8.8/x86_64-linux-thread-multi /usr/lib/perl5/vendor_perl/5.8.8 /usr/lib/perl5/vendor_perl /usr/lib64/perl5/5.8.8/x86_64-linux-thread-multi /usr/lib/perl5/5.8.8 .) at /root/.cpan/build/IO-Compress-2.046-IKeaEA/blib/lib/IO/Compress/Adapter/Deflate.pm line 9.
  786. BEGIN failed--compilation aborted at /root/.cpan/build/IO-Compress-2.046-IKeaEA/blib/lib/IO/Compress/Adapter/Deflate.pm line 9.
  787. Compilation failed in require at /root/.cpan/build/IO-Compress-2.046-IKeaEA/blib/lib/IO/Compress/RawDeflate.pm line 12.
  788. BEGIN failed--compilation aborted at /root/.cpan/build/IO-Compress-2.046-IKeaEA/blib/lib/IO/Compress/RawDeflate.pm line 12.
  789. Compilation failed in require at t/104destroy-rawdeflate.t line 12.
  790. BEGIN failed--compilation aborted at t/104destroy-rawdeflate.t line 12.
  791. t/104destroy-rawdeflate.t ....... Dubious, test returned 2 (wstat 512, 0x200)
  792. No subtests run
  793. t/104destroy-zip.t .............. Can't locate Compress/Raw/Zlib.pm in @INC (@INC contains: t t/compress /root/.cpan/build/IO-Compress-2.046-IKeaEA/blib/lib /root/.cpan/build/IO-Compress-2.046-IKeaEA/blib/arch /usr/lib64/perl5/site_perl/5.8.8/x86_64-linux-thread-multi /usr/lib/perl5/site_perl/5.8.8 /usr/lib/perl5/site_perl /usr/lib64/perl5/vendor_perl/5.8.8/x86_64-linux-thread-multi /usr/lib/perl5/vendor_perl/5.8.8 /usr/lib/perl5/vendor_perl /usr/lib64/perl5/5.8.8/x86_64-linux-thread-multi /usr/lib/perl5/5.8.8 .) at /root/.cpan/build/IO-Compress-2.046-IKeaEA/blib/lib/IO/Compress/Adapter/Deflate.pm line 9.
  794. BEGIN failed--compilation aborted at /root/.cpan/build/IO-Compress-2.046-IKeaEA/blib/lib/IO/Compress/Adapter/Deflate.pm line 9.
  795. Compilation failed in require at /root/.cpan/build/IO-Compress-2.046-IKeaEA/blib/lib/IO/Compress/RawDeflate.pm line 12.
  796. BEGIN failed--compilation aborted at /root/.cpan/build/IO-Compress-2.046-IKeaEA/blib/lib/IO/Compress/RawDeflate.pm line 12.
  797. Compilation failed in require at /root/.cpan/build/IO-Compress-2.046-IKeaEA/blib/lib/IO/Compress/Zip.pm line 8.
  798. BEGIN failed--compilation aborted at /root/.cpan/build/IO-Compress-2.046-IKeaEA/blib/lib/IO/Compress/Zip.pm line 8.
  799. Compilation failed in require at t/104destroy-zip.t line 12.
  800. BEGIN failed--compilation aborted at t/104destroy-zip.t line 12.
  801. t/104destroy-zip.t .............. Dubious, test returned 2 (wstat 512, 0x200)
  802. No subtests run
  803. t/105oneshot-bzip2.t ............ Can't locate Compress/Raw/Bzip2.pm in @INC (@INC contains: t t/compress /root/.cpan/build/IO-Compress-2.046-IKeaEA/blib/lib /root/.cpan/build/IO-Compress-2.046-IKeaEA/blib/arch /usr/lib64/perl5/site_perl/5.8.8/x86_64-linux-thread-multi /usr/lib/perl5/site_perl/5.8.8 /usr/lib/perl5/site_perl /usr/lib64/perl5/vendor_perl/5.8.8/x86_64-linux-thread-multi /usr/lib/perl5/vendor_perl/5.8.8 /usr/lib/perl5/vendor_perl /usr/lib64/perl5/5.8.8/x86_64-linux-thread-multi /usr/lib/perl5/5.8.8 .) at /root/.cpan/build/IO-Compress-2.046-IKeaEA/blib/lib/IO/Compress/Adapter/Bzip2.pm line 9.
  804. BEGIN failed--compilation aborted at /root/.cpan/build/IO-Compress-2.046-IKeaEA/blib/lib/IO/Compress/Adapter/Bzip2.pm line 9.
  805. Compilation failed in require at /root/.cpan/build/IO-Compress-2.046-IKeaEA/blib/lib/IO/Compress/Bzip2.pm line 11.
  806. BEGIN failed--compilation aborted at /root/.cpan/build/IO-Compress-2.046-IKeaEA/blib/lib/IO/Compress/Bzip2.pm line 11.
  807. Compilation failed in require at t/105oneshot-bzip2.t line 12.
  808. BEGIN failed--compilation aborted at t/105oneshot-bzip2.t line 12.
  809. t/105oneshot-bzip2.t ............ Dubious, test returned 2 (wstat 512, 0x200)
  810. No subtests run
  811. t/105oneshot-deflate.t .......... Can't locate Compress/Raw/Zlib.pm in @INC (@INC contains: t t/compress /root/.cpan/build/IO-Compress-2.046-IKeaEA/blib/lib /root/.cpan/build/IO-Compress-2.046-IKeaEA/blib/arch /usr/lib64/perl5/site_perl/5.8.8/x86_64-linux-thread-multi /usr/lib/perl5/site_perl/5.8.8 /usr/lib/perl5/site_perl /usr/lib64/perl5/vendor_perl/5.8.8/x86_64-linux-thread-multi /usr/lib/perl5/vendor_perl/5.8.8 /usr/lib/perl5/vendor_perl /usr/lib64/perl5/5.8.8/x86_64-linux-thread-multi /usr/lib/perl5/5.8.8 .) at /root/.cpan/build/IO-Compress-2.046-IKeaEA/blib/lib/IO/Compress/Adapter/Deflate.pm line 9.
  812. BEGIN failed--compilation aborted at /root/.cpan/build/IO-Compress-2.046-IKeaEA/blib/lib/IO/Compress/Adapter/Deflate.pm line 9.
  813. Compilation failed in require at /root/.cpan/build/IO-Compress-2.046-IKeaEA/blib/lib/IO/Compress/RawDeflate.pm line 12.
  814. BEGIN failed--compilation aborted at /root/.cpan/build/IO-Compress-2.046-IKeaEA/blib/lib/IO/Compress/RawDeflate.pm line 12.
  815. Compilation failed in require at /root/.cpan/build/IO-Compress-2.046-IKeaEA/blib/lib/IO/Compress/Deflate.pm line 9.
  816. BEGIN failed--compilation aborted at /root/.cpan/build/IO-Compress-2.046-IKeaEA/blib/lib/IO/Compress/Deflate.pm line 9.
  817. Compilation failed in require at t/105oneshot-deflate.t line 12.
  818. BEGIN failed--compilation aborted at t/105oneshot-deflate.t line 12.
  819. t/105oneshot-deflate.t .......... Dubious, test returned 2 (wstat 512, 0x200)
  820. No subtests run
  821. t/105oneshot-gzip-only.t ........ 1/71
  822. #     Failed test (t/105oneshot-gzip-only.t at line 28)
  823. #     Tried to use 'IO::Compress::Gzip'.
  824. #     Error:  Can't locate Compress/Raw/Zlib.pm in @INC (@INC contains: t t/compress /root/.cpan/build/IO-Compress-2.046-IKeaEA/blib/lib /root/.cpan/build/IO-Compress-2.046-IKeaEA/blib/arch /usr/lib64/perl5/site_perl/5.8.8/x86_64-linux-thread-multi /usr/lib/perl5/site_perl/5.8.8 /usr/lib/perl5/site_perl /usr/lib64/perl5/vendor_perl/5.8.8/x86_64-linux-thread-multi /usr/lib/perl5/vendor_perl/5.8.8 /usr/lib/perl5/vendor_perl /usr/lib64/perl5/5.8.8/x86_64-linux-thread-multi /usr/lib/perl5/5.8.8 .) at /root/.cpan/build/IO-Compress-2.046-IKeaEA/blib/lib/IO/Compress/Adapter/Deflate.pm line 9.
  825. # BEGIN failed--compilation aborted at t/105oneshot-gzip-only.t line 28.
  826. # Compilation failed in require at /root/.cpan/build/IO-Compress-2.046-IKeaEA/blib/lib/IO/Compress/RawDeflate.pm line 12.
  827. # BEGIN failed--compilation aborted at /root/.cpan/build/IO-Compress-2.046-IKeaEA/blib/lib/IO/Compress/RawDeflate.pm line 12.
  828. # Compilation failed in require at /root/.cpan/build/IO-Compress-2.046-IKeaEA/blib/lib/IO/Compress/Gzip.pm line 11.
  829. # BEGIN failed--compilation aborted at /root/.cpan/build/IO-Compress-2.046-IKeaEA/blib/lib/IO/Compress/Gzip.pm line 11.
  830. # Compilation failed in require at (eval 32) line 2.
  831. # BEGIN failed--compilation aborted at (eval 32) line 2.
  832. Global symbol "$GunzipError" requires explicit package name at t/105oneshot-gzip-only.t line 46.
  833. Execution of t/105oneshot-gzip-only.t aborted due to compilation errors.
  834. # Looks like you planned 71 tests but only ran 3.
  835. # Looks like your test died just after 3.
  836. t/105oneshot-gzip-only.t ........ Dubious, test returned 255 (wstat 65280, 0xff00)
  837. Failed 69/71 subtests
  838. t/105oneshot-gzip.t ............. Can't locate Compress/Raw/Zlib.pm in @INC (@INC contains: t t/compress /root/.cpan/build/IO-Compress-2.046-IKeaEA/blib/lib /root/.cpan/build/IO-Compress-2.046-IKeaEA/blib/arch /usr/lib64/perl5/site_perl/5.8.8/x86_64-linux-thread-multi /usr/lib/perl5/site_perl/5.8.8 /usr/lib/perl5/site_perl /usr/lib64/perl5/vendor_perl/5.8.8/x86_64-linux-thread-multi /usr/lib/perl5/vendor_perl/5.8.8 /usr/lib/perl5/vendor_perl /usr/lib64/perl5/5.8.8/x86_64-linux-thread-multi /usr/lib/perl5/5.8.8 .) at /root/.cpan/build/IO-Compress-2.046-IKeaEA/blib/lib/IO/Compress/Adapter/Deflate.pm line 9.
  839. BEGIN failed--compilation aborted at /root/.cpan/build/IO-Compress-2.046-IKeaEA/blib/lib/IO/Compress/Adapter/Deflate.pm line 9.
  840. Compilation failed in require at /root/.cpan/build/IO-Compress-2.046-IKeaEA/blib/lib/IO/Compress/RawDeflate.pm line 12.
  841. BEGIN failed--compilation aborted at /root/.cpan/build/IO-Compress-2.046-IKeaEA/blib/lib/IO/Compress/RawDeflate.pm line 12.
  842. Compilation failed in require at /root/.cpan/build/IO-Compress-2.046-IKeaEA/blib/lib/IO/Compress/Gzip.pm line 11.
  843. BEGIN failed--compilation aborted at /root/.cpan/build/IO-Compress-2.046-IKeaEA/blib/lib/IO/Compress/Gzip.pm line 11.
  844. Compilation failed in require at t/105oneshot-gzip.t line 12.
  845. BEGIN failed--compilation aborted at t/105oneshot-gzip.t line 12.
  846. t/105oneshot-gzip.t ............. Dubious, test returned 2 (wstat 512, 0x200)
  847. No subtests run
  848. t/105oneshot-rawdeflate.t ....... Can't locate Compress/Raw/Zlib.pm in @INC (@INC contains: t t/compress /root/.cpan/build/IO-Compress-2.046-IKeaEA/blib/lib /root/.cpan/build/IO-Compress-2.046-IKeaEA/blib/arch /usr/lib64/perl5/site_perl/5.8.8/x86_64-linux-thread-multi /usr/lib/perl5/site_perl/5.8.8 /usr/lib/perl5/site_perl /usr/lib64/perl5/vendor_perl/5.8.8/x86_64-linux-thread-multi /usr/lib/perl5/vendor_perl/5.8.8 /usr/lib/perl5/vendor_perl /usr/lib64/perl5/5.8.8/x86_64-linux-thread-multi /usr/lib/perl5/5.8.8 .) at /root/.cpan/build/IO-Compress-2.046-IKeaEA/blib/lib/IO/Compress/Adapter/Deflate.pm line 9.
  849. BEGIN failed--compilation aborted at /root/.cpan/build/IO-Compress-2.046-IKeaEA/blib/lib/IO/Compress/Adapter/Deflate.pm line 9.
  850. Compilation failed in require at /root/.cpan/build/IO-Compress-2.046-IKeaEA/blib/lib/IO/Compress/RawDeflate.pm line 12.
  851. BEGIN failed--compilation aborted at /root/.cpan/build/IO-Compress-2.046-IKeaEA/blib/lib/IO/Compress/RawDeflate.pm line 12.
  852. Compilation failed in require at t/105oneshot-rawdeflate.t line 12.
  853. BEGIN failed--compilation aborted at t/105oneshot-rawdeflate.t line 12.
  854. t/105oneshot-rawdeflate.t ....... Dubious, test returned 2 (wstat 512, 0x200)
  855. No subtests run
  856. t/105oneshot-zip-bzip2-only.t ... skipped: IO::Compress::Bzip2 not available
  857. t/105oneshot-zip-only.t ......... 1/217
  858. #     Failed test (t/105oneshot-zip-only.t at line 30)
  859. #     Tried to use 'IO::Compress::Zip'.
  860. #     Error:  Can't locate Compress/Raw/Zlib.pm in @INC (@INC contains: t t/compress /root/.cpan/build/IO-Compress-2.046-IKeaEA/blib/lib /root/.cpan/build/IO-Compress-2.046-IKeaEA/blib/arch /usr/lib64/perl5/site_perl/5.8.8/x86_64-linux-thread-multi /usr/lib/perl5/site_perl/5.8.8 /usr/lib/perl5/site_perl /usr/lib64/perl5/vendor_perl/5.8.8/x86_64-linux-thread-multi /usr/lib/perl5/vendor_perl/5.8.8 /usr/lib/perl5/vendor_perl /usr/lib64/perl5/5.8.8/x86_64-linux-thread-multi /usr/lib/perl5/5.8.8 .) at /root/.cpan/build/IO-Compress-2.046-IKeaEA/blib/lib/IO/Compress/Adapter/Deflate.pm line 9.
  861. # BEGIN failed--compilation aborted at t/105oneshot-zip-only.t line 30.
  862. # Compilation failed in require at /root/.cpan/build/IO-Compress-2.046-IKeaEA/blib/lib/IO/Compress/RawDeflate.pm line 12.
  863. # BEGIN failed--compilation aborted at /root/.cpan/build/IO-Compress-2.046-IKeaEA/blib/lib/IO/Compress/RawDeflate.pm line 12.
  864. # Compilation failed in require at /root/.cpan/build/IO-Compress-2.046-IKeaEA/blib/lib/IO/Compress/Zip.pm line 8.
  865. # BEGIN failed--compilation aborted at /root/.cpan/build/IO-Compress-2.046-IKeaEA/blib/lib/IO/Compress/Zip.pm line 8.
  866. # Compilation failed in require at (eval 32) line 2.
  867. # BEGIN failed--compilation aborted at (eval 32) line 2.
  868. Global symbol "$UnzipError" requires explicit package name at t/105oneshot-zip-only.t line 46.
  869. Global symbol "$ZipError" requires explicit package name at t/105oneshot-zip-only.t line 187.
  870. Global symbol "$UnzipError" requires explicit package name at t/105oneshot-zip-only.t line 191.
  871. Global symbol "$ZipError" requires explicit package name at t/105oneshot-zip-only.t line 196.
  872. Global symbol "$ZipError" requires explicit package name at t/105oneshot-zip-only.t line 235.
  873. Global symbol "$UnzipError" requires explicit package name at t/105oneshot-zip-only.t line 241.
  874. Bareword "ZIP_CM_STORE" not allowed while "strict subs" in use at t/105oneshot-zip-only.t line 171.
  875. Bareword "ZIP_CM_DEFLATE" not allowed while "strict subs" in use at t/105oneshot-zip-only.t line 171.
  876. Bareword "ZIP_CM_STORE" not allowed while "strict subs" in use at t/105oneshot-zip-only.t line 213.
  877. Bareword "ZIP_CM_DEFLATE" not allowed while "strict subs" in use at t/105oneshot-zip-only.t line 213.
  878. Execution of t/105oneshot-zip-only.t aborted due to compilation errors.
  879. # Looks like you planned 217 tests but only ran 3.
  880. # Looks like your test died just after 3.
  881. t/105oneshot-zip-only.t ......... Dubious, test returned 255 (wstat 65280, 0xff00)
  882. Failed 215/217 subtests
  883. t/105oneshot-zip-store-only.t ... skipped: IO::Compress::Bzip2 not available
  884. t/105oneshot-zip.t .............. Can't locate Compress/Raw/Zlib.pm in @INC (@INC contains: t t/compress /root/.cpan/build/IO-Compress-2.046-IKeaEA/blib/lib /root/.cpan/build/IO-Compress-2.046-IKeaEA/blib/arch /usr/lib64/perl5/site_perl/5.8.8/x86_64-linux-thread-multi /usr/lib/perl5/site_perl/5.8.8 /usr/lib/perl5/site_perl /usr/lib64/perl5/vendor_perl/5.8.8/x86_64-linux-thread-multi /usr/lib/perl5/vendor_perl/5.8.8 /usr/lib/perl5/vendor_perl /usr/lib64/perl5/5.8.8/x86_64-linux-thread-multi /usr/lib/perl5/5.8.8 .) at /root/.cpan/build/IO-Compress-2.046-IKeaEA/blib/lib/IO/Compress/Adapter/Deflate.pm line 9.
  885. BEGIN failed--compilation aborted at /root/.cpan/build/IO-Compress-2.046-IKeaEA/blib/lib/IO/Compress/Adapter/Deflate.pm line 9.
  886. Compilation failed in require at /root/.cpan/build/IO-Compress-2.046-IKeaEA/blib/lib/IO/Compress/RawDeflate.pm line 12.
  887. BEGIN failed--compilation aborted at /root/.cpan/build/IO-Compress-2.046-IKeaEA/blib/lib/IO/Compress/RawDeflate.pm line 12.
  888. Compilation failed in require at /root/.cpan/build/IO-Compress-2.046-IKeaEA/blib/lib/IO/Compress/Zip.pm line 8.
  889. BEGIN failed--compilation aborted at /root/.cpan/build/IO-Compress-2.046-IKeaEA/blib/lib/IO/Compress/Zip.pm line 8.
  890. Compilation failed in require at t/105oneshot-zip.t line 12.
  891. BEGIN failed--compilation aborted at t/105oneshot-zip.t line 12.
  892. t/105oneshot-zip.t .............. Dubious, test returned 2 (wstat 512, 0x200)
  893. No subtests run
  894. t/106prime-bzip2.t .............. Can't locate Compress/Raw/Bzip2.pm in @INC (@INC contains: t t/compress /root/.cpan/build/IO-Compress-2.046-IKeaEA/blib/lib /root/.cpan/build/IO-Compress-2.046-IKeaEA/blib/arch /usr/lib64/perl5/site_perl/5.8.8/x86_64-linux-thread-multi /usr/lib/perl5/site_perl/5.8.8 /usr/lib/perl5/site_perl /usr/lib64/perl5/vendor_perl/5.8.8/x86_64-linux-thread-multi /usr/lib/perl5/vendor_perl/5.8.8 /usr/lib/perl5/vendor_perl /usr/lib64/perl5/5.8.8/x86_64-linux-thread-multi /usr/lib/perl5/5.8.8 .) at /root/.cpan/build/IO-Compress-2.046-IKeaEA/blib/lib/IO/Compress/Adapter/Bzip2.pm line 9.
  895. BEGIN failed--compilation aborted at /root/.cpan/build/IO-Compress-2.046-IKeaEA/blib/lib/IO/Compress/Adapter/Bzip2.pm line 9.
  896. Compilation failed in require at /root/.cpan/build/IO-Compress-2.046-IKeaEA/blib/lib/IO/Compress/Bzip2.pm line 11.
  897. BEGIN failed--compilation aborted at /root/.cpan/build/IO-Compress-2.046-IKeaEA/blib/lib/IO/Compress/Bzip2.pm line 11.
  898. Compilation failed in require at t/106prime-bzip2.t line 12.
  899. BEGIN failed--compilation aborted at t/106prime-bzip2.t line 12.
  900. t/106prime-bzip2.t .............. Dubious, test returned 2 (wstat 512, 0x200)
  901. No subtests run
  902. t/106prime-deflate.t ............ Can't locate Compress/Raw/Zlib.pm in @INC (@INC contains: t t/compress /root/.cpan/build/IO-Compress-2.046-IKeaEA/blib/lib /root/.cpan/build/IO-Compress-2.046-IKeaEA/blib/arch /usr/lib64/perl5/site_perl/5.8.8/x86_64-linux-thread-multi /usr/lib/perl5/site_perl/5.8.8 /usr/lib/perl5/site_perl /usr/lib64/perl5/vendor_perl/5.8.8/x86_64-linux-thread-multi /usr/lib/perl5/vendor_perl/5.8.8 /usr/lib/perl5/vendor_perl /usr/lib64/perl5/5.8.8/x86_64-linux-thread-multi /usr/lib/perl5/5.8.8 .) at /root/.cpan/build/IO-Compress-2.046-IKeaEA/blib/lib/IO/Compress/Adapter/Deflate.pm line 9.
  903. BEGIN failed--compilation aborted at /root/.cpan/build/IO-Compress-2.046-IKeaEA/blib/lib/IO/Compress/Adapter/Deflate.pm line 9.
  904. Compilation failed in require at /root/.cpan/build/IO-Compress-2.046-IKeaEA/blib/lib/IO/Compress/RawDeflate.pm line 12.
  905. BEGIN failed--compilation aborted at /root/.cpan/build/IO-Compress-2.046-IKeaEA/blib/lib/IO/Compress/RawDeflate.pm line 12.
  906. Compilation failed in require at /root/.cpan/build/IO-Compress-2.046-IKeaEA/blib/lib/IO/Compress/Deflate.pm line 9.
  907. BEGIN failed--compilation aborted at /root/.cpan/build/IO-Compress-2.046-IKeaEA/blib/lib/IO/Compress/Deflate.pm line 9.
  908. Compilation failed in require at t/106prime-deflate.t line 12.
  909. BEGIN failed--compilation aborted at t/106prime-deflate.t line 12.
  910. t/106prime-deflate.t ............ Dubious, test returned 2 (wstat 512, 0x200)
  911. No subtests run
  912. t/106prime-gzip.t ............... Can't locate Compress/Raw/Zlib.pm in @INC (@INC contains: t t/compress /root/.cpan/build/IO-Compress-2.046-IKeaEA/blib/lib /root/.cpan/build/IO-Compress-2.046-IKeaEA/blib/arch /usr/lib64/perl5/site_perl/5.8.8/x86_64-linux-thread-multi /usr/lib/perl5/site_perl/5.8.8 /usr/lib/perl5/site_perl /usr/lib64/perl5/vendor_perl/5.8.8/x86_64-linux-thread-multi /usr/lib/perl5/vendor_perl/5.8.8 /usr/lib/perl5/vendor_perl /usr/lib64/perl5/5.8.8/x86_64-linux-thread-multi /usr/lib/perl5/5.8.8 .) at /root/.cpan/build/IO-Compress-2.046-IKeaEA/blib/lib/IO/Compress/Adapter/Deflate.pm line 9.
  913. BEGIN failed--compilation aborted at /root/.cpan/build/IO-Compress-2.046-IKeaEA/blib/lib/IO/Compress/Adapter/Deflate.pm line 9.
  914. Compilation failed in require at /root/.cpan/build/IO-Compress-2.046-IKeaEA/blib/lib/IO/Compress/RawDeflate.pm line 12.
  915. BEGIN failed--compilation aborted at /root/.cpan/build/IO-Compress-2.046-IKeaEA/blib/lib/IO/Compress/RawDeflate.pm line 12.
  916. Compilation failed in require at /root/.cpan/build/IO-Compress-2.046-IKeaEA/blib/lib/IO/Compress/Gzip.pm line 11.
  917. BEGIN failed--compilation aborted at /root/.cpan/build/IO-Compress-2.046-IKeaEA/blib/lib/IO/Compress/Gzip.pm line 11.
  918. Compilation failed in require at t/106prime-gzip.t line 12.
  919. BEGIN failed--compilation aborted at t/106prime-gzip.t line 12.
  920. t/106prime-gzip.t ............... Dubious, test returned 2 (wstat 512, 0x200)
  921. No subtests run
  922. t/106prime-rawdeflate.t ......... Can't locate Compress/Raw/Zlib.pm in @INC (@INC contains: t t/compress /root/.cpan/build/IO-Compress-2.046-IKeaEA/blib/lib /root/.cpan/build/IO-Compress-2.046-IKeaEA/blib/arch /usr/lib64/perl5/site_perl/5.8.8/x86_64-linux-thread-multi /usr/lib/perl5/site_perl/5.8.8 /usr/lib/perl5/site_perl /usr/lib64/perl5/vendor_perl/5.8.8/x86_64-linux-thread-multi /usr/lib/perl5/vendor_perl/5.8.8 /usr/lib/perl5/vendor_perl /usr/lib64/perl5/5.8.8/x86_64-linux-thread-multi /usr/lib/perl5/5.8.8 .) at /root/.cpan/build/IO-Compress-2.046-IKeaEA/blib/lib/IO/Compress/Adapter/Deflate.pm line 9.
  923. BEGIN failed--compilation aborted at /root/.cpan/build/IO-Compress-2.046-IKeaEA/blib/lib/IO/Compress/Adapter/Deflate.pm line 9.
  924. Compilation failed in require at /root/.cpan/build/IO-Compress-2.046-IKeaEA/blib/lib/IO/Compress/RawDeflate.pm line 12.
  925. BEGIN failed--compilation aborted at /root/.cpan/build/IO-Compress-2.046-IKeaEA/blib/lib/IO/Compress/RawDeflate.pm line 12.
  926. Compilation failed in require at t/106prime-rawdeflate.t line 12.
  927. BEGIN failed--compilation aborted at t/106prime-rawdeflate.t line 12.
  928. t/106prime-rawdeflate.t ......... Dubious, test returned 2 (wstat 512, 0x200)
  929. No subtests run
  930. t/106prime-zip.t ................ Can't locate Compress/Raw/Zlib.pm in @INC (@INC contains: t t/compress /root/.cpan/build/IO-Compress-2.046-IKeaEA/blib/lib /root/.cpan/build/IO-Compress-2.046-IKeaEA/blib/arch /usr/lib64/perl5/site_perl/5.8.8/x86_64-linux-thread-multi /usr/lib/perl5/site_perl/5.8.8 /usr/lib/perl5/site_perl /usr/lib64/perl5/vendor_perl/5.8.8/x86_64-linux-thread-multi /usr/lib/perl5/vendor_perl/5.8.8 /usr/lib/perl5/vendor_perl /usr/lib64/perl5/5.8.8/x86_64-linux-thread-multi /usr/lib/perl5/5.8.8 .) at /root/.cpan/build/IO-Compress-2.046-IKeaEA/blib/lib/IO/Compress/Adapter/Deflate.pm line 9.
  931. BEGIN failed--compilation aborted at /root/.cpan/build/IO-Compress-2.046-IKeaEA/blib/lib/IO/Compress/Adapter/Deflate.pm line 9.
  932. Compilation failed in require at /root/.cpan/build/IO-Compress-2.046-IKeaEA/blib/lib/IO/Compress/RawDeflate.pm line 12.
  933. BEGIN failed--compilation aborted at /root/.cpan/build/IO-Compress-2.046-IKeaEA/blib/lib/IO/Compress/RawDeflate.pm line 12.
  934. Compilation failed in require at /root/.cpan/build/IO-Compress-2.046-IKeaEA/blib/lib/IO/Compress/Zip.pm line 8.
  935. BEGIN failed--compilation aborted at /root/.cpan/build/IO-Compress-2.046-IKeaEA/blib/lib/IO/Compress/Zip.pm line 8.
  936. Compilation failed in require at t/106prime-zip.t line 12.
  937. BEGIN failed--compilation aborted at t/106prime-zip.t line 12.
  938. t/106prime-zip.t ................ Dubious, test returned 2 (wstat 512, 0x200)
  939. No subtests run
  940. t/107multi-bzip2.t .............. Can't locate Compress/Raw/Bzip2.pm in @INC (@INC contains: t t/compress /root/.cpan/build/IO-Compress-2.046-IKeaEA/blib/lib /root/.cpan/build/IO-Compress-2.046-IKeaEA/blib/arch /usr/lib64/perl5/site_perl/5.8.8/x86_64-linux-thread-multi /usr/lib/perl5/site_perl/5.8.8 /usr/lib/perl5/site_perl /usr/lib64/perl5/vendor_perl/5.8.8/x86_64-linux-thread-multi /usr/lib/perl5/vendor_perl/5.8.8 /usr/lib/perl5/vendor_perl /usr/lib64/perl5/5.8.8/x86_64-linux-thread-multi /usr/lib/perl5/5.8.8 .) at /root/.cpan/build/IO-Compress-2.046-IKeaEA/blib/lib/IO/Compress/Adapter/Bzip2.pm line 9.
  941. BEGIN failed--compilation aborted at /root/.cpan/build/IO-Compress-2.046-IKeaEA/blib/lib/IO/Compress/Adapter/Bzip2.pm line 9.
  942. Compilation failed in require at /root/.cpan/build/IO-Compress-2.046-IKeaEA/blib/lib/IO/Compress/Bzip2.pm line 11.
  943. BEGIN failed--compilation aborted at /root/.cpan/build/IO-Compress-2.046-IKeaEA/blib/lib/IO/Compress/Bzip2.pm line 11.
  944. Compilation failed in require at t/107multi-bzip2.t line 12.
  945. BEGIN failed--compilation aborted at t/107multi-bzip2.t line 12.
  946. t/107multi-bzip2.t .............. Dubious, test returned 2 (wstat 512, 0x200)
  947. No subtests run
  948. t/107multi-deflate.t ............ Can't locate Compress/Raw/Zlib.pm in @INC (@INC contains: t t/compress /root/.cpan/build/IO-Compress-2.046-IKeaEA/blib/lib /root/.cpan/build/IO-Compress-2.046-IKeaEA/blib/arch /usr/lib64/perl5/site_perl/5.8.8/x86_64-linux-thread-multi /usr/lib/perl5/site_perl/5.8.8 /usr/lib/perl5/site_perl /usr/lib64/perl5/vendor_perl/5.8.8/x86_64-linux-thread-multi /usr/lib/perl5/vendor_perl/5.8.8 /usr/lib/perl5/vendor_perl /usr/lib64/perl5/5.8.8/x86_64-linux-thread-multi /usr/lib/perl5/5.8.8 .) at /root/.cpan/build/IO-Compress-2.046-IKeaEA/blib/lib/IO/Compress/Adapter/Deflate.pm line 9.
  949. BEGIN failed--compilation aborted at /root/.cpan/build/IO-Compress-2.046-IKeaEA/blib/lib/IO/Compress/Adapter/Deflate.pm line 9.
  950. Compilation failed in require at /root/.cpan/build/IO-Compress-2.046-IKeaEA/blib/lib/IO/Compress/RawDeflate.pm line 12.
  951. BEGIN failed--compilation aborted at /root/.cpan/build/IO-Compress-2.046-IKeaEA/blib/lib/IO/Compress/RawDeflate.pm line 12.
  952. Compilation failed in require at /root/.cpan/build/IO-Compress-2.046-IKeaEA/blib/lib/IO/Compress/Deflate.pm line 9.
  953. BEGIN failed--compilation aborted at /root/.cpan/build/IO-Compress-2.046-IKeaEA/blib/lib/IO/Compress/Deflate.pm line 9.
  954. Compilation failed in require at t/107multi-deflate.t line 12.
  955. BEGIN failed--compilation aborted at t/107multi-deflate.t line 12.
  956. t/107multi-deflate.t ............ Dubious, test returned 2 (wstat 512, 0x200)
  957. No subtests run
  958. t/107multi-gzip.t ............... Can't locate Compress/Raw/Zlib.pm in @INC (@INC contains: t t/compress /root/.cpan/build/IO-Compress-2.046-IKeaEA/blib/lib /root/.cpan/build/IO-Compress-2.046-IKeaEA/blib/arch /usr/lib64/perl5/site_perl/5.8.8/x86_64-linux-thread-multi /usr/lib/perl5/site_perl/5.8.8 /usr/lib/perl5/site_perl /usr/lib64/perl5/vendor_perl/5.8.8/x86_64-linux-thread-multi /usr/lib/perl5/vendor_perl/5.8.8 /usr/lib/perl5/vendor_perl /usr/lib64/perl5/5.8.8/x86_64-linux-thread-multi /usr/lib/perl5/5.8.8 .) at /root/.cpan/build/IO-Compress-2.046-IKeaEA/blib/lib/IO/Compress/Adapter/Deflate.pm line 9.
  959. BEGIN failed--compilation aborted at /root/.cpan/build/IO-Compress-2.046-IKeaEA/blib/lib/IO/Compress/Adapter/Deflate.pm line 9.
  960. Compilation failed in require at /root/.cpan/build/IO-Compress-2.046-IKeaEA/blib/lib/IO/Compress/RawDeflate.pm line 12.
  961. BEGIN failed--compilation aborted at /root/.cpan/build/IO-Compress-2.046-IKeaEA/blib/lib/IO/Compress/RawDeflate.pm line 12.
  962. Compilation failed in require at /root/.cpan/build/IO-Compress-2.046-IKeaEA/blib/lib/IO/Compress/Gzip.pm line 11.
  963. BEGIN failed--compilation aborted at /root/.cpan/build/IO-Compress-2.046-IKeaEA/blib/lib/IO/Compress/Gzip.pm line 11.
  964. Compilation failed in require at t/107multi-gzip.t line 12.
  965. BEGIN failed--compilation aborted at t/107multi-gzip.t line 12.
  966. t/107multi-gzip.t ............... Dubious, test returned 2 (wstat 512, 0x200)
  967. No subtests run
  968. t/107multi-rawdeflate.t ......... Can't locate Compress/Raw/Zlib.pm in @INC (@INC contains: t t/compress /root/.cpan/build/IO-Compress-2.046-IKeaEA/blib/lib /root/.cpan/build/IO-Compress-2.046-IKeaEA/blib/arch /usr/lib64/perl5/site_perl/5.8.8/x86_64-linux-thread-multi /usr/lib/perl5/site_perl/5.8.8 /usr/lib/perl5/site_perl /usr/lib64/perl5/vendor_perl/5.8.8/x86_64-linux-thread-multi /usr/lib/perl5/vendor_perl/5.8.8 /usr/lib/perl5/vendor_perl /usr/lib64/perl5/5.8.8/x86_64-linux-thread-multi /usr/lib/perl5/5.8.8 .) at /root/.cpan/build/IO-Compress-2.046-IKeaEA/blib/lib/IO/Compress/Adapter/Deflate.pm line 9.
  969. BEGIN failed--compilation aborted at /root/.cpan/build/IO-Compress-2.046-IKeaEA/blib/lib/IO/Compress/Adapter/Deflate.pm line 9.
  970. Compilation failed in require at /root/.cpan/build/IO-Compress-2.046-IKeaEA/blib/lib/IO/Compress/RawDeflate.pm line 12.
  971. BEGIN failed--compilation aborted at /root/.cpan/build/IO-Compress-2.046-IKeaEA/blib/lib/IO/Compress/RawDeflate.pm line 12.
  972. Compilation failed in require at t/107multi-rawdeflate.t line 12.
  973. BEGIN failed--compilation aborted at t/107multi-rawdeflate.t line 12.
  974. t/107multi-rawdeflate.t ......... Dubious, test returned 2 (wstat 512, 0x200)
  975. No subtests run
  976. t/107multi-zip.t ................ Can't locate Compress/Raw/Zlib.pm in @INC (@INC contains: t t/compress /root/.cpan/build/IO-Compress-2.046-IKeaEA/blib/lib /root/.cpan/build/IO-Compress-2.046-IKeaEA/blib/arch /usr/lib64/perl5/site_perl/5.8.8/x86_64-linux-thread-multi /usr/lib/perl5/site_perl/5.8.8 /usr/lib/perl5/site_perl /usr/lib64/perl5/vendor_perl/5.8.8/x86_64-linux-thread-multi /usr/lib/perl5/vendor_perl/5.8.8 /usr/lib/perl5/vendor_perl /usr/lib64/perl5/5.8.8/x86_64-linux-thread-multi /usr/lib/perl5/5.8.8 .) at /root/.cpan/build/IO-Compress-2.046-IKeaEA/blib/lib/IO/Compress/Adapter/Deflate.pm line 9.
  977. BEGIN failed--compilation aborted at /root/.cpan/build/IO-Compress-2.046-IKeaEA/blib/lib/IO/Compress/Adapter/Deflate.pm line 9.
  978. Compilation failed in require at /root/.cpan/build/IO-Compress-2.046-IKeaEA/blib/lib/IO/Compress/RawDeflate.pm line 12.
  979. BEGIN failed--compilation aborted at /root/.cpan/build/IO-Compress-2.046-IKeaEA/blib/lib/IO/Compress/RawDeflate.pm line 12.
  980. Compilation failed in require at /root/.cpan/build/IO-Compress-2.046-IKeaEA/blib/lib/IO/Compress/Zip.pm line 8.
  981. BEGIN failed--compilation aborted at /root/.cpan/build/IO-Compress-2.046-IKeaEA/blib/lib/IO/Compress/Zip.pm line 8.
  982. Compilation failed in require at t/107multi-zip.t line 12.
  983. BEGIN failed--compilation aborted at t/107multi-zip.t line 12.
  984. t/107multi-zip.t ................ Dubious, test returned 2 (wstat 512, 0x200)
  985. No subtests run
  986. t/108anyunc-bzip2.t ............. Can't locate Compress/Raw/Bzip2.pm in @INC (@INC contains: t t/compress /root/.cpan/build/IO-Compress-2.046-IKeaEA/blib/lib /root/.cpan/build/IO-Compress-2.046-IKeaEA/blib/arch /usr/lib64/perl5/site_perl/5.8.8/x86_64-linux-thread-multi /usr/lib/perl5/site_perl/5.8.8 /usr/lib/perl5/site_perl /usr/lib64/perl5/vendor_perl/5.8.8/x86_64-linux-thread-multi /usr/lib/perl5/vendor_perl/5.8.8 /usr/lib/perl5/vendor_perl /usr/lib64/perl5/5.8.8/x86_64-linux-thread-multi /usr/lib/perl5/5.8.8 .) at /root/.cpan/build/IO-Compress-2.046-IKeaEA/blib/lib/IO/Compress/Adapter/Bzip2.pm line 9.
  987. BEGIN failed--compilation aborted at /root/.cpan/build/IO-Compress-2.046-IKeaEA/blib/lib/IO/Compress/Adapter/Bzip2.pm line 9.
  988. Compilation failed in require at /root/.cpan/build/IO-Compress-2.046-IKeaEA/blib/lib/IO/Compress/Bzip2.pm line 11.
  989. BEGIN failed--compilation aborted at /root/.cpan/build/IO-Compress-2.046-IKeaEA/blib/lib/IO/Compress/Bzip2.pm line 11.
  990. Compilation failed in require at t/108anyunc-bzip2.t line 14.
  991. BEGIN failed--compilation aborted at t/108anyunc-bzip2.t line 14.
  992. t/108anyunc-bzip2.t ............. Dubious, test returned 2 (wstat 512, 0x200)
  993. No subtests run
  994. t/108anyunc-deflate.t ........... Can't locate Compress/Raw/Zlib.pm in @INC (@INC contains: t t/compress /root/.cpan/build/IO-Compress-2.046-IKeaEA/blib/lib /root/.cpan/build/IO-Compress-2.046-IKeaEA/blib/arch /usr/lib64/perl5/site_perl/5.8.8/x86_64-linux-thread-multi /usr/lib/perl5/site_perl/5.8.8 /usr/lib/perl5/site_perl /usr/lib64/perl5/vendor_perl/5.8.8/x86_64-linux-thread-multi /usr/lib/perl5/vendor_perl/5.8.8 /usr/lib/perl5/vendor_perl /usr/lib64/perl5/5.8.8/x86_64-linux-thread-multi /usr/lib/perl5/5.8.8 .) at /root/.cpan/build/IO-Compress-2.046-IKeaEA/blib/lib/IO/Compress/Adapter/Deflate.pm line 9.
  995. BEGIN failed--compilation aborted at /root/.cpan/build/IO-Compress-2.046-IKeaEA/blib/lib/IO/Compress/Adapter/Deflate.pm line 9.
  996. Compilation failed in require at /root/.cpan/build/IO-Compress-2.046-IKeaEA/blib/lib/IO/Compress/RawDeflate.pm line 12.
  997. BEGIN failed--compilation aborted at /root/.cpan/build/IO-Compress-2.046-IKeaEA/blib/lib/IO/Compress/RawDeflate.pm line 12.
  998. Compilation failed in require at /root/.cpan/build/IO-Compress-2.046-IKeaEA/blib/lib/IO/Compress/Deflate.pm line 9.
  999. BEGIN failed--compilation aborted at /root/.cpan/build/IO-Compress-2.046-IKeaEA/blib/lib/IO/Compress/Deflate.pm line 9.
  1000. Compilation failed in require at t/108anyunc-deflate.t line 14.
  1001. BEGIN failed--compilation aborted at t/108anyunc-deflate.t line 14.
  1002. t/108anyunc-deflate.t ........... Dubious, test returned 2 (wstat 512, 0x200)
  1003. No subtests run
  1004. t/108anyunc-gzip.t .............. Can't locate Compress/Raw/Zlib.pm in @INC (@INC contains: t t/compress /root/.cpan/build/IO-Compress-2.046-IKeaEA/blib/lib /root/.cpan/build/IO-Compress-2.046-IKeaEA/blib/arch /usr/lib64/perl5/site_perl/5.8.8/x86_64-linux-thread-multi /usr/lib/perl5/site_perl/5.8.8 /usr/lib/perl5/site_perl /usr/lib64/perl5/vendor_perl/5.8.8/x86_64-linux-thread-multi /usr/lib/perl5/vendor_perl/5.8.8 /usr/lib/perl5/vendor_perl /usr/lib64/perl5/5.8.8/x86_64-linux-thread-multi /usr/lib/perl5/5.8.8 .) at /root/.cpan/build/IO-Compress-2.046-IKeaEA/blib/lib/IO/Compress/Adapter/Deflate.pm line 9.
  1005. BEGIN failed--compilation aborted at /root/.cpan/build/IO-Compress-2.046-IKeaEA/blib/lib/IO/Compress/Adapter/Deflate.pm line 9.
  1006. Compilation failed in require at /root/.cpan/build/IO-Compress-2.046-IKeaEA/blib/lib/IO/Compress/RawDeflate.pm line 12.
  1007. BEGIN failed--compilation aborted at /root/.cpan/build/IO-Compress-2.046-IKeaEA/blib/lib/IO/Compress/RawDeflate.pm line 12.
  1008. Compilation failed in require at /root/.cpan/build/IO-Compress-2.046-IKeaEA/blib/lib/IO/Compress/Gzip.pm line 11.
  1009. BEGIN failed--compilation aborted at /root/.cpan/build/IO-Compress-2.046-IKeaEA/blib/lib/IO/Compress/Gzip.pm line 11.
  1010. Compilation failed in require at t/108anyunc-gzip.t line 14.
  1011. BEGIN failed--compilation aborted at t/108anyunc-gzip.t line 14.
  1012. t/108anyunc-gzip.t .............. Dubious, test returned 2 (wstat 512, 0x200)
  1013. No subtests run
  1014. t/108anyunc-rawdeflate.t ........ Can't locate Compress/Raw/Zlib.pm in @INC (@INC contains: t t/compress /root/.cpan/build/IO-Compress-2.046-IKeaEA/blib/lib /root/.cpan/build/IO-Compress-2.046-IKeaEA/blib/arch /usr/lib64/perl5/site_perl/5.8.8/x86_64-linux-thread-multi /usr/lib/perl5/site_perl/5.8.8 /usr/lib/perl5/site_perl /usr/lib64/perl5/vendor_perl/5.8.8/x86_64-linux-thread-multi /usr/lib/perl5/vendor_perl/5.8.8 /usr/lib/perl5/vendor_perl /usr/lib64/perl5/5.8.8/x86_64-linux-thread-multi /usr/lib/perl5/5.8.8 .) at /root/.cpan/build/IO-Compress-2.046-IKeaEA/blib/lib/IO/Compress/Adapter/Deflate.pm line 9.
  1015. BEGIN failed--compilation aborted at /root/.cpan/build/IO-Compress-2.046-IKeaEA/blib/lib/IO/Compress/Adapter/Deflate.pm line 9.
  1016. Compilation failed in require at /root/.cpan/build/IO-Compress-2.046-IKeaEA/blib/lib/IO/Compress/RawDeflate.pm line 12.
  1017. BEGIN failed--compilation aborted at /root/.cpan/build/IO-Compress-2.046-IKeaEA/blib/lib/IO/Compress/RawDeflate.pm line 12.
  1018. Compilation failed in require at t/108anyunc-rawdeflate.t line 14.
  1019. BEGIN failed--compilation aborted at t/108anyunc-rawdeflate.t line 14.
  1020. t/108anyunc-rawdeflate.t ........ Dubious, test returned 2 (wstat 512, 0x200)
  1021. No subtests run
  1022. t/108anyunc-transparent.t ....... ok    
  1023. t/108anyunc-zip.t ............... Can't locate Compress/Raw/Zlib.pm in @INC (@INC contains: t/compress /root/.cpan/build/IO-Compress-2.046-IKeaEA/blib/lib /root/.cpan/build/IO-Compress-2.046-IKeaEA/blib/arch /usr/lib64/perl5/site_perl/5.8.8/x86_64-linux-thread-multi /usr/lib/perl5/site_perl/5.8.8 /usr/lib/perl5/site_perl /usr/lib64/perl5/vendor_perl/5.8.8/x86_64-linux-thread-multi /usr/lib/perl5/vendor_perl/5.8.8 /usr/lib/perl5/vendor_perl /usr/lib64/perl5/5.8.8/x86_64-linux-thread-multi /usr/lib/perl5/5.8.8 .) at /root/.cpan/build/IO-Compress-2.046-IKeaEA/blib/lib/IO/Compress/Adapter/Deflate.pm line 9.
  1024. BEGIN failed--compilation aborted at /root/.cpan/build/IO-Compress-2.046-IKeaEA/blib/lib/IO/Compress/Adapter/Deflate.pm line 9.
  1025. Compilation failed in require at /root/.cpan/build/IO-Compress-2.046-IKeaEA/blib/lib/IO/Compress/RawDeflate.pm line 12.
  1026. BEGIN failed--compilation aborted at /root/.cpan/build/IO-Compress-2.046-IKeaEA/blib/lib/IO/Compress/RawDeflate.pm line 12.
  1027. Compilation failed in require at /root/.cpan/build/IO-Compress-2.046-IKeaEA/blib/lib/IO/Compress/Zip.pm line 8.
  1028. BEGIN failed--compilation aborted at /root/.cpan/build/IO-Compress-2.046-IKeaEA/blib/lib/IO/Compress/Zip.pm line 8.
  1029. Compilation failed in require at t/108anyunc-zip.t line 14.
  1030. BEGIN failed--compilation aborted at t/108anyunc-zip.t line 14.
  1031. t/108anyunc-zip.t ............... Dubious, test returned 2 (wstat 512, 0x200)
  1032. No subtests run
  1033. t/109merge-deflate.t ............ Can't locate Compress/Raw/Zlib.pm in @INC (@INC contains: t t/compress /root/.cpan/build/IO-Compress-2.046-IKeaEA/blib/lib /root/.cpan/build/IO-Compress-2.046-IKeaEA/blib/arch /usr/lib64/perl5/site_perl/5.8.8/x86_64-linux-thread-multi /usr/lib/perl5/site_perl/5.8.8 /usr/lib/perl5/site_perl /usr/lib64/perl5/vendor_perl/5.8.8/x86_64-linux-thread-multi /usr/lib/perl5/vendor_perl/5.8.8 /usr/lib/perl5/vendor_perl /usr/lib64/perl5/5.8.8/x86_64-linux-thread-multi /usr/lib/perl5/5.8.8 .) at /root/.cpan/build/IO-Compress-2.046-IKeaEA/blib/lib/IO/Compress/Adapter/Deflate.pm line 9.
  1034. BEGIN failed--compilation aborted at /root/.cpan/build/IO-Compress-2.046-IKeaEA/blib/lib/IO/Compress/Adapter/Deflate.pm line 9.
  1035. Compilation failed in require at /root/.cpan/build/IO-Compress-2.046-IKeaEA/blib/lib/IO/Compress/RawDeflate.pm line 12.
  1036. BEGIN failed--compilation aborted at /root/.cpan/build/IO-Compress-2.046-IKeaEA/blib/lib/IO/Compress/RawDeflate.pm line 12.
  1037. Compilation failed in require at /root/.cpan/build/IO-Compress-2.046-IKeaEA/blib/lib/IO/Compress/Deflate.pm line 9.
  1038. BEGIN failed--compilation aborted at /root/.cpan/build/IO-Compress-2.046-IKeaEA/blib/lib/IO/Compress/Deflate.pm line 9.
  1039. Compilation failed in require at t/109merge-deflate.t line 12.
  1040. BEGIN failed--compilation aborted at t/109merge-deflate.t line 12.
  1041. t/109merge-deflate.t ............ Dubious, test returned 2 (wstat 512, 0x200)
  1042. No subtests run
  1043. t/109merge-gzip.t ............... Can't locate Compress/Raw/Zlib.pm in @INC (@INC contains: t t/compress /root/.cpan/build/IO-Compress-2.046-IKeaEA/blib/lib /root/.cpan/build/IO-Compress-2.046-IKeaEA/blib/arch /usr/lib64/perl5/site_perl/5.8.8/x86_64-linux-thread-multi /usr/lib/perl5/site_perl/5.8.8 /usr/lib/perl5/site_perl /usr/lib64/perl5/vendor_perl/5.8.8/x86_64-linux-thread-multi /usr/lib/perl5/vendor_perl/5.8.8 /usr/lib/perl5/vendor_perl /usr/lib64/perl5/5.8.8/x86_64-linux-thread-multi /usr/lib/perl5/5.8.8 .) at /root/.cpan/build/IO-Compress-2.046-IKeaEA/blib/lib/IO/Compress/Adapter/Deflate.pm line 9.
  1044. BEGIN failed--compilation aborted at /root/.cpan/build/IO-Compress-2.046-IKeaEA/blib/lib/IO/Compress/Adapter/Deflate.pm line 9.
  1045. Compilation failed in require at /root/.cpan/build/IO-Compress-2.046-IKeaEA/blib/lib/IO/Compress/RawDeflate.pm line 12.
  1046. BEGIN failed--compilation aborted at /root/.cpan/build/IO-Compress-2.046-IKeaEA/blib/lib/IO/Compress/RawDeflate.pm line 12.
  1047. Compilation failed in require at /root/.cpan/build/IO-Compress-2.046-IKeaEA/blib/lib/IO/Compress/Gzip.pm line 11.
  1048. BEGIN failed--compilation aborted at /root/.cpan/build/IO-Compress-2.046-IKeaEA/blib/lib/IO/Compress/Gzip.pm line 11.
  1049. Compilation failed in require at t/109merge-gzip.t line 12.
  1050. BEGIN failed--compilation aborted at t/109merge-gzip.t line 12.
  1051. t/109merge-gzip.t ............... Dubious, test returned 2 (wstat 512, 0x200)
  1052. No subtests run
  1053. t/109merge-rawdeflate.t ......... Can't locate Compress/Raw/Zlib.pm in @INC (@INC contains: t t/compress /root/.cpan/build/IO-Compress-2.046-IKeaEA/blib/lib /root/.cpan/build/IO-Compress-2.046-IKeaEA/blib/arch /usr/lib64/perl5/site_perl/5.8.8/x86_64-linux-thread-multi /usr/lib/perl5/site_perl/5.8.8 /usr/lib/perl5/site_perl /usr/lib64/perl5/vendor_perl/5.8.8/x86_64-linux-thread-multi /usr/lib/perl5/vendor_perl/5.8.8 /usr/lib/perl5/vendor_perl /usr/lib64/perl5/5.8.8/x86_64-linux-thread-multi /usr/lib/perl5/5.8.8 .) at /root/.cpan/build/IO-Compress-2.046-IKeaEA/blib/lib/IO/Compress/Adapter/Deflate.pm line 9.
  1054. BEGIN failed--compilation aborted at /root/.cpan/build/IO-Compress-2.046-IKeaEA/blib/lib/IO/Compress/Adapter/Deflate.pm line 9.
  1055. Compilation failed in require at /root/.cpan/build/IO-Compress-2.046-IKeaEA/blib/lib/IO/Compress/RawDeflate.pm line 12.
  1056. BEGIN failed--compilation aborted at /root/.cpan/build/IO-Compress-2.046-IKeaEA/blib/lib/IO/Compress/RawDeflate.pm line 12.
  1057. Compilation failed in require at t/109merge-rawdeflate.t line 12.
  1058. BEGIN failed--compilation aborted at t/109merge-rawdeflate.t line 12.
  1059. t/109merge-rawdeflate.t ......... Dubious, test returned 2 (wstat 512, 0x200)
  1060. No subtests run
  1061. t/109merge-zip.t ................ skipped: not implemented yet
  1062. t/110encode-bzip2.t ............. Can't locate Compress/Raw/Bzip2.pm in @INC (@INC contains: t t/compress /root/.cpan/build/IO-Compress-2.046-IKeaEA/blib/lib /root/.cpan/build/IO-Compress-2.046-IKeaEA/blib/arch /usr/lib64/perl5/site_perl/5.8.8/x86_64-linux-thread-multi /usr/lib/perl5/site_perl/5.8.8 /usr/lib/perl5/site_perl /usr/lib64/perl5/vendor_perl/5.8.8/x86_64-linux-thread-multi /usr/lib/perl5/vendor_perl/5.8.8 /usr/lib/perl5/vendor_perl /usr/lib64/perl5/5.8.8/x86_64-linux-thread-multi /usr/lib/perl5/5.8.8 .) at /root/.cpan/build/IO-Compress-2.046-IKeaEA/blib/lib/IO/Compress/Adapter/Bzip2.pm line 9.
  1063. BEGIN failed--compilation aborted at /root/.cpan/build/IO-Compress-2.046-IKeaEA/blib/lib/IO/Compress/Adapter/Bzip2.pm line 9.
  1064. Compilation failed in require at /root/.cpan/build/IO-Compress-2.046-IKeaEA/blib/lib/IO/Compress/Bzip2.pm line 11.
  1065. BEGIN failed--compilation aborted at /root/.cpan/build/IO-Compress-2.046-IKeaEA/blib/lib/IO/Compress/Bzip2.pm line 11.
  1066. Compilation failed in require at t/110encode-bzip2.t line 12.
  1067. BEGIN failed--compilation aborted at t/110encode-bzip2.t line 12.
  1068. t/110encode-bzip2.t ............. Dubious, test returned 2 (wstat 512, 0x200)
  1069. No subtests run
  1070. t/110encode-deflate.t ........... Can't locate Compress/Raw/Zlib.pm in @INC (@INC contains: t t/compress /root/.cpan/build/IO-Compress-2.046-IKeaEA/blib/lib /root/.cpan/build/IO-Compress-2.046-IKeaEA/blib/arch /usr/lib64/perl5/site_perl/5.8.8/x86_64-linux-thread-multi /usr/lib/perl5/site_perl/5.8.8 /usr/lib/perl5/site_perl /usr/lib64/perl5/vendor_perl/5.8.8/x86_64-linux-thread-multi /usr/lib/perl5/vendor_perl/5.8.8 /usr/lib/perl5/vendor_perl /usr/lib64/perl5/5.8.8/x86_64-linux-thread-multi /usr/lib/perl5/5.8.8 .) at /root/.cpan/build/IO-Compress-2.046-IKeaEA/blib/lib/IO/Compress/Adapter/Deflate.pm line 9.
  1071. BEGIN failed--compilation aborted at /root/.cpan/build/IO-Compress-2.046-IKeaEA/blib/lib/IO/Compress/Adapter/Deflate.pm line 9.
  1072. Compilation failed in require at /root/.cpan/build/IO-Compress-2.046-IKeaEA/blib/lib/IO/Compress/RawDeflate.pm line 12.
  1073. BEGIN failed--compilation aborted at /root/.cpan/build/IO-Compress-2.046-IKeaEA/blib/lib/IO/Compress/RawDeflate.pm line 12.
  1074. Compilation failed in require at /root/.cpan/build/IO-Compress-2.046-IKeaEA/blib/lib/IO/Compress/Deflate.pm line 9.
  1075. BEGIN failed--compilation aborted at /root/.cpan/build/IO-Compress-2.046-IKeaEA/blib/lib/IO/Compress/Deflate.pm line 9.
  1076. Compilation failed in require at t/110encode-deflate.t line 12.
  1077. BEGIN failed--compilation aborted at t/110encode-deflate.t line 12.
  1078. t/110encode-deflate.t ........... Dubious, test returned 2 (wstat 512, 0x200)
  1079. No subtests run
  1080. t/110encode-gzip.t .............. Can't locate Compress/Raw/Zlib.pm in @INC (@INC contains: t t/compress /root/.cpan/build/IO-Compress-2.046-IKeaEA/blib/lib /root/.cpan/build/IO-Compress-2.046-IKeaEA/blib/arch /usr/lib64/perl5/site_perl/5.8.8/x86_64-linux-thread-multi /usr/lib/perl5/site_perl/5.8.8 /usr/lib/perl5/site_perl /usr/lib64/perl5/vendor_perl/5.8.8/x86_64-linux-thread-multi /usr/lib/perl5/vendor_perl/5.8.8 /usr/lib/perl5/vendor_perl /usr/lib64/perl5/5.8.8/x86_64-linux-thread-multi /usr/lib/perl5/5.8.8 .) at /root/.cpan/build/IO-Compress-2.046-IKeaEA/blib/lib/IO/Compress/Adapter/Deflate.pm line 9.
  1081. BEGIN failed--compilation aborted at /root/.cpan/build/IO-Compress-2.046-IKeaEA/blib/lib/IO/Compress/Adapter/Deflate.pm line 9.
  1082. Compilation failed in require at /root/.cpan/build/IO-Compress-2.046-IKeaEA/blib/lib/IO/Compress/RawDeflate.pm line 12.
  1083. BEGIN failed--compilation aborted at /root/.cpan/build/IO-Compress-2.046-IKeaEA/blib/lib/IO/Compress/RawDeflate.pm line 12.
  1084. Compilation failed in require at /root/.cpan/build/IO-Compress-2.046-IKeaEA/blib/lib/IO/Compress/Gzip.pm line 11.
  1085. BEGIN failed--compilation aborted at /root/.cpan/build/IO-Compress-2.046-IKeaEA/blib/lib/IO/Compress/Gzip.pm line 11.
  1086. Compilation failed in require at t/110encode-gzip.t line 12.
  1087. BEGIN failed--compilation aborted at t/110encode-gzip.t line 12.
  1088. t/110encode-gzip.t .............. Dubious, test returned 2 (wstat 512, 0x200)
  1089. No subtests run
  1090. t/110encode-rawdeflate.t ........ Can't locate Compress/Raw/Zlib.pm in @INC (@INC contains: t t/compress /root/.cpan/build/IO-Compress-2.046-IKeaEA/blib/lib /root/.cpan/build/IO-Compress-2.046-IKeaEA/blib/arch /usr/lib64/perl5/site_perl/5.8.8/x86_64-linux-thread-multi /usr/lib/perl5/site_perl/5.8.8 /usr/lib/perl5/site_perl /usr/lib64/perl5/vendor_perl/5.8.8/x86_64-linux-thread-multi /usr/lib/perl5/vendor_perl/5.8.8 /usr/lib/perl5/vendor_perl /usr/lib64/perl5/5.8.8/x86_64-linux-thread-multi /usr/lib/perl5/5.8.8 .) at /root/.cpan/build/IO-Compress-2.046-IKeaEA/blib/lib/IO/Compress/Adapter/Deflate.pm line 9.
  1091. BEGIN failed--compilation aborted at /root/.cpan/build/IO-Compress-2.046-IKeaEA/blib/lib/IO/Compress/Adapter/Deflate.pm line 9.
  1092. Compilation failed in require at /root/.cpan/build/IO-Compress-2.046-IKeaEA/blib/lib/IO/Compress/RawDeflate.pm line 12.
  1093. BEGIN failed--compilation aborted at /root/.cpan/build/IO-Compress-2.046-IKeaEA/blib/lib/IO/Compress/RawDeflate.pm line 12.
  1094. Compilation failed in require at t/110encode-rawdeflate.t line 12.
  1095. BEGIN failed--compilation aborted at t/110encode-rawdeflate.t line 12.
  1096. t/110encode-rawdeflate.t ........ Dubious, test returned 2 (wstat 512, 0x200)
  1097. No subtests run
  1098. t/110encode-zip.t ............... Can't locate Compress/Raw/Zlib.pm in @INC (@INC contains: t t/compress /root/.cpan/build/IO-Compress-2.046-IKeaEA/blib/lib /root/.cpan/build/IO-Compress-2.046-IKeaEA/blib/arch /usr/lib64/perl5/site_perl/5.8.8/x86_64-linux-thread-multi /usr/lib/perl5/site_perl/5.8.8 /usr/lib/perl5/site_perl /usr/lib64/perl5/vendor_perl/5.8.8/x86_64-linux-thread-multi /usr/lib/perl5/vendor_perl/5.8.8 /usr/lib/perl5/vendor_perl /usr/lib64/perl5/5.8.8/x86_64-linux-thread-multi /usr/lib/perl5/5.8.8 .) at /root/.cpan/build/IO-Compress-2.046-IKeaEA/blib/lib/IO/Compress/Adapter/Deflate.pm line 9.
  1099. BEGIN failed--compilation aborted at /root/.cpan/build/IO-Compress-2.046-IKeaEA/blib/lib/IO/Compress/Adapter/Deflate.pm line 9.
  1100. Compilation failed in require at /root/.cpan/build/IO-Compress-2.046-IKeaEA/blib/lib/IO/Compress/RawDeflate.pm line 12.
  1101. BEGIN failed--compilation aborted at /root/.cpan/build/IO-Compress-2.046-IKeaEA/blib/lib/IO/Compress/RawDeflate.pm line 12.
  1102. Compilation failed in require at /root/.cpan/build/IO-Compress-2.046-IKeaEA/blib/lib/IO/Compress/Zip.pm line 8.
  1103. BEGIN failed--compilation aborted at /root/.cpan/build/IO-Compress-2.046-IKeaEA/blib/lib/IO/Compress/Zip.pm line 8.
  1104. Compilation failed in require at t/110encode-zip.t line 12.
  1105. BEGIN failed--compilation aborted at t/110encode-zip.t line 12.
  1106. t/110encode-zip.t ............... Dubious, test returned 2 (wstat 512, 0x200)
  1107. No subtests run
  1108. t/999pod.t ...................... ok    
  1109. t/cz-01version.t ................ 1/3
  1110. #     Failed test (t/cz-01version.t at line 23)
  1111. #     Tried to use 'Compress::Zlib'.
  1112. #     Error:  Can't locate Compress/Raw/Zlib.pm in @INC (@INC contains: t t/compress /root/.cpan/build/IO-Compress-2.046-IKeaEA/blib/lib /root/.cpan/build/IO-Compress-2.046-IKeaEA/blib/arch /usr/lib64/perl5/site_perl/5.8.8/x86_64-linux-thread-multi /usr/lib/perl5/site_perl/5.8.8 /usr/lib/perl5/site_perl /usr/lib64/perl5/vendor_perl/5.8.8/x86_64-linux-thread-multi /usr/lib/perl5/vendor_perl/5.8.8 /usr/lib/perl5/vendor_perl /usr/lib64/perl5/5.8.8/x86_64-linux-thread-multi /usr/lib/perl5/5.8.8 .) at /root/.cpan/build/IO-Compress-2.046-IKeaEA/blib/lib/Compress/Zlib.pm line 11.
  1113. # BEGIN failed--compilation aborted at t/cz-01version.t line 23.
  1114. # Compilation failed in require at (eval 7) line 2.
  1115. # BEGIN failed--compilation aborted at (eval 7) line 2.
  1116. Bareword "ZLIB_VERSION" not allowed while "strict subs" in use at t/cz-01version.t line 31.
  1117. Bareword "Compress::Zlib::zlib_version" not allowed while "strict subs" in use at t/cz-01version.t line 32.
  1118. Execution of t/cz-01version.t aborted due to compilation errors.
  1119. # Looks like you planned 3 tests but only ran 2.
  1120. # Looks like your test died just after 2.
  1121. t/cz-01version.t ................ Dubious, test returned 255 (wstat 65280, 0xff00)
  1122. Failed 2/3 subtests
  1123. t/cz-03zlib-v1.t ................ 1/457
  1124. #     Failed test (t/cz-03zlib-v1.t at line 35)
  1125. #     Tried to use 'Compress::Zlib'.
  1126. #     Error:  Can't locate Compress/Raw/Zlib.pm in @INC (@INC contains: t t/compress /root/.cpan/build/IO-Compress-2.046-IKeaEA/blib/lib /root/.cpan/build/IO-Compress-2.046-IKeaEA/blib/arch /usr/lib64/perl5/site_perl/5.8.8/x86_64-linux-thread-multi /usr/lib/perl5/site_perl/5.8.8 /usr/lib/perl5/site_perl /usr/lib64/perl5/vendor_perl/5.8.8/x86_64-linux-thread-multi /usr/lib/perl5/vendor_perl/5.8.8 /usr/lib/perl5/vendor_perl /usr/lib64/perl5/5.8.8/x86_64-linux-thread-multi /usr/lib/perl5/5.8.8 .) at /root/.cpan/build/IO-Compress-2.046-IKeaEA/blib/lib/Compress/Zlib.pm line 11.
  1127. # BEGIN failed--compilation aborted at t/cz-03zlib-v1.t line 35.
  1128. # Compilation failed in require at (eval 32) line 2.
  1129. # BEGIN failed--compilation aborted at (eval 32) line 2.
  1130.  
  1131. #     Failed test (t/cz-03zlib-v1.t at line 38)
  1132. #     Tried to use 'IO::Compress::Gzip'.
  1133. #     Error:  Can't locate Compress/Raw/Zlib.pm in @INC (@INC contains: t t/compress /root/.cpan/build/IO-Compress-2.046-IKeaEA/blib/lib /root/.cpan/build/IO-Compress-2.046-IKeaEA/blib/arch /usr/lib64/perl5/site_perl/5.8.8/x86_64-linux-thread-multi /usr/lib/perl5/site_perl/5.8.8 /usr/lib/perl5/site_perl /usr/lib64/perl5/vendor_perl/5.8.8/x86_64-linux-thread-multi /usr/lib/perl5/vendor_perl/5.8.8 /usr/lib/perl5/vendor_perl /usr/lib64/perl5/5.8.8/x86_64-linux-thread-multi /usr/lib/perl5/5.8.8 .) at /root/.cpan/build/IO-Compress-2.046-IKeaEA/blib/lib/IO/Compress/Adapter/Deflate.pm line 9.
  1134. # BEGIN failed--compilation aborted at t/cz-03zlib-v1.t line 38.
  1135. # Compilation failed in require at /root/.cpan/build/IO-Compress-2.046-IKeaEA/blib/lib/IO/Compress/RawDeflate.pm line 12.
  1136. # BEGIN failed--compilation aborted at /root/.cpan/build/IO-Compress-2.046-IKeaEA/blib/lib/IO/Compress/RawDeflate.pm line 12.
  1137. # Compilation failed in require at /root/.cpan/build/IO-Compress-2.046-IKeaEA/blib/lib/IO/Compress/Gzip.pm line 11.
  1138. # BEGIN failed--compilation aborted at /root/.cpan/build/IO-Compress-2.046-IKeaEA/blib/lib/IO/Compress/Gzip.pm line 11.
  1139. # Compilation failed in require at (eval 34) line 2.
  1140. # BEGIN failed--compilation aborted at (eval 34) line 2.
  1141. Global symbol "$gzerrno" requires explicit package name at t/cz-03zlib-v1.t line 354.
  1142. Global symbol "$gzerrno" requires explicit package name at t/cz-03zlib-v1.t line 378.
  1143. Global symbol "$gzerrno" requires explicit package name at t/cz-03zlib-v1.t line 384.
  1144. Global symbol "$gzerrno" requires explicit package name at t/cz-03zlib-v1.t line 404.
  1145. Global symbol "$gzerrno" requires explicit package name at t/cz-03zlib-v1.t line 413.
  1146. Global symbol "$gzerrno" requires explicit package name at t/cz-03zlib-v1.t line 419.
  1147. Global symbol "$gzerrno" requires explicit package name at t/cz-03zlib-v1.t line 425.
  1148. Global symbol "$gzerrno" requires explicit package name at t/cz-03zlib-v1.t line 431.
  1149. Global symbol "$gzerrno" requires explicit package name at t/cz-03zlib-v1.t line 437.
  1150. Global symbol "$gzerrno" requires explicit package name at t/cz-03zlib-v1.t line 443.
  1151. Global symbol "$gzerrno" requires explicit package name at t/cz-03zlib-v1.t line 449.
  1152. Global symbol "$gzerrno" requires explicit package name at t/cz-03zlib-v1.t line 455.
  1153. Global symbol "$gzerrno" requires explicit package name at t/cz-03zlib-v1.t line 460.
  1154. Global symbol "$gzerrno" requires explicit package name at t/cz-03zlib-v1.t line 469.
  1155. Global symbol "$gzerrno" requires explicit package name at t/cz-03zlib-v1.t line 475.
  1156. Global symbol "$gzerrno" requires explicit package name at t/cz-03zlib-v1.t line 482.
  1157. Global symbol "$gzerrno" requires explicit package name at t/cz-03zlib-v1.t line 489.
  1158. Global symbol "$gzerrno" requires explicit package name at t/cz-03zlib-v1.t line 496.
  1159. Global symbol "$gzerrno" requires explicit package name at t/cz-03zlib-v1.t line 503.
  1160. Global symbol "$gzerrno" requires explicit package name at t/cz-03zlib-v1.t line 510.
  1161. Global symbol "$gzerrno" requires explicit package name at t/cz-03zlib-v1.t line 517.
  1162. Global symbol "$gzerrno" requires explicit package name at t/cz-03zlib-v1.t line 565.
  1163. Global symbol "$gzerrno" requires explicit package name at t/cz-03zlib-v1.t line 928.
  1164. Global symbol "$gzerrno" requires explicit package name at t/cz-03zlib-v1.t line 932.
  1165. Global symbol "$gzerrno" requires explicit package name at t/cz-03zlib-v1.t line 959.
  1166. Global symbol "$gzerrno" requires explicit package name at t/cz-03zlib-v1.t line 968.
  1167. Global symbol "$gzerrno" requires explicit package name at t/cz-03zlib-v1.t line 977.
  1168. Global symbol "$gzerrno" requires explicit package name at t/cz-03zlib-v1.t line 986.
  1169. Global symbol "$gzerrno" requires explicit package name at t/cz-03zlib-v1.t line 1007.
  1170. Global symbol "$gzerrno" requires explicit package name at t/cz-03zlib-v1.t line 1028.
  1171. Global symbol "$gzerrno" requires explicit package name at t/cz-03zlib-v1.t line 1046.
  1172. Global symbol "$gzerrno" requires explicit package name at t/cz-03zlib-v1.t line 1064.
  1173. Global symbol "$gzerrno" requires explicit package name at t/cz-03zlib-v1.t line 1087.
  1174. Global symbol "$gzerrno" requires explicit package name at t/cz-03zlib-v1.t line 1089.
  1175. Global symbol "$gzerrno" requires explicit package name at t/cz-03zlib-v1.t line 1114.
  1176. Global symbol "$gzerrno" requires explicit package name at t/cz-03zlib-v1.t line 1125.
  1177. Global symbol "$gzerrno" requires explicit package name at t/cz-03zlib-v1.t line 1135.
  1178. Bareword "Compress::Zlib::zlib_version" not allowed while "strict subs" in use at t/cz-03zlib-v1.t line 53.
  1179. Bareword "ZLIB_VERSION" not allowed while "strict subs" in use at t/cz-03zlib-v1.t line 53.
  1180. Bareword "Z_BEST_COMPRESSION" not allowed while "strict subs" in use at t/cz-03zlib-v1.t line 130.
  1181. Bareword "Z_OK" not allowed while "strict subs" in use at t/cz-03zlib-v1.t line 151.
  1182. Bareword "Z_OK" not allowed while "strict subs" in use at t/cz-03zlib-v1.t line 157.
  1183. Bareword "Z_OK" not allowed while "strict subs" in use at t/cz-03zlib-v1.t line 162.
  1184. Bareword "Z_OK" not allowed while "strict subs" in use at t/cz-03zlib-v1.t line 164.
  1185. Bareword "Z_OK" not allowed while "strict subs" in use at t/cz-03zlib-v1.t line 173.
  1186. Bareword "Z_STREAM_END" not allowed while "strict subs" in use at t/cz-03zlib-v1.t line 181.
  1187. Bareword "Z_OK" not allowed while "strict subs" in use at t/cz-03zlib-v1.t line 181.
  1188. Bareword "Z_STREAM_END" not allowed while "strict subs" in use at t/cz-03zlib-v1.t line 185.
  1189. Bareword "Z_OK" not allowed while "strict subs" in use at t/cz-03zlib-v1.t line 196.
  1190. Bareword "Z_OK" not allowed while "strict subs" in use at t/cz-03zlib-v1.t line 208.
  1191. Bareword "Z_OK" not allowed while "strict subs" in use at t/cz-03zlib-v1.t line 210.
  1192. Bareword "Z_OK" not allowed while "strict subs" in use at t/cz-03zlib-v1.t line 222.
  1193. Bareword "Z_STREAM_END" not allowed while "strict subs" in use at t/cz-03zlib-v1.t line 233.
  1194. Bareword "Z_OK" not allowed while "strict subs" in use at t/cz-03zlib-v1.t line 233.
  1195. Bareword "Z_STREAM_END" not allowed while "strict subs" in use at t/cz-03zlib-v1.t line 237.
  1196. Bareword "Z_OK" not allowed while "strict subs" in use at t/cz-03zlib-v1.t line 252.
  1197. Bareword "Z_OK" not allowed while "strict subs" in use at t/cz-03zlib-v1.t line 257.
  1198. Bareword "Z_STREAM_END" not allowed while "strict subs" in use at t/cz-03zlib-v1.t line 266.
  1199. Bareword "Z_BEST_COMPRESSION" not allowed while "strict subs" in use at t/cz-03zlib-v1.t line 273.
  1200. Bareword "Z_OK" not allowed while "strict subs" in use at t/cz-03zlib-v1.t line 279.
  1201. Bareword "Z_OK" not allowed while "strict subs" in use at t/cz-03zlib-v1.t line 281.
  1202. Bareword "Z_STREAM_END" not allowed while "strict subs" in use at t/cz-03zlib-v1.t line 288.
  1203. Bareword "Z_BEST_COMPRESSION" not allowed while "strict subs" in use at t/cz-03zlib-v1.t line 311.
  1204. Bareword "Z_OK" not allowed while "strict subs" in use at t/cz-03zlib-v1.t line 314.
  1205. Bareword "Z_OK" not allowed while "strict subs" in use at t/cz-03zlib-v1.t line 316.
  1206. Bareword "Z_OK" not allowed while "strict subs" in use at t/cz-03zlib-v1.t line 325.
  1207. Bareword "Z_STREAM_END" not allowed while "strict subs" in use at t/cz-03zlib-v1.t line 331.
  1208. Bareword "Z_DATA_ERROR" not allowed while "strict subs" in use at t/cz-03zlib-v1.t line 460.
  1209. Bareword "Z_DATA_ERROR" not allowed while "strict subs" in use at t/cz-03zlib-v1.t line 469.
  1210. Bareword "Z_DATA_ERROR" not allowed while "strict subs" in use at t/cz-03zlib-v1.t line 475.
  1211. Bareword "Z_DATA_ERROR" not allowed while "strict subs" in use at t/cz-03zlib-v1.t line 482.
  1212. Bareword "Z_DATA_ERROR" not allowed while "strict subs" in use at t/cz-03zlib-v1.t line 489.
  1213. Bareword "Z_DATA_ERROR" not allowed while "strict subs" in use at t/cz-03zlib-v1.t line 496.
  1214. Bareword "Z_DATA_ERROR" not allowed while "strict subs" in use at t/cz-03zlib-v1.t line 503.
  1215. Bareword "Z_DATA_ERROR" not allowed while "strict subs" in use at t/cz-03zlib-v1.t line 510.
  1216. Bareword "Z_DATA_ERROR" not allowed while "strict subs" in use at t/cz-03zlib-v1.t line 517.
  1217. Bareword "Z_OK" not allowed while "strict subs" in use at t/cz-03zlib-v1.t line 581.
  1218. Bareword "Z_OK" not allowed while "strict subs" in use at t/cz-03zlib-v1.t line 587.
  1219. Bareword "Z_OK" not allowed while "strict subs" in use at t/cz-03zlib-v1.t line 592.
  1220. Bareword "Z_OK" not allowed while "strict subs" in use at t/cz-03zlib-v1.t line 594.
  1221. Bareword "Z_OK" not allowed while "strict subs" in use at t/cz-03zlib-v1.t line 605.
  1222. Bareword "Z_STREAM_END" not allowed while "strict subs" in use at t/cz-03zlib-v1.t line 612.
  1223. Bareword "Z_OK" not allowed while "strict subs" in use at t/cz-03zlib-v1.t line 612.
  1224. Bareword "Z_STREAM_END" not allowed while "strict subs" in use at t/cz-03zlib-v1.t line 616.
  1225. Bareword "Z_OK" not allowed while "strict subs" in use at t/cz-03zlib-v1.t line 632.
  1226. Bareword "Z_OK" not allowed while "strict subs" in use at t/cz-03zlib-v1.t line 635.
  1227. Bareword "Z_FULL_FLUSH" not allowed while "strict subs" in use at t/cz-03zlib-v1.t line 638.
  1228. Bareword "Z_OK" not allowed while "strict subs" in use at t/cz-03zlib-v1.t line 638.
  1229. Bareword "Z_OK" not allowed while "strict subs" in use at t/cz-03zlib-v1.t line 642.
  1230. Bareword "Z_OK" not allowed while "strict subs" in use at t/cz-03zlib-v1.t line 645.
  1231. Bareword "Z_OK" not allowed while "strict subs" in use at t/cz-03zlib-v1.t line 653.
  1232. Bareword "Z_OK" not allowed while "strict subs" in use at t/cz-03zlib-v1.t line 656.
  1233. Bareword "Z_DATA_ERROR" not allowed while "strict subs" in use at t/cz-03zlib-v1.t line 663.
  1234. Bareword "Z_OK" not allowed while "strict subs" in use at t/cz-03zlib-v1.t line 667.
  1235. Bareword "Z_STREAM_END" not allowed while "strict subs" in use at t/cz-03zlib-v1.t line 677.
  1236. Bareword "Z_OK" not allowed while "strict subs" in use at t/cz-03zlib-v1.t line 677.
  1237. Bareword "Z_DATA_ERROR" not allowed while "strict subs" in use at t/cz-03zlib-v1.t line 682.
  1238. Bareword "Z_STREAM_END" not allowed while "strict subs" in use at t/cz-03zlib-v1.t line 682.
  1239. Bareword "Z_OK" not allowed while "strict subs" in use at t/cz-03zlib-v1.t line 693.
  1240. Bareword "Z_OK" not allowed while "strict subs" in use at t/cz-03zlib-v1.t line 696.
  1241. Bareword "Z_OK" not allowed while "strict subs" in use at t/cz-03zlib-v1.t line 699.
  1242. Bareword "Z_DATA_ERROR" not allowed while "strict subs" in use at t/cz-03zlib-v1.t line 703.
  1243. Bareword "Z_BEST_COMPRESSION" not allowed while "strict subs" in use at t/cz-03zlib-v1.t line 714.
  1244. Bareword "Z_DEFAULT_STRATEGY" not allowed while "strict subs" in use at t/cz-03zlib-v1.t line 714.
  1245. Bareword "Z_OK" not allowed while "strict subs" in use at t/cz-03zlib-v1.t line 717.
  1246. Bareword "Z_BEST_COMPRESSION" not allowed while "strict subs" in use at t/cz-03zlib-v1.t line 719.
  1247. Bareword "Z_DEFAULT_STRATEGY" not allowed while "strict subs" in use at t/cz-03zlib-v1.t line 720.
  1248. Bareword "Z_OK" not allowed while "strict subs" in use at t/cz-03zlib-v1.t line 723.
  1249. Bareword "Z_BEST_COMPRESSION" not allowed while "strict subs" in use at t/cz-03zlib-v1.t line 737.
  1250. Bareword "Z_DEFAULT_STRATEGY" not allowed while "strict subs" in use at t/cz-03zlib-v1.t line 738.
  1251. Bareword "Z_BEST_SPEED" not allowed while "strict subs" in use at t/cz-03zlib-v1.t line 741.
  1252. Bareword "Z_HUFFMAN_ONLY" not allowed while "strict subs" in use at t/cz-03zlib-v1.t line 741.
  1253. Bareword "Z_OK" not allowed while "strict subs" in use at t/cz-03zlib-v1.t line 742.
  1254. Bareword "Z_BEST_SPEED" not allowed while "strict subs" in use at t/cz-03zlib-v1.t line 744.
  1255. Bareword "Z_HUFFMAN_ONLY" not allowed while "strict subs" in use at t/cz-03zlib-v1.t line 745.
  1256. Bareword "Z_OK" not allowed while "strict subs" in use at t/cz-03zlib-v1.t line 748.
  1257. Bareword "Z_NO_COMPRESSION" not allowed while "strict subs" in use at t/cz-03zlib-v1.t line 753.
  1258. Bareword "Z_OK" not allowed while "strict subs" in use at t/cz-03zlib-v1.t line 754.
  1259. Bareword "Z_NO_COMPRESSION" not allowed while "strict subs" in use at t/cz-03zlib-v1.t line 756.
  1260. Bareword "Z_HUFFMAN_ONLY" not allowed while "strict subs" in use at t/cz-03zlib-v1.t line 757.
  1261. Bareword "Z_OK" not allowed while "strict subs" in use at t/cz-03zlib-v1.t line 760.
  1262. Bareword "Z_FILTERED" not allowed while "strict subs" in use at t/cz-03zlib-v1.t line 765.
  1263. Bareword "Z_OK" not allowed while "strict subs" in use at t/cz-03zlib-v1.t line 766.
  1264. Bareword "Z_NO_COMPRESSION" not allowed while "strict subs" in use at t/cz-03zlib-v1.t line 768.
  1265. Bareword "Z_FILTERED" not allowed while "strict subs" in use at t/cz-03zlib-v1.t line 769.
  1266. Bareword "Z_OK" not allowed while "strict subs" in use at t/cz-03zlib-v1.t line 772.
  1267. Bareword "Z_OK" not allowed while "strict subs" in use at t/cz-03zlib-v1.t line 776.
  1268. Bareword "Z_OK" not allowed while "strict subs" in use at t/cz-03zlib-v1.t line 784.
  1269. Bareword "Z_STREAM_END" not allowed while "strict subs" in use at t/cz-03zlib-v1.t line 788.
  1270. Bareword "Z_OK" not allowed while "strict subs" in use at t/cz-03zlib-v1.t line 844.
  1271. Bareword "Z_OK" not allowed while "strict subs" in use at t/cz-03zlib-v1.t line 850.
  1272. Bareword "Z_STREAM_END" not allowed while "strict subs" in use at t/cz-03zlib-v1.t line 861.
  1273. Bareword "Z_DATA_ERROR" not allowed while "strict subs" in use at t/cz-03zlib-v1.t line 959.
  1274. Bareword "Z_DATA_ERROR" not allowed while "strict subs" in use at t/cz-03zlib-v1.t line 968.
  1275. Bareword "Z_DATA_ERROR" not allowed while "strict subs" in use at t/cz-03zlib-v1.t line 977.
  1276. Bareword "Z_DATA_ERROR" not allowed while "strict subs" in use at t/cz-03zlib-v1.t line 986.
  1277. Bareword "Z_DATA_ERROR" not allowed while "strict subs" in use at t/cz-03zlib-v1.t line 1007.
  1278. Bareword "Z_DATA_ERROR" not allowed while "strict subs" in use at t/cz-03zlib-v1.t line 1028.
  1279. Bareword "Z_DATA_ERROR" not allowed while "strict subs" in use at t/cz-03zlib-v1.t line 1046.
  1280. Bareword "Z_DATA_ERROR" not allowed while "strict subs" in use at t/cz-03zlib-v1.t line 1064.
  1281. Bareword "Z_DATA_ERROR" not allowed while "strict subs" in use at t/cz-03zlib-v1.t line 1125.
  1282. Bareword "Z_DATA_ERROR" not allowed while "strict subs" in use at t/cz-03zlib-v1.t line 1135.
  1283. Bareword "Z_STREAM_ERROR" not allowed while "strict subs" in use at t/cz-03zlib-v1.t line 1226.
  1284. Execution of t/cz-03zlib-v1.t aborted due to compilation errors.
  1285. # Looks like you planned 457 tests but only ran 4.
  1286. # Looks like your test died just after 4.
  1287. t/cz-03zlib-v1.t ................ Dubious, test returned 255 (wstat 65280, 0xff00)
  1288. Failed 455/457 subtests
  1289. t/cz-05examples.t ............... Can't locate Compress/Raw/Zlib.pm in @INC (@INC contains: t t/compress /root/.cpan/build/IO-Compress-2.046-IKeaEA/blib/lib /root/.cpan/build/IO-Compress-2.046-IKeaEA/blib/arch /usr/lib64/perl5/site_perl/5.8.8/x86_64-linux-thread-multi /usr/lib/perl5/site_perl/5.8.8 /usr/lib/perl5/site_perl /usr/lib64/perl5/vendor_perl/5.8.8/x86_64-linux-thread-multi /usr/lib/perl5/vendor_perl/5.8.8 /usr/lib/perl5/vendor_perl /usr/lib64/perl5/5.8.8/x86_64-linux-thread-multi /usr/lib/perl5/5.8.8 .) at /root/.cpan/build/IO-Compress-2.046-IKeaEA/blib/lib/Compress/Zlib.pm line 11.
  1290. BEGIN failed--compilation aborted at /root/.cpan/build/IO-Compress-2.046-IKeaEA/blib/lib/Compress/Zlib.pm line 11.
  1291. Compilation failed in require at t/cz-05examples.t line 16.
  1292. BEGIN failed--compilation aborted at t/cz-05examples.t line 16.
  1293. # Looks like your test died before it could output anything.
  1294. t/cz-05examples.t ............... Dubious, test returned 255 (wstat 65280, 0xff00)
  1295. No subtests run
  1296. t/cz-06gzsetp.t ................. Can't locate Compress/Raw/Zlib.pm in @INC (@INC contains: t t/compress /root/.cpan/build/IO-Compress-2.046-IKeaEA/blib/lib /root/.cpan/build/IO-Compress-2.046-IKeaEA/blib/arch /usr/lib64/perl5/site_perl/5.8.8/x86_64-linux-thread-multi /usr/lib/perl5/site_perl/5.8.8 /usr/lib/perl5/site_perl /usr/lib64/perl5/vendor_perl/5.8.8/x86_64-linux-thread-multi /usr/lib/perl5/vendor_perl/5.8.8 /usr/lib/perl5/vendor_perl /usr/lib64/perl5/5.8.8/x86_64-linux-thread-multi /usr/lib/perl5/5.8.8 .) at /root/.cpan/build/IO-Compress-2.046-IKeaEA/blib/lib/Compress/Zlib.pm line 11.
  1297. BEGIN failed--compilation aborted at /root/.cpan/build/IO-Compress-2.046-IKeaEA/blib/lib/Compress/Zlib.pm line 11.
  1298. Compilation failed in require at t/cz-06gzsetp.t line 16.
  1299. BEGIN failed--compilation aborted at t/cz-06gzsetp.t line 16.
  1300. # Looks like your test died before it could output anything.
  1301. t/cz-06gzsetp.t ................. Dubious, test returned 255 (wstat 65280, 0xff00)
  1302. No subtests run
  1303. t/cz-08encoding.t ............... 1/30
  1304. #     Failed test (t/cz-08encoding.t at line 33)
  1305. #     Tried to use 'Compress::Zlib'.
  1306. #     Error:  Can't locate Compress/Raw/Zlib.pm in @INC (@INC contains: t t/compress /root/.cpan/build/IO-Compress-2.046-IKeaEA/blib/lib /root/.cpan/build/IO-Compress-2.046-IKeaEA/blib/arch /usr/lib64/perl5/site_perl/5.8.8/x86_64-linux-thread-multi /usr/lib/perl5/site_perl/5.8.8 /usr/lib/perl5/site_perl /usr/lib64/perl5/vendor_perl/5.8.8/x86_64-linux-thread-multi /usr/lib/perl5/vendor_perl/5.8.8 /usr/lib/perl5/vendor_perl /usr/lib64/perl5/5.8.8/x86_64-linux-thread-multi /usr/lib/perl5/5.8.8 .) at /root/.cpan/build/IO-Compress-2.046-IKeaEA/blib/lib/Compress/Zlib.pm line 11.
  1307. # BEGIN failed--compilation aborted at t/cz-08encoding.t line 33.
  1308. # Compilation failed in require at (eval 32) line 2.
  1309. # BEGIN failed--compilation aborted at (eval 32) line 2.
  1310. Bareword "Compress::Zlib::zlib_version" not allowed while "strict subs" in use at t/cz-08encoding.t line 43.
  1311. Bareword "ZLIB_VERSION" not allowed while "strict subs" in use at t/cz-08encoding.t line 43.
  1312. Execution of t/cz-08encoding.t aborted due to compilation errors.
  1313. # Looks like you planned 30 tests but only ran 2.
  1314. # Looks like your test died just after 2.
  1315. t/cz-08encoding.t ............... Dubious, test returned 255 (wstat 65280, 0xff00)
  1316. Failed 29/30 subtests
  1317. t/cz-14gzopen.t ................. 1/256
  1318. #     Failed test (t/cz-14gzopen.t at line 25)
  1319. #     Tried to use 'Compress::Zlib'.
  1320. #     Error:  Can't locate Compress/Raw/Zlib.pm in @INC (@INC contains: t t/compress /root/.cpan/build/IO-Compress-2.046-IKeaEA/blib/lib /root/.cpan/build/IO-Compress-2.046-IKeaEA/blib/arch /usr/lib64/perl5/site_perl/5.8.8/x86_64-linux-thread-multi /usr/lib/perl5/site_perl/5.8.8 /usr/lib/perl5/site_perl /usr/lib64/perl5/vendor_perl/5.8.8/x86_64-linux-thread-multi /usr/lib/perl5/vendor_perl/5.8.8 /usr/lib/perl5/vendor_perl /usr/lib64/perl5/5.8.8/x86_64-linux-thread-multi /usr/lib/perl5/5.8.8 .) at /root/.cpan/build/IO-Compress-2.046-IKeaEA/blib/lib/Compress/Zlib.pm line 11.
  1321. # BEGIN failed--compilation aborted at t/cz-14gzopen.t line 25.
  1322. # Compilation failed in require at (eval 32) line 2.
  1323. # BEGIN failed--compilation aborted at (eval 32) line 2.
  1324. Global symbol "$gzerrno" requires explicit package name at t/cz-14gzopen.t line 57.
  1325. Global symbol "$gzerrno" requires explicit package name at t/cz-14gzopen.t line 61.
  1326. Global symbol "$gzerrno" requires explicit package name at t/cz-14gzopen.t line 64.
  1327. Global symbol "$gzerrno" requires explicit package name at t/cz-14gzopen.t line 67.
  1328. Global symbol "$gzerrno" requires explicit package name at t/cz-14gzopen.t line 74.
  1329. Global symbol "$gzerrno" requires explicit package name at t/cz-14gzopen.t line 104.
  1330. Global symbol "$gzerrno" requires explicit package name at t/cz-14gzopen.t line 107.
  1331. Global symbol "$gzerrno" requires explicit package name at t/cz-14gzopen.t line 110.
  1332. Global symbol "$gzerrno" requires explicit package name at t/cz-14gzopen.t line 114.
  1333. Global symbol "$gzerrno" requires explicit package name at t/cz-14gzopen.t line 122.
  1334. Global symbol "$gzerrno" requires explicit package name at t/cz-14gzopen.t line 122.
  1335. Global symbol "$gzerrno" requires explicit package name at t/cz-14gzopen.t line 128.
  1336. Global symbol "$gzerrno" requires explicit package name at t/cz-14gzopen.t line 129.
  1337. Global symbol "$gzerrno" requires explicit package name at t/cz-14gzopen.t line 504.
  1338. Global symbol "$gzerrno" requires explicit package name at t/cz-14gzopen.t line 505.
  1339. Global symbol "$gzerrno" requires explicit package name at t/cz-14gzopen.t line 523.
  1340. Global symbol "$gzerrno" requires explicit package name at t/cz-14gzopen.t line 526.
  1341. Bareword "Compress::Zlib::zlib_version" not allowed while "strict subs" in use at t/cz-14gzopen.t line 34.
  1342. Bareword "ZLIB_VERSION" not allowed while "strict subs" in use at t/cz-14gzopen.t line 34.
  1343. Bareword "Z_FINISH" not allowed while "strict subs" in use at t/cz-14gzopen.t line 108.
  1344. Bareword "Z_STREAM_END" not allowed while "strict subs" in use at t/cz-14gzopen.t line 121.
  1345. Bareword "Z_STREAM_END" not allowed while "strict subs" in use at t/cz-14gzopen.t line 122.
  1346. Bareword "Z_STREAM_ERROR" not allowed while "strict subs" in use at t/cz-14gzopen.t line 469.
  1347. Bareword "Z_STREAM_ERROR" not allowed while "strict subs" in use at t/cz-14gzopen.t line 484.
  1348. Execution of t/cz-14gzopen.t aborted due to compilation errors.
  1349. # Looks like you planned 256 tests but only ran 3.
  1350. # Looks like your test died just after 3.
  1351. t/cz-14gzopen.t ................. Dubious, test returned 255 (wstat 65280, 0xff00)
  1352. Failed 254/256 subtests
  1353. t/globmapper.t .................. ok    
  1354.  
  1355. Test Summary Report
  1356. -------------------
  1357. t/000prereq.t                 (Wstat: 4864 Tests: 31 Failed: 19)
  1358.   Failed tests:  1-5, 9-10, 12-13, 15, 18-21, 24-28
  1359.   Non-zero exit status: 19
  1360. t/001bzip2.t                  (Wstat: 65280 Tests: 1 Failed: 0)
  1361.   Non-zero exit status: 255
  1362.   Parse errors: Bad plan.  You planned 842 tests but ran 1.
  1363. t/001zlib-generic-deflate.t   (Wstat: 512 Tests: 0 Failed: 0)
  1364.   Non-zero exit status: 2
  1365.   Parse errors: No plan found in TAP output
  1366. t/001zlib-generic-gzip.t      (Wstat: 512 Tests: 0 Failed: 0)
  1367.   Non-zero exit status: 2
  1368.   Parse errors: No plan found in TAP output
  1369. t/001zlib-generic-rawdeflate.t (Wstat: 512 Tests: 0 Failed: 0)
  1370.   Non-zero exit status: 2
  1371.   Parse errors: No plan found in TAP output
  1372. t/001zlib-generic-zip.t       (Wstat: 512 Tests: 0 Failed: 0)
  1373.   Non-zero exit status: 2
  1374.   Parse errors: No plan found in TAP output
  1375. t/002any-deflate.t            (Wstat: 512 Tests: 0 Failed: 0)
  1376.   Non-zero exit status: 2
  1377.   Parse errors: No plan found in TAP output
  1378. t/002any-gzip.t               (Wstat: 512 Tests: 0 Failed: 0)
  1379.   Non-zero exit status: 2
  1380.   Parse errors: No plan found in TAP output
  1381. t/002any-rawdeflate.t         (Wstat: 512 Tests: 0 Failed: 0)
  1382.   Non-zero exit status: 2
  1383.   Parse errors: No plan found in TAP output
  1384. t/002any-transparent.t        (Wstat: 65280 Tests: 3 Failed: 1)
  1385.   Failed test:  1
  1386.   Non-zero exit status: 255
  1387.   Parse errors: Bad plan.  You planned 16 tests but ran 3.
  1388. t/002any-zip.t                (Wstat: 512 Tests: 0 Failed: 0)
  1389.   Non-zero exit status: 2
  1390.   Parse errors: No plan found in TAP output
  1391. t/004gziphdr.t                (Wstat: 65280 Tests: 5 Failed: 2)
  1392.   Failed tests:  1, 3
  1393.   Non-zero exit status: 255
  1394.   Parse errors: Bad plan.  You planned 919 tests but ran 5.
  1395. t/005defhdr.t                 (Wstat: 65280 Tests: 5 Failed: 2)
  1396.   Failed tests:  1-2
  1397.   Non-zero exit status: 255
  1398.   Parse errors: Bad plan.  You planned 596 tests but ran 5.
  1399. t/006zip.t                    (Wstat: 65280 Tests: 3 Failed: 2)
  1400.   Failed tests:  1, 3
  1401.   Non-zero exit status: 255
  1402.   Parse errors: Bad plan.  You planned 92 tests but ran 3.
  1403. t/010examples-bzip2.t         (Wstat: 65280 Tests: 0 Failed: 0)
  1404.   Non-zero exit status: 255
  1405.   Parse errors: No plan found in TAP output
  1406. t/010examples-zlib.t          (Wstat: 65280 Tests: 0 Failed: 0)
  1407.   Non-zero exit status: 255
  1408.   Parse errors: No plan found in TAP output
  1409. t/050interop-gzip.t           (Wstat: 65280 Tests: 3 Failed: 2)
  1410.   Failed tests:  1, 3
  1411.   Non-zero exit status: 255
  1412.   Parse errors: Bad plan.  You planned 8 tests but ran 3.
  1413. t/100generic-bzip2.t          (Wstat: 512 Tests: 0 Failed: 0)
  1414.   Non-zero exit status: 2
  1415.   Parse errors: No plan found in TAP output
  1416. t/100generic-deflate.t        (Wstat: 512 Tests: 0 Failed: 0)
  1417.   Non-zero exit status: 2
  1418.   Parse errors: No plan found in TAP output
  1419. t/100generic-gzip.t           (Wstat: 512 Tests: 0 Failed: 0)
  1420.   Non-zero exit status: 2
  1421.   Parse errors: No plan found in TAP output
  1422. t/100generic-rawdeflate.t     (Wstat: 512 Tests: 0 Failed: 0)
  1423.   Non-zero exit status: 2
  1424.   Parse errors: No plan found in TAP output
  1425. t/100generic-zip.t            (Wstat: 512 Tests: 0 Failed: 0)
  1426.   Non-zero exit status: 2
  1427.   Parse errors: No plan found in TAP output
  1428. t/101truncate-bzip2.t         (Wstat: 65280 Tests: 1 Failed: 0)
  1429.   Non-zero exit status: 255
  1430.   Parse errors: Bad plan.  You planned 4013 tests but ran 1.
  1431. t/101truncate-deflate.t       (Wstat: 65280 Tests: 1 Failed: 0)
  1432.   Non-zero exit status: 255
  1433.   Parse errors: Bad plan.  You planned 3057 tests but ran 1.
  1434. t/101truncate-gzip.t          (Wstat: 65280 Tests: 1 Failed: 0)
  1435.   Non-zero exit status: 255
  1436.   Parse errors: Bad plan.  You planned 3545 tests but ran 1.
  1437. t/101truncate-rawdeflate.t    (Wstat: 65280 Tests: 1 Failed: 0)
  1438.   Non-zero exit status: 255
  1439.   Parse errors: Bad plan.  You planned 626 tests but ran 1.
  1440. t/101truncate-zip.t           (Wstat: 65280 Tests: 1 Failed: 0)
  1441.   Non-zero exit status: 255
  1442.   Parse errors: Bad plan.  You planned 9157 tests but ran 1.
  1443. t/102tied-bzip2.t             (Wstat: 512 Tests: 0 Failed: 0)
  1444.   Non-zero exit status: 2
  1445.   Parse errors: No plan found in TAP output
  1446. t/102tied-deflate.t           (Wstat: 512 Tests: 0 Failed: 0)
  1447.   Non-zero exit status: 2
  1448.   Parse errors: No plan found in TAP output
  1449. t/102tied-gzip.t              (Wstat: 512 Tests: 0 Failed: 0)
  1450.   Non-zero exit status: 2
  1451.   Parse errors: No plan found in TAP output
  1452. t/102tied-rawdeflate.t        (Wstat: 512 Tests: 0 Failed: 0)
  1453.   Non-zero exit status: 2
  1454.   Parse errors: No plan found in TAP output
  1455. t/102tied-zip.t               (Wstat: 512 Tests: 0 Failed: 0)
  1456.   Non-zero exit status: 2
  1457.   Parse errors: No plan found in TAP output
  1458. t/103newtied-bzip2.t          (Wstat: 512 Tests: 0 Failed: 0)
  1459.   Non-zero exit status: 2
  1460.   Parse errors: No plan found in TAP output
  1461. t/103newtied-deflate.t        (Wstat: 512 Tests: 0 Failed: 0)
  1462.   Non-zero exit status: 2
  1463.   Parse errors: No plan found in TAP output
  1464. t/103newtied-gzip.t           (Wstat: 512 Tests: 0 Failed: 0)
  1465.   Non-zero exit status: 2
  1466.   Parse errors: No plan found in TAP output
  1467. t/103newtied-rawdeflate.t     (Wstat: 512 Tests: 0 Failed: 0)
  1468.   Non-zero exit status: 2
  1469.   Parse errors: No plan found in TAP output
  1470. t/103newtied-zip.t            (Wstat: 512 Tests: 0 Failed: 0)
  1471.   Non-zero exit status: 2
  1472.   Parse errors: No plan found in TAP output
  1473. t/104destroy-bzip2.t          (Wstat: 512 Tests: 0 Failed: 0)
  1474.   Non-zero exit status: 2
  1475.   Parse errors: No plan found in TAP output
  1476. t/104destroy-deflate.t        (Wstat: 512 Tests: 0 Failed: 0)
  1477.   Non-zero exit status: 2
  1478.   Parse errors: No plan found in TAP output
  1479. t/104destroy-gzip.t           (Wstat: 512 Tests: 0 Failed: 0)
  1480.   Non-zero exit status: 2
  1481.   Parse errors: No plan found in TAP output
  1482. t/104destroy-rawdeflate.t     (Wstat: 512 Tests: 0 Failed: 0)
  1483.   Non-zero exit status: 2
  1484.   Parse errors: No plan found in TAP output
  1485. t/104destroy-zip.t            (Wstat: 512 Tests: 0 Failed: 0)
  1486.   Non-zero exit status: 2
  1487.   Parse errors: No plan found in TAP output
  1488. t/105oneshot-bzip2.t          (Wstat: 512 Tests: 0 Failed: 0)
  1489.   Non-zero exit status: 2
  1490.   Parse errors: No plan found in TAP output
  1491. t/105oneshot-deflate.t        (Wstat: 512 Tests: 0 Failed: 0)
  1492.   Non-zero exit status: 2
  1493.   Parse errors: No plan found in TAP output
  1494. t/105oneshot-gzip-only.t      (Wstat: 65280 Tests: 3 Failed: 1)
  1495.   Failed test:  1
  1496.   Non-zero exit status: 255
  1497.   Parse errors: Bad plan.  You planned 71 tests but ran 3.
  1498. t/105oneshot-gzip.t           (Wstat: 512 Tests: 0 Failed: 0)
  1499.   Non-zero exit status: 2
  1500.   Parse errors: No plan found in TAP output
  1501. t/105oneshot-rawdeflate.t     (Wstat: 512 Tests: 0 Failed: 0)
  1502.   Non-zero exit status: 2
  1503.   Parse errors: No plan found in TAP output
  1504. t/105oneshot-zip-only.t       (Wstat: 65280 Tests: 3 Failed: 1)
  1505.   Failed test:  1
  1506.   Non-zero exit status: 255
  1507.   Parse errors: Bad plan.  You planned 217 tests but ran 3.
  1508. t/105oneshot-zip.t            (Wstat: 512 Tests: 0 Failed: 0)
  1509.   Non-zero exit status: 2
  1510.   Parse errors: No plan found in TAP output
  1511. t/106prime-bzip2.t            (Wstat: 512 Tests: 0 Failed: 0)
  1512.   Non-zero exit status: 2
  1513.   Parse errors: No plan found in TAP output
  1514. t/106prime-deflate.t          (Wstat: 512 Tests: 0 Failed: 0)
  1515.   Non-zero exit status: 2
  1516.   Parse errors: No plan found in TAP output
  1517. t/106prime-gzip.t             (Wstat: 512 Tests: 0 Failed: 0)
  1518.   Non-zero exit status: 2
  1519.   Parse errors: No plan found in TAP output
  1520. t/106prime-rawdeflate.t       (Wstat: 512 Tests: 0 Failed: 0)
  1521.   Non-zero exit status: 2
  1522.   Parse errors: No plan found in TAP output
  1523. t/106prime-zip.t              (Wstat: 512 Tests: 0 Failed: 0)
  1524.   Non-zero exit status: 2
  1525.   Parse errors: No plan found in TAP output
  1526. t/107multi-bzip2.t            (Wstat: 512 Tests: 0 Failed: 0)
  1527.   Non-zero exit status: 2
  1528.   Parse errors: No plan found in TAP output
  1529. t/107multi-deflate.t          (Wstat: 512 Tests: 0 Failed: 0)
  1530.   Non-zero exit status: 2
  1531.   Parse errors: No plan found in TAP output
  1532. t/107multi-gzip.t             (Wstat: 512 Tests: 0 Failed: 0)
  1533.   Non-zero exit status: 2
  1534.   Parse errors: No plan found in TAP output
  1535. t/107multi-rawdeflate.t       (Wstat: 512 Tests: 0 Failed: 0)
  1536.   Non-zero exit status: 2
  1537.   Parse errors: No plan found in TAP output
  1538. t/107multi-zip.t              (Wstat: 512 Tests: 0 Failed: 0)
  1539.   Non-zero exit status: 2
  1540.   Parse errors: No plan found in TAP output
  1541. t/108anyunc-bzip2.t           (Wstat: 512 Tests: 0 Failed: 0)
  1542.   Non-zero exit status: 2
  1543.   Parse errors: No plan found in TAP output
  1544. t/108anyunc-deflate.t         (Wstat: 512 Tests: 0 Failed: 0)
  1545.   Non-zero exit status: 2
  1546.   Parse errors: No plan found in TAP output
  1547. t/108anyunc-gzip.t            (Wstat: 512 Tests: 0 Failed: 0)
  1548.   Non-zero exit status: 2
  1549.   Parse errors: No plan found in TAP output
  1550. t/108anyunc-rawdeflate.t      (Wstat: 512 Tests: 0 Failed: 0)
  1551.   Non-zero exit status: 2
  1552.   Parse errors: No plan found in TAP output
  1553. t/108anyunc-zip.t             (Wstat: 512 Tests: 0 Failed: 0)
  1554.   Non-zero exit status: 2
  1555.   Parse errors: No plan found in TAP output
  1556. t/109merge-deflate.t          (Wstat: 512 Tests: 0 Failed: 0)
  1557.   Non-zero exit status: 2
  1558.   Parse errors: No plan found in TAP output
  1559. t/109merge-gzip.t             (Wstat: 512 Tests: 0 Failed: 0)
  1560.   Non-zero exit status: 2
  1561.   Parse errors: No plan found in TAP output
  1562. t/109merge-rawdeflate.t       (Wstat: 512 Tests: 0 Failed: 0)
  1563.   Non-zero exit status: 2
  1564.   Parse errors: No plan found in TAP output
  1565. t/110encode-bzip2.t           (Wstat: 512 Tests: 0 Failed: 0)
  1566.   Non-zero exit status: 2
  1567.   Parse errors: No plan found in TAP output
  1568. t/110encode-deflate.t         (Wstat: 512 Tests: 0 Failed: 0)
  1569.   Non-zero exit status: 2
  1570.   Parse errors: No plan found in TAP output
  1571. t/110encode-gzip.t            (Wstat: 512 Tests: 0 Failed: 0)
  1572.   Non-zero exit status: 2
  1573.   Parse errors: No plan found in TAP output
  1574. t/110encode-rawdeflate.t      (Wstat: 512 Tests: 0 Failed: 0)
  1575.   Non-zero exit status: 2
  1576.   Parse errors: No plan found in TAP output
  1577. t/110encode-zip.t             (Wstat: 512 Tests: 0 Failed: 0)
  1578.   Non-zero exit status: 2
  1579.   Parse errors: No plan found in TAP output
  1580. t/cz-01version.t              (Wstat: 65280 Tests: 2 Failed: 1)
  1581.   Failed test:  1
  1582.   Non-zero exit status: 255
  1583.   Parse errors: Bad plan.  You planned 3 tests but ran 2.
  1584. t/cz-03zlib-v1.t              (Wstat: 65280 Tests: 4 Failed: 2)
  1585.   Failed tests:  1, 3
  1586.   Non-zero exit status: 255
  1587.   Parse errors: Bad plan.  You planned 457 tests but ran 4.
  1588. t/cz-05examples.t             (Wstat: 65280 Tests: 0 Failed: 0)
  1589.   Non-zero exit status: 255
  1590.   Parse errors: No plan found in TAP output
  1591. t/cz-06gzsetp.t               (Wstat: 65280 Tests: 0 Failed: 0)
  1592.   Non-zero exit status: 255
  1593.   Parse errors: No plan found in TAP output
  1594. t/cz-08encoding.t             (Wstat: 65280 Tests: 2 Failed: 1)
  1595.   Failed test:  1
  1596.   Non-zero exit status: 255
  1597.   Parse errors: Bad plan.  You planned 30 tests but ran 2.
  1598. t/cz-14gzopen.t               (Wstat: 65280 Tests: 3 Failed: 1)
  1599.   Failed test:  1
  1600.   Non-zero exit status: 255
  1601.   Parse errors: Bad plan.  You planned 256 tests but ran 3.
  1602. Files=86, Tests=328,  6 wallclock secs ( 0.51 usr  0.58 sys +  3.98 cusr  1.24 csys =  6.31 CPU)
  1603. Result: FAIL
  1604. Failed 78/86 test programs. 35/328 subtests failed.
  1605. make: *** [test_dynamic] Error 255
  1606.   PMQS/IO-Compress-2.046.tar.gz
  1607. 2 dependencies missing (Compress::Raw::Bzip2,Compress::Raw::Zlib); additionally test harness failed
  1608.   /usr/bin/make test -- NOT OK
  1609. //hint// to see the cpan-testers results for installing this module, try:
  1610.   reports PMQS/IO-Compress-2.046.tar.gz
  1611. Running make install
  1612.   make test had returned bad status, won't install without force
  1613. Failed during this command:
  1614.  PMQS/Compress-Raw-Bzip2-2.045.tar.gz         : make NO
  1615.  PMQS/Compress-Raw-Zlib-2.045.tar.gz          : make NO
  1616.  PMQS/IO-Compress-2.046.tar.gz                : make_test NO 2 dependencies missing (Compress::Raw::Bzip2,Compress::Raw::Zlib); additionally test harness failed
  1617.  
  1618. cpan[2]>
clone this paste RAW Paste Data