Guest User

Untitled

a guest
Aug 4th, 2014
255
0
Never
Not a member of Pastebin yet? Sign Up, it unlocks many cool features!
text 3.18 KB | None | 0 0
  1. configure:2605: powerpc-poky-linux-g++ -m32 -mcpu=8548 -mabi=spe -mspe -mfloat-gprs=double --sysroot=##SDKTARGETSYSROOT## -V >&5
  2. powerpc-poky-linux-g++: error: unrecognized command line option '-V'
  3. powerpc-poky-linux-g++: fatal error: no input files
  4. compilation terminated.
  5. configure:2609: $? = 1
  6. configure:2632: checking for C++ compiler default output file name
  7. configure:2654: powerpc-poky-linux-g++ -m32 -mcpu=8548 -mabi=spe -mspe -mfloat-gprs=double --sysroot=##SDKTARGETSYSROOT## -O2 -pipe -g -feliminate-unused-debug-types -Wl,
  8. -O1 -Wl,--hash-style=gnu -Wl,--as-needed conftest.cpp >&5
  9. /run/media/fed/big/work/7m2rc1/tc/sdk-ppc5/sysroots/x86_64-pokysdk-linux/usr/bin/powerpc-poky-linux-gnuspe/powerpc-poky-linux-gnuspe-ld: cannot find crt1.o: No such file or
  10. directory
  11. /run/media/fed/big/work/7m2rc1/tc/sdk-ppc5/sysroots/x86_64-pokysdk-linux/usr/bin/powerpc-poky-linux-gnuspe/powerpc-poky-linux-gnuspe-ld: cannot find crti.o: No such file or
  12. directory
  13. /run/media/fed/big/work/7m2rc1/tc/sdk-ppc5/sysroots/x86_64-pokysdk-linux/usr/bin/powerpc-poky-linux-gnuspe/powerpc-poky-linux-gnuspe-ld: cannot find crtbegin.o: No such file
  14. or directory
  15. /run/media/fed/big/work/7m2rc1/tc/sdk-ppc5/sysroots/x86_64-pokysdk-linux/usr/bin/powerpc-poky-linux-gnuspe/powerpc-poky-linux-gnuspe-ld: cannot find -lstdc++
  16. /run/media/fed/big/work/7m2rc1/tc/sdk-ppc5/sysroots/x86_64-pokysdk-linux/usr/bin/powerpc-poky-linux-gnuspe/powerpc-poky-linux-gnuspe-ld: cannot find -lm
  17. /run/media/fed/big/work/7m2rc1/tc/sdk-ppc5/sysroots/x86_64-pokysdk-linux/usr/bin/powerpc-poky-linux-gnuspe/powerpc-poky-linux-gnuspe-ld: cannot find -lgcc_s
  18. /run/media/fed/big/work/7m2rc1/tc/sdk-ppc5/sysroots/x86_64-pokysdk-linux/usr/bin/powerpc-poky-linux-gnuspe/powerpc-poky-linux-gnuspe-ld: cannot find -lgcc
  19. /run/media/fed/big/work/7m2rc1/tc/sdk-ppc5/sysroots/x86_64-pokysdk-linux/usr/bin/powerpc-poky-linux-gnuspe/powerpc-poky-linux-gnuspe-ld: cannot find -lc
  20. /run/media/fed/big/work/7m2rc1/tc/sdk-ppc5/sysroots/x86_64-pokysdk-linux/usr/bin/powerpc-poky-linux-gnuspe/powerpc-poky-linux-gnuspe-ld: cannot find -lgcc_s
  21. /run/media/fed/big/work/7m2rc1/tc/sdk-ppc5/sysroots/x86_64-pokysdk-linux/usr/bin/powerpc-poky-linux-gnuspe/powerpc-poky-linux-gnuspe-ld: cannot find -lgcc
  22. /run/media/fed/big/work/7m2rc1/tc/sdk-ppc5/sysroots/x86_64-pokysdk-linux/usr/bin/powerpc-poky-linux-gnuspe/powerpc-poky-linux-gnuspe-ld: cannot find crtend.o: No such file or directory
  23. /run/media/fed/big/work/7m2rc1/tc/sdk-ppc5/sysroots/x86_64-pokysdk-linux/usr/bin/powerpc-poky-linux-gnuspe/powerpc-poky-linux-gnuspe-ld: cannot find crtn.o: No such file or directory
  24. collect2: error: ld returned 1 exit status
  25. configure:2658: $? = 1
  26. configure:2696: result:
  27. configure: failed program was:
  28. | /* confdefs.h. */
  29. | #define PACKAGE_NAME ""
  30. | #define PACKAGE_TARNAME ""
  31. | #define PACKAGE_VERSION ""
  32. | #define PACKAGE_STRING ""
  33. | #define PACKAGE_BUGREPORT ""
  34. | #define PACKAGE "sudoku-savant"
  35. | #define VERSION "1.3"
  36. | /* end confdefs.h. */
  37. |
  38. | int
  39. | main ()
  40. | {
  41. |
  42. | ;
  43. | return 0;
  44. | }
  45. configure:2702: error: in `/run/media/fed/big/work/7m2rc1/tc/sudoku-savant-1.3':
  46. configure:2705: error: C++ compiler cannot create executables
  47. See `config.log' for more details.
Advertisement
Add Comment
Please, Sign In to add comment