This week only. Pastebin PRO Accounts Christmas Special! Don't miss out!Want more features on Pastebin? Sign Up, it's FREE!
Guest

Untitled

By: a guest on Oct 5th, 2012  |  syntax: None  |  size: 48.46 KB  |  views: 31  |  expires: Never
download  |  raw  |  embed  |  report abuse  |  print
Text below is selected. Please press Ctrl+C to copy to your clipboard. (⌘+C on Mac)
  1.   CHK     include/linux/version.h
  2.   CHK     include/generated/utsrelease.h
  3. make[1]: `include/generated/mach-types.h' is up to date.
  4.   CALL    scripts/checksyscalls.sh
  5.   CHK     include/generated/compile.h
  6.   CC [M]  drivers/staging/ath6kl/htc2/AR6000/ar6k.o
  7. In file included from drivers/staging/ath6kl/htc2/AR6000/../htc_debug.h:27,
  8.                  from drivers/staging/ath6kl/htc2/AR6000/ar6k.c:31:
  9. drivers/staging/ath6kl/include/a_debug.h:60: error: expected ')' before '*' token
  10. drivers/staging/ath6kl/include/a_debug.h:122: error: expected specifier-qualifier-list before 'A_UINT32'
  11. drivers/staging/ath6kl/include/a_debug.h:130: error: expected specifier-qualifier-list before 'A_CHAR'
  12. drivers/staging/ath6kl/include/a_debug.h:184: error: expected ')' before '*' token
  13. drivers/staging/ath6kl/include/a_debug.h:185: error: expected ')' before '*' token
  14. drivers/staging/ath6kl/include/a_debug.h:186: error: expected ')' before '*' token
  15. In file included from drivers/staging/ath6kl/include/hif.h:37,
  16.                  from drivers/staging/ath6kl/htc2/AR6000/ar6k.c:32:
  17. drivers/staging/ath6kl/include/dl_list.h:81: error: expected '=', ',', ';', 'asm' or '__attribute__' before 'PDL_LIST'
  18. drivers/staging/ath6kl/include/dl_list.h:93: error: expected '=', ',', ';', 'asm' or '__attribute__' before 'PDL_LIST'
  19. drivers/staging/ath6kl/include/dl_list.h:106: error: expected '=', ',', ';', 'asm' or '__attribute__' before 'PDL_LIST'
  20. drivers/staging/ath6kl/include/dl_list.h:118: error: expected '=', ',', ';', 'asm' or '__attribute__' before 'PDL_LIST'
  21. drivers/staging/ath6kl/include/dl_list.h:128: error: expected '=', ',', ';', 'asm' or '__attribute__' before 'PDL_LIST'
  22. drivers/staging/ath6kl/include/dl_list.h:139: error: expected '=', ',', ';', 'asm' or '__attribute__' before 'void'
  23. In file included from drivers/staging/ath6kl/htc2/AR6000/ar6k.c:32:
  24. drivers/staging/ath6kl/include/hif.h:227: error: expected specifier-qualifier-list before 'A_UINT32'
  25. drivers/staging/ath6kl/include/hif.h:239: error: expected specifier-qualifier-list before 'A_UINT32'
  26. drivers/staging/ath6kl/include/hif.h:274: error: expected specifier-qualifier-list before 'A_UINT8'
  27. drivers/staging/ath6kl/include/hif.h:291: error: expected specifier-qualifier-list before 'A_UINT32'
  28. drivers/staging/ath6kl/include/hif.h:347: error: expected specifier-qualifier-list before 'A_UINT32'
  29. drivers/staging/ath6kl/include/hif.h:366: error: expected declaration specifiers or '...' before 'A_BOOL'
  30. drivers/staging/ath6kl/include/hif.h:403: error: expected declaration specifiers or '...' before 'A_UINT32'
  31. drivers/staging/ath6kl/include/hif.h:404: error: expected declaration specifiers or '...' before 'A_UCHAR'
  32. drivers/staging/ath6kl/include/hif.h:405: error: expected declaration specifiers or '...' before 'A_UINT32'
  33. drivers/staging/ath6kl/include/hif.h:406: error: expected declaration specifiers or '...' before 'A_UINT32'
  34. drivers/staging/ath6kl/include/hif.h:446: error: expected declaration specifiers or '...' before 'A_UINT32'
  35. In file included from drivers/staging/ath6kl/htc2/AR6000/ar6k.c:33:
  36. drivers/staging/ath6kl/include/htc_packet.h:49: error: expected '=', ',', ';', 'asm' or '__attribute__' before 'HTC_TX_TAG'
  37. drivers/staging/ath6kl/include/htc_packet.h:52: error: expected specifier-qualifier-list before 'HTC_TX_TAG'
  38. drivers/staging/ath6kl/include/htc_packet.h:63: error: expected specifier-qualifier-list before 'A_UINT32'
  39. drivers/staging/ath6kl/include/htc_packet.h:75: error: expected specifier-qualifier-list before 'A_UINT8'
  40. drivers/staging/ath6kl/include/htc_packet.h:168: error: expected '=', ',', ';', 'asm' or '__attribute__' before 'HTC_PACKET'
  41. drivers/staging/ath6kl/include/htc_packet.h:182: error: expected '=', ',', ';', 'asm' or '__attribute__' before 'HTC_PACKET'
  42. drivers/staging/ath6kl/include/htc_packet.h:192: error: expected '=', ',', ';', 'asm' or '__attribute__' before 'HTC_PACKET'
  43. In file included from drivers/staging/ath6kl/htc2/AR6000/ar6k.h:28,
  44.                  from drivers/staging/ath6kl/htc2/AR6000/ar6k.c:34:
  45. drivers/staging/ath6kl/include/hci_transport_api.h:169: error: expected declaration specifiers or '...' before 'A_BOOL'
  46. drivers/staging/ath6kl/include/hci_transport_api.h:209: error: expected declaration specifiers or '...' before 'A_BOOL'
  47. drivers/staging/ath6kl/include/hci_transport_api.h:240: error: expected declaration specifiers or '...' before 'A_UINT32'
  48. drivers/staging/ath6kl/include/hci_transport_api.h:253: error: expected declaration specifiers or '...' before 'A_BOOL'
  49. In file included from drivers/staging/ath6kl/htc2/AR6000/ar6k.c:34:
  50. drivers/staging/ath6kl/htc2/AR6000/ar6k.h:46: error: expected '=', ',', ';', 'asm' or '__attribute__' before 'struct'
  51. drivers/staging/ath6kl/htc2/AR6000/ar6k.h:57: error: expected '=', ',', ';', 'asm' or '__attribute__' before 'AR6K_IRQ_PROC_REGISTERS'
  52. drivers/staging/ath6kl/htc2/AR6000/ar6k.h:61: error: expected '=', ',', ';', 'asm' or '__attribute__' before 'struct'
  53. drivers/staging/ath6kl/htc2/AR6000/ar6k.h:66: error: expected '=', ',', ';', 'asm' or '__attribute__' before 'AR6K_IRQ_ENABLE_REGISTERS'
  54. drivers/staging/ath6kl/htc2/AR6000/ar6k.h:68: error: expected '=', ',', ';', 'asm' or '__attribute__' before 'struct'
  55. drivers/staging/ath6kl/htc2/AR6000/ar6k.h:70: error: expected '=', ',', ';', 'asm' or '__attribute__' before 'AR6K_GMBOX_CTRL_REGISTERS'
  56. In file included from drivers/staging/ath6kl/htc2/AR6000/ar6k.c:34:
  57. drivers/staging/ath6kl/htc2/AR6000/ar6k.h:94: error: expected specifier-qualifier-list before 'A_UINT8'
  58. drivers/staging/ath6kl/htc2/AR6000/ar6k.h:101: error: expected declaration specifiers or '...' before 'A_UINT8'
  59. drivers/staging/ath6kl/htc2/AR6000/ar6k.h:102: error: expected declaration specifiers or '...' before 'A_BOOL'
  60. drivers/staging/ath6kl/htc2/AR6000/ar6k.h:105: error: expected specifier-qualifier-list before 'A_BOOL'
  61. drivers/staging/ath6kl/htc2/AR6000/ar6k.h:109: error: expected specifier-qualifier-list before 'A_MUTEX_T'
  62. drivers/staging/ath6kl/htc2/AR6000/ar6k.h:155: error: expected declaration specifiers or '...' before 'A_UINT32'
  63. drivers/staging/ath6kl/htc2/AR6000/ar6k.h:162: error: expected declaration specifiers or '...' before 'AR6K_IRQ_PROC_REGISTERS'
  64. drivers/staging/ath6kl/htc2/AR6000/ar6k.h:163: error: expected declaration specifiers or '...' before 'AR6K_IRQ_ENABLE_REGISTERS'
  65. drivers/staging/ath6kl/htc2/AR6000/ar6k.h:169: error: expected declaration specifiers or '...' before 'A_BOOL'
  66. drivers/staging/ath6kl/htc2/AR6000/ar6k.h:170: error: expected declaration specifiers or '...' before 'A_BOOL'
  67. drivers/staging/ath6kl/htc2/AR6000/ar6k.h:173: error: expected declaration specifiers or '...' before 'A_UINT32'
  68. drivers/staging/ath6kl/htc2/AR6000/ar6k.h:173: error: expected declaration specifiers or '...' before 'A_BOOL'
  69. drivers/staging/ath6kl/htc2/AR6000/ar6k.h:179: error: expected '=', ',', ';', 'asm' or '__attribute__' before 'A_STATUS'
  70. drivers/staging/ath6kl/htc2/AR6000/ar6k.h:222: error: expected '=', ',', ';', 'asm' or '__attribute__' before 'A_STATUS'
  71. drivers/staging/ath6kl/htc2/AR6000/ar6k.h:275: error: expected declaration specifiers or '...' before 'A_BOOL'
  72. drivers/staging/ath6kl/htc2/AR6000/ar6k.h:286: error: expected '=', ',', ';', 'asm' or '__attribute__' before 'A_STATUS'
  73. drivers/staging/ath6kl/htc2/AR6000/ar6k.h:312: error: expected declaration specifiers or '...' before 'A_BOOL'
  74. drivers/staging/ath6kl/htc2/AR6000/ar6k.h:312: error: expected declaration specifiers or '...' before 'A_BOOL'
  75. drivers/staging/ath6kl/htc2/AR6000/ar6k.h:320: error: expected specifier-qualifier-list before 'A_UINT8'
  76. drivers/staging/ath6kl/htc2/AR6000/ar6k.h:348: error: expected '=', ',', ';', 'asm' or '__attribute__' before 'A_STATUS'
  77. drivers/staging/ath6kl/htc2/AR6000/ar6k.c: In function 'AR6KFreeIOPacket':
  78. drivers/staging/ath6kl/htc2/AR6000/ar6k.c:45: error: implicit declaration of function 'A_MUTEX_LOCK'
  79. drivers/staging/ath6kl/htc2/AR6000/ar6k.c:45: error: 'AR6K_DEVICE' has no member named 'Lock'
  80. drivers/staging/ath6kl/htc2/AR6000/ar6k.c:46: error: implicit declaration of function 'DL_ListInsertTail'
  81. drivers/staging/ath6kl/htc2/AR6000/ar6k.c:46: error: 'AR6K_DEVICE' has no member named 'RegisterIOList'
  82. drivers/staging/ath6kl/htc2/AR6000/ar6k.c:46: error: 'AR6K_DEVICE' has no member named 'RegisterIOList'
  83. drivers/staging/ath6kl/htc2/AR6000/ar6k.c:47: error: implicit declaration of function 'A_MUTEX_UNLOCK'
  84. drivers/staging/ath6kl/htc2/AR6000/ar6k.c:47: error: 'AR6K_DEVICE' has no member named 'Lock'
  85. drivers/staging/ath6kl/htc2/AR6000/ar6k.c: In function 'AR6KAllocIOPacket':
  86. drivers/staging/ath6kl/htc2/AR6000/ar6k.c:54: error: 'AR6K_DEVICE' has no member named 'Lock'
  87. drivers/staging/ath6kl/htc2/AR6000/ar6k.c:55: error: implicit declaration of function 'HTC_PACKET_DEQUEUE'
  88. drivers/staging/ath6kl/htc2/AR6000/ar6k.c:55: error: 'AR6K_DEVICE' has no member named 'RegisterIOList'
  89. drivers/staging/ath6kl/htc2/AR6000/ar6k.c:56: error: 'AR6K_DEVICE' has no member named 'Lock'
  90. drivers/staging/ath6kl/htc2/AR6000/ar6k.c: In function 'DevCleanup':
  91. drivers/staging/ath6kl/htc2/AR6000/ar6k.c:65: error: 'AR6K_DEVICE' has no member named 'HifAttached'
  92. drivers/staging/ath6kl/htc2/AR6000/ar6k.c:66: error: 'AR6K_DEVICE' has no member named 'HIFDevice'
  93. drivers/staging/ath6kl/htc2/AR6000/ar6k.c:67: error: 'AR6K_DEVICE' has no member named 'HifAttached'
  94. drivers/staging/ath6kl/htc2/AR6000/ar6k.c:72: error: implicit declaration of function 'A_IS_MUTEX_VALID'
  95. drivers/staging/ath6kl/htc2/AR6000/ar6k.c:72: error: 'AR6K_DEVICE' has no member named 'Lock'
  96. drivers/staging/ath6kl/htc2/AR6000/ar6k.c:73: error: implicit declaration of function 'A_MUTEX_DELETE'
  97. drivers/staging/ath6kl/htc2/AR6000/ar6k.c:73: error: 'AR6K_DEVICE' has no member named 'Lock'
  98. drivers/staging/ath6kl/htc2/AR6000/ar6k.c: In function 'DevSetup':
  99. drivers/staging/ath6kl/htc2/AR6000/ar6k.c:79: error: 'A_UINT32' undeclared (first use in this function)
  100. drivers/staging/ath6kl/htc2/AR6000/ar6k.c:79: error: (Each undeclared identifier is reported only once
  101. drivers/staging/ath6kl/htc2/AR6000/ar6k.c:79: error: for each function it appears in.)
  102. drivers/staging/ath6kl/htc2/AR6000/ar6k.c:79: error: expected ';' before 'blocksizes'
  103. cc1: warnings being treated as errors
  104. drivers/staging/ath6kl/htc2/AR6000/ar6k.c:80: error: ISO C90 forbids mixed declarations and code
  105. drivers/staging/ath6kl/htc2/AR6000/ar6k.c:86: error: 'AR6K_DEVICE' has no member named 'ScatterReqHead'
  106. drivers/staging/ath6kl/htc2/AR6000/ar6k.c:86: error: 'AR6K_DEVICE' has no member named 'ScatterReqHead'
  107. drivers/staging/ath6kl/htc2/AR6000/ar6k.c:86: error: 'AR6K_DEVICE' has no member named 'ScatterReqHead'
  108. drivers/staging/ath6kl/htc2/AR6000/ar6k.c:86: error: 'AR6K_DEVICE' has no member named 'ScatterReqHead'
  109. drivers/staging/ath6kl/htc2/AR6000/ar6k.c:88: error: 'AR6K_DEVICE' has no member named 'RegisterIOList'
  110. drivers/staging/ath6kl/htc2/AR6000/ar6k.c:88: error: 'AR6K_DEVICE' has no member named 'RegisterIOList'
  111. drivers/staging/ath6kl/htc2/AR6000/ar6k.c:88: error: 'AR6K_DEVICE' has no member named 'RegisterIOList'
  112. drivers/staging/ath6kl/htc2/AR6000/ar6k.c:88: error: 'AR6K_DEVICE' has no member named 'RegisterIOList'
  113. drivers/staging/ath6kl/htc2/AR6000/ar6k.c:88: error: 'AR6K_DEVICE' has no member named 'RegisterIOList'
  114. drivers/staging/ath6kl/htc2/AR6000/ar6k.c:89: error: implicit declaration of function 'A_MUTEX_INIT'
  115. drivers/staging/ath6kl/htc2/AR6000/ar6k.c:89: error: 'AR6K_DEVICE' has no member named 'Lock'
  116. drivers/staging/ath6kl/htc2/AR6000/ar6k.c:91: error: implicit declaration of function 'A_MEMZERO'
  117. drivers/staging/ath6kl/htc2/AR6000/ar6k.c:97: error: 'AR6K_DEVICE' has no member named 'HIFDevice'
  118. drivers/staging/ath6kl/htc2/AR6000/ar6k.c:103: error: 'AR6K_DEVICE' has no member named 'HifAttached'
  119. drivers/staging/ath6kl/htc2/AR6000/ar6k.c:106: error: 'AR6K_DEVICE' has no member named 'HIFDevice'
  120. drivers/staging/ath6kl/htc2/AR6000/ar6k.c:107: error: 'AR6K_DEVICE' has no member named 'MailBoxInfo'
  121. drivers/staging/ath6kl/htc2/AR6000/ar6k.c:107: error: 'AR6K_DEVICE' has no member named 'MailBoxInfo'
  122. drivers/staging/ath6kl/htc2/AR6000/ar6k.c:107: error: too many arguments to function 'HIFConfigureDevice'
  123. drivers/staging/ath6kl/htc2/AR6000/ar6k.c:110: error: implicit declaration of function 'A_ASSERT'
  124. drivers/staging/ath6kl/htc2/AR6000/ar6k.c:117: error: 'AR6K_DEVICE' has no member named 'RegIOBuffers'
  125. drivers/staging/ath6kl/htc2/AR6000/ar6k.c:118: error: 'HTC_PACKET' has no member named 'pBuffer'
  126. drivers/staging/ath6kl/htc2/AR6000/ar6k.c:118: error: 'AR6K_DEVICE' has no member named 'RegIOBuffers'
  127. drivers/staging/ath6kl/htc2/AR6000/ar6k.c:118: error: 'HTC_PACKET' has no member named 'pBufferStart'
  128. drivers/staging/ath6kl/htc2/AR6000/ar6k.c:118: error: 'AR6K_DEVICE' has no member named 'RegIOBuffers'
  129. drivers/staging/ath6kl/htc2/AR6000/ar6k.c:118: error: 'HTC_PACKET' has no member named 'BufferLength'
  130. drivers/staging/ath6kl/htc2/AR6000/ar6k.c:118: error: 'HTC_PACKET' has no member named 'Endpoint'
  131. drivers/staging/ath6kl/htc2/AR6000/ar6k.c:127: error: 'AR6K_DEVICE' has no member named 'HIFDevice'
  132. drivers/staging/ath6kl/htc2/AR6000/ar6k.c:128: error: 'blocksizes' undeclared (first use in this function)
  133. drivers/staging/ath6kl/htc2/AR6000/ar6k.c:128: error: too many arguments to function 'HIFConfigureDevice'
  134. drivers/staging/ath6kl/htc2/AR6000/ar6k.c:138: error: 'AR6K_DEVICE' has no member named 'BlockSize'
  135. drivers/staging/ath6kl/htc2/AR6000/ar6k.c:140: error: 'AR6K_DEVICE' has no member named 'BlockSize'
  136. drivers/staging/ath6kl/htc2/AR6000/ar6k.c:140: error: 'AR6K_DEVICE' has no member named 'BlockSize'
  137. drivers/staging/ath6kl/htc2/AR6000/ar6k.c:143: error: 'AR6K_DEVICE' has no member named 'BlockMask'
  138. drivers/staging/ath6kl/htc2/AR6000/ar6k.c:143: error: 'AR6K_DEVICE' has no member named 'BlockSize'
  139. drivers/staging/ath6kl/htc2/AR6000/ar6k.c:145: error: implicit declaration of function 'AR_DEBUG_PRINTF'
  140. drivers/staging/ath6kl/htc2/AR6000/ar6k.c:146: error: 'AR6K_DEVICE' has no member named 'BlockSize'
  141. drivers/staging/ath6kl/htc2/AR6000/ar6k.c:146: error: left-hand operand of comma expression has no effect
  142. drivers/staging/ath6kl/htc2/AR6000/ar6k.c:146: error: 'AR6K_DEVICE' has no member named 'MailBoxInfo'
  143. drivers/staging/ath6kl/htc2/AR6000/ar6k.c:146: error: left-hand operand of comma expression has no effect
  144. drivers/staging/ath6kl/htc2/AR6000/ar6k.c:148: error: 'AR6K_DEVICE' has no member named 'GetPendingEventsFunc'
  145. drivers/staging/ath6kl/htc2/AR6000/ar6k.c:148: error: 'NULL' undeclared (first use in this function)
  146. drivers/staging/ath6kl/htc2/AR6000/ar6k.c:150: error: 'AR6K_DEVICE' has no member named 'HIFDevice'
  147. drivers/staging/ath6kl/htc2/AR6000/ar6k.c:152: error: 'AR6K_DEVICE' has no member named 'GetPendingEventsFunc'
  148. drivers/staging/ath6kl/htc2/AR6000/ar6k.c:153: error: 'AR6K_DEVICE' has no member named 'GetPendingEventsFunc'
  149. drivers/staging/ath6kl/htc2/AR6000/ar6k.c:153: error: too many arguments to function 'HIFConfigureDevice'
  150. drivers/staging/ath6kl/htc2/AR6000/ar6k.c:156: error: 'AR6K_DEVICE' has no member named 'HifIRQProcessingMode'
  151. drivers/staging/ath6kl/htc2/AR6000/ar6k.c:159: error: 'AR6K_DEVICE' has no member named 'HIFDevice'
  152. drivers/staging/ath6kl/htc2/AR6000/ar6k.c:161: error: 'AR6K_DEVICE' has no member named 'HifIRQProcessingMode'
  153. drivers/staging/ath6kl/htc2/AR6000/ar6k.c:162: error: 'AR6K_DEVICE' has no member named 'HifIRQProcessingMode'
  154. drivers/staging/ath6kl/htc2/AR6000/ar6k.c:162: error: too many arguments to function 'HIFConfigureDevice'
  155. drivers/staging/ath6kl/htc2/AR6000/ar6k.c:164: error: 'AR6K_DEVICE' has no member named 'HifIRQProcessingMode'
  156. drivers/staging/ath6kl/htc2/AR6000/ar6k.c:168: error: 'AR6K_DEVICE' has no member named 'HIFDevice'
  157. drivers/staging/ath6kl/htc2/AR6000/ar6k.c:170: error: 'AR6K_DEVICE' has no member named 'HifIRQYieldParams'
  158. drivers/staging/ath6kl/htc2/AR6000/ar6k.c:171: error: 'AR6K_DEVICE' has no member named 'HifIRQYieldParams'
  159. drivers/staging/ath6kl/htc2/AR6000/ar6k.c:171: error: too many arguments to function 'HIFConfigureDevice'
  160. drivers/staging/ath6kl/htc2/AR6000/ar6k.c:173: error: 'AR6K_DEVICE' has no member named 'HifIRQYieldParams'
  161. drivers/staging/ath6kl/htc2/AR6000/ar6k.c:176: error: 'AR6K_DEVICE' has no member named 'HifIRQYieldParams'
  162. drivers/staging/ath6kl/htc2/AR6000/ar6k.c:176: error: left-hand operand of comma expression has no effect
  163. drivers/staging/ath6kl/htc2/AR6000/ar6k.c:177: error: 'AR6K_DEVICE' has no member named 'DSRCanYield'
  164. drivers/staging/ath6kl/htc2/AR6000/ar6k.c:187: error: 'AR6K_DEVICE' has no member named 'HifMaskUmaskRecvEvent'
  165. drivers/staging/ath6kl/htc2/AR6000/ar6k.c:190: error: 'AR6K_DEVICE' has no member named 'HIFDevice'
  166. drivers/staging/ath6kl/htc2/AR6000/ar6k.c:192: error: 'AR6K_DEVICE' has no member named 'HifMaskUmaskRecvEvent'
  167. drivers/staging/ath6kl/htc2/AR6000/ar6k.c:193: error: 'AR6K_DEVICE' has no member named 'HifMaskUmaskRecvEvent'
  168. drivers/staging/ath6kl/htc2/AR6000/ar6k.c:193: error: too many arguments to function 'HIFConfigureDevice'
  169. drivers/staging/ath6kl/htc2/AR6000/ar6k.c:196: error: 'AR6K_DEVICE' has no member named 'GetPendingEventsFunc'
  170. drivers/staging/ath6kl/htc2/AR6000/ar6k.c:196: error: left-hand operand of comma expression has no effect
  171. drivers/staging/ath6kl/htc2/AR6000/ar6k.c:196: error: 'AR6K_DEVICE' has no member named 'HifMaskUmaskRecvEvent'
  172. drivers/staging/ath6kl/htc2/AR6000/ar6k.c:196: error: left-hand operand of comma expression has no effect
  173. drivers/staging/ath6kl/htc2/AR6000/ar6k.c:204: error: implicit declaration of function 'DevSetupGMbox'
  174. drivers/staging/ath6kl/htc2/AR6000/ar6k.c:209: error: 'AR6K_DEVICE' has no member named 'HifAttached'
  175. drivers/staging/ath6kl/htc2/AR6000/ar6k.c:210: error: 'AR6K_DEVICE' has no member named 'HIFDevice'
  176. drivers/staging/ath6kl/htc2/AR6000/ar6k.c:211: error: 'AR6K_DEVICE' has no member named 'HifAttached'
  177. drivers/staging/ath6kl/htc2/AR6000/ar6k.c: In function 'DevEnableInterrupts':
  178. drivers/staging/ath6kl/htc2/AR6000/ar6k.c:222: error: 'AR6K_IRQ_ENABLE_REGISTERS' undeclared (first use in this function)
  179. drivers/staging/ath6kl/htc2/AR6000/ar6k.c:222: error: expected ';' before 'regs'
  180. drivers/staging/ath6kl/htc2/AR6000/ar6k.c:224: error: 'AR6K_DEVICE' has no member named 'Lock'
  181. drivers/staging/ath6kl/htc2/AR6000/ar6k.c:227: error: 'AR6K_DEVICE' has no member named 'IrqEnableRegisters'
  182. drivers/staging/ath6kl/htc2/AR6000/ar6k.c:231: error: 'NULL' undeclared (first use in this function)
  183. drivers/staging/ath6kl/htc2/AR6000/ar6k.c:231: error: 'AR6K_DEVICE' has no member named 'GetPendingEventsFunc'
  184. drivers/staging/ath6kl/htc2/AR6000/ar6k.c:232: error: 'AR6K_DEVICE' has no member named 'IrqEnableRegisters'
  185. drivers/staging/ath6kl/htc2/AR6000/ar6k.c:240: error: 'AR6K_DEVICE' has no member named 'IrqEnableRegisters'
  186. drivers/staging/ath6kl/htc2/AR6000/ar6k.c:245: error: 'AR6K_DEVICE' has no member named 'IrqEnableRegisters'
  187. drivers/staging/ath6kl/htc2/AR6000/ar6k.c:248: error: 'AR6K_DEVICE' has no member named 'IrqEnableRegisters'
  188. drivers/staging/ath6kl/htc2/AR6000/ar6k.c:253: error: 'AR6K_DEVICE' has no member named 'IrqEnableRegisters'
  189. drivers/staging/ath6kl/htc2/AR6000/ar6k.c:257: error: implicit declaration of function 'A_MEMCPY'
  190. drivers/staging/ath6kl/htc2/AR6000/ar6k.c:257: error: 'regs' undeclared (first use in this function)
  191. drivers/staging/ath6kl/htc2/AR6000/ar6k.c:257: error: 'AR6K_DEVICE' has no member named 'IrqEnableRegisters'
  192. drivers/staging/ath6kl/htc2/AR6000/ar6k.c:259: error: 'AR6K_DEVICE' has no member named 'Lock'
  193. drivers/staging/ath6kl/htc2/AR6000/ar6k.c:262: error: 'AR6K_DEVICE' has no member named 'HIFDevice'
  194. drivers/staging/ath6kl/htc2/AR6000/ar6k.c:267: error: passing argument 2 of 'HIFReadWrite' makes pointer from integer without a cast
  195. drivers/staging/ath6kl/include/hif.h:402: note: expected 'void *' but argument is of type 'int'
  196. drivers/staging/ath6kl/htc2/AR6000/ar6k.c:267: error: too many arguments to function 'HIFReadWrite'
  197. drivers/staging/ath6kl/htc2/AR6000/ar6k.c:272: error: left-hand operand of comma expression has no effect
  198. drivers/staging/ath6kl/htc2/AR6000/ar6k.c: In function 'DevDisableInterrupts':
  199. drivers/staging/ath6kl/htc2/AR6000/ar6k.c:281: error: 'AR6K_IRQ_ENABLE_REGISTERS' undeclared (first use in this function)
  200. drivers/staging/ath6kl/htc2/AR6000/ar6k.c:281: error: expected ';' before 'regs'
  201. drivers/staging/ath6kl/htc2/AR6000/ar6k.c:283: error: 'AR6K_DEVICE' has no member named 'Lock'
  202. drivers/staging/ath6kl/htc2/AR6000/ar6k.c:285: error: 'AR6K_DEVICE' has no member named 'IrqEnableRegisters'
  203. drivers/staging/ath6kl/htc2/AR6000/ar6k.c:286: error: 'AR6K_DEVICE' has no member named 'IrqEnableRegisters'
  204. drivers/staging/ath6kl/htc2/AR6000/ar6k.c:287: error: 'AR6K_DEVICE' has no member named 'IrqEnableRegisters'
  205. drivers/staging/ath6kl/htc2/AR6000/ar6k.c:288: error: 'AR6K_DEVICE' has no member named 'IrqEnableRegisters'
  206. drivers/staging/ath6kl/htc2/AR6000/ar6k.c:290: error: 'regs' undeclared (first use in this function)
  207. drivers/staging/ath6kl/htc2/AR6000/ar6k.c:290: error: 'AR6K_DEVICE' has no member named 'IrqEnableRegisters'
  208. drivers/staging/ath6kl/htc2/AR6000/ar6k.c:292: error: 'AR6K_DEVICE' has no member named 'Lock'
  209. drivers/staging/ath6kl/htc2/AR6000/ar6k.c:295: error: 'AR6K_DEVICE' has no member named 'HIFDevice'
  210. drivers/staging/ath6kl/htc2/AR6000/ar6k.c:300: error: 'NULL' undeclared (first use in this function)
  211. drivers/staging/ath6kl/htc2/AR6000/ar6k.c:300: error: passing argument 2 of 'HIFReadWrite' makes pointer from integer without a cast
  212. drivers/staging/ath6kl/include/hif.h:402: note: expected 'void *' but argument is of type 'int'
  213. drivers/staging/ath6kl/htc2/AR6000/ar6k.c:300: error: too many arguments to function 'HIFReadWrite'
  214. drivers/staging/ath6kl/htc2/AR6000/ar6k.c: In function 'DevUnmaskInterrupts':
  215. drivers/staging/ath6kl/htc2/AR6000/ar6k.c:322: error: 'AR6K_DEVICE' has no member named 'HIFDevice'
  216. drivers/staging/ath6kl/htc2/AR6000/ar6k.c: In function 'DevMaskInterrupts':
  217. drivers/staging/ath6kl/htc2/AR6000/ar6k.c:334: error: 'AR6K_DEVICE' has no member named 'HIFDevice'
  218. drivers/staging/ath6kl/htc2/AR6000/ar6k.c: In function 'DevDoEnableDisableRecvAsyncHandler':
  219. drivers/staging/ath6kl/htc2/AR6000/ar6k.c:344: error: left-hand operand of comma expression has no effect
  220. drivers/staging/ath6kl/htc2/AR6000/ar6k.c:346: error: 'HTC_PACKET' has no member named 'Status'
  221. drivers/staging/ath6kl/htc2/AR6000/ar6k.c:348: error: 'HTC_PACKET' has no member named 'Status'
  222. drivers/staging/ath6kl/htc2/AR6000/ar6k.c:348: error: left-hand operand of comma expression has no effect
  223. drivers/staging/ath6kl/htc2/AR6000/ar6k.c: At top level:
  224. drivers/staging/ath6kl/htc2/AR6000/ar6k.c:358: error: expected declaration specifiers or '...' before 'A_BOOL'
  225. drivers/staging/ath6kl/htc2/AR6000/ar6k.c:358: error: expected declaration specifiers or '...' before 'A_BOOL'
  226. drivers/staging/ath6kl/htc2/AR6000/ar6k.c: In function 'DevDoEnableDisableRecvOverride':
  227. drivers/staging/ath6kl/htc2/AR6000/ar6k.c:361: error: 'NULL' undeclared (first use in this function)
  228. drivers/staging/ath6kl/htc2/AR6000/ar6k.c:364: error: 'EnableRecv' undeclared (first use in this function)
  229. drivers/staging/ath6kl/htc2/AR6000/ar6k.c:364: error: left-hand operand of comma expression has no effect
  230. drivers/staging/ath6kl/htc2/AR6000/ar6k.c:364: error: 'AsyncMode' undeclared (first use in this function)
  231. drivers/staging/ath6kl/htc2/AR6000/ar6k.c:364: error: left-hand operand of comma expression has no effect
  232. drivers/staging/ath6kl/htc2/AR6000/ar6k.c:379: error: 'HTC_PACKET' has no member named 'Completion'
  233. drivers/staging/ath6kl/htc2/AR6000/ar6k.c:380: error: 'HTC_PACKET' has no member named 'pContext'
  234. drivers/staging/ath6kl/htc2/AR6000/ar6k.c:383: error: 'AR6K_DEVICE' has no member named 'HifMaskUmaskRecvEvent'
  235. drivers/staging/ath6kl/htc2/AR6000/ar6k.c:383: error: 'AR6K_DEVICE' has no member named 'HIFDevice'
  236. drivers/staging/ath6kl/htc2/AR6000/ar6k.c:390: error: 'AR6K_DEVICE' has no member named 'HifMaskUmaskRecvEvent'
  237. drivers/staging/ath6kl/htc2/AR6000/ar6k.c:390: error: 'AR6K_DEVICE' has no member named 'HIFDevice'
  238. drivers/staging/ath6kl/htc2/AR6000/ar6k.c: At top level:
  239. drivers/staging/ath6kl/htc2/AR6000/ar6k.c:406: error: expected declaration specifiers or '...' before 'A_BOOL'
  240. drivers/staging/ath6kl/htc2/AR6000/ar6k.c:406: error: expected declaration specifiers or '...' before 'A_BOOL'
  241. drivers/staging/ath6kl/htc2/AR6000/ar6k.c: In function 'DevDoEnableDisableRecvNormal':
  242. drivers/staging/ath6kl/htc2/AR6000/ar6k.c:409: error: 'NULL' undeclared (first use in this function)
  243. drivers/staging/ath6kl/htc2/AR6000/ar6k.c:410: error: 'AR6K_IRQ_ENABLE_REGISTERS' undeclared (first use in this function)
  244. drivers/staging/ath6kl/htc2/AR6000/ar6k.c:410: error: expected ';' before 'regs'
  245. drivers/staging/ath6kl/htc2/AR6000/ar6k.c:413: error: 'AR6K_DEVICE' has no member named 'Lock'
  246. drivers/staging/ath6kl/htc2/AR6000/ar6k.c:415: error: 'EnableRecv' undeclared (first use in this function)
  247. drivers/staging/ath6kl/htc2/AR6000/ar6k.c:416: error: 'AR6K_DEVICE' has no member named 'IrqEnableRegisters'
  248. drivers/staging/ath6kl/htc2/AR6000/ar6k.c:418: error: 'AR6K_DEVICE' has no member named 'IrqEnableRegisters'
  249. drivers/staging/ath6kl/htc2/AR6000/ar6k.c:422: error: 'regs' undeclared (first use in this function)
  250. drivers/staging/ath6kl/htc2/AR6000/ar6k.c:422: error: 'AR6K_DEVICE' has no member named 'IrqEnableRegisters'
  251. drivers/staging/ath6kl/htc2/AR6000/ar6k.c:423: error: 'AR6K_DEVICE' has no member named 'Lock'
  252. drivers/staging/ath6kl/htc2/AR6000/ar6k.c:427: error: 'AsyncMode' undeclared (first use in this function)
  253. drivers/staging/ath6kl/htc2/AR6000/ar6k.c:438: error: 'HTC_PACKET' has no member named 'pBuffer'
  254. drivers/staging/ath6kl/htc2/AR6000/ar6k.c:441: error: 'HTC_PACKET' has no member named 'Completion'
  255. drivers/staging/ath6kl/htc2/AR6000/ar6k.c:442: error: 'HTC_PACKET' has no member named 'pContext'
  256. drivers/staging/ath6kl/htc2/AR6000/ar6k.c:445: error: 'AR6K_DEVICE' has no member named 'HIFDevice'
  257. drivers/staging/ath6kl/htc2/AR6000/ar6k.c:447: error: 'HTC_PACKET' has no member named 'pBuffer'
  258. drivers/staging/ath6kl/htc2/AR6000/ar6k.c:450: error: passing argument 2 of 'HIFReadWrite' makes pointer from integer without a cast
  259. drivers/staging/ath6kl/include/hif.h:402: note: expected 'void *' but argument is of type 'int'
  260. drivers/staging/ath6kl/htc2/AR6000/ar6k.c:450: error: too many arguments to function 'HIFReadWrite'
  261. drivers/staging/ath6kl/htc2/AR6000/ar6k.c:456: error: 'AR6K_DEVICE' has no member named 'HIFDevice'
  262. drivers/staging/ath6kl/htc2/AR6000/ar6k.c:461: error: passing argument 2 of 'HIFReadWrite' makes pointer from integer without a cast
  263. drivers/staging/ath6kl/include/hif.h:402: note: expected 'void *' but argument is of type 'int'
  264. drivers/staging/ath6kl/htc2/AR6000/ar6k.c:461: error: too many arguments to function 'HIFReadWrite'
  265. drivers/staging/ath6kl/htc2/AR6000/ar6k.c: At top level:
  266. drivers/staging/ath6kl/htc2/AR6000/ar6k.c:473: error: expected declaration specifiers or '...' before 'A_BOOL'
  267. drivers/staging/ath6kl/htc2/AR6000/ar6k.c: In function 'DevStopRecv':
  268. drivers/staging/ath6kl/htc2/AR6000/ar6k.c:475: error: 'NULL' undeclared (first use in this function)
  269. drivers/staging/ath6kl/htc2/AR6000/ar6k.c:475: error: 'AR6K_DEVICE' has no member named 'HifMaskUmaskRecvEvent'
  270. drivers/staging/ath6kl/htc2/AR6000/ar6k.c:476: error: 'AsyncMode' undeclared (first use in this function)
  271. drivers/staging/ath6kl/htc2/AR6000/ar6k.c:476: error: too many arguments to function 'DevDoEnableDisableRecvNormal'
  272. drivers/staging/ath6kl/htc2/AR6000/ar6k.c:478: error: too many arguments to function 'DevDoEnableDisableRecvOverride'
  273. drivers/staging/ath6kl/htc2/AR6000/ar6k.c: At top level:
  274. drivers/staging/ath6kl/htc2/AR6000/ar6k.c:482: error: expected declaration specifiers or '...' before 'A_BOOL'
  275. drivers/staging/ath6kl/htc2/AR6000/ar6k.c: In function 'DevEnableRecv':
  276. drivers/staging/ath6kl/htc2/AR6000/ar6k.c:484: error: 'NULL' undeclared (first use in this function)
  277. drivers/staging/ath6kl/htc2/AR6000/ar6k.c:484: error: 'AR6K_DEVICE' has no member named 'HifMaskUmaskRecvEvent'
  278. drivers/staging/ath6kl/htc2/AR6000/ar6k.c:485: error: 'AsyncMode' undeclared (first use in this function)
  279. drivers/staging/ath6kl/htc2/AR6000/ar6k.c:485: error: too many arguments to function 'DevDoEnableDisableRecvNormal'
  280. drivers/staging/ath6kl/htc2/AR6000/ar6k.c:487: error: too many arguments to function 'DevDoEnableDisableRecvOverride'
  281. drivers/staging/ath6kl/htc2/AR6000/ar6k.c: At top level:
  282. drivers/staging/ath6kl/htc2/AR6000/ar6k.c:491: error: expected declaration specifiers or '...' before 'A_UINT32'
  283. drivers/staging/ath6kl/htc2/AR6000/ar6k.c:491: error: expected declaration specifiers or '...' before 'A_BOOL'
  284. drivers/staging/ath6kl/htc2/AR6000/ar6k.c: In function 'DevWaitForPendingRecv':
  285. drivers/staging/ath6kl/htc2/AR6000/ar6k.c:494: error: 'A_UCHAR' undeclared (first use in this function)
  286. drivers/staging/ath6kl/htc2/AR6000/ar6k.c:494: error: expected ';' before 'host_int_status'
  287. drivers/staging/ath6kl/htc2/AR6000/ar6k.c:495: error: 'A_UINT32' undeclared (first use in this function)
  288. drivers/staging/ath6kl/htc2/AR6000/ar6k.c:495: error: expected ';' before 'counter'
  289. drivers/staging/ath6kl/htc2/AR6000/ar6k.c:497: error: 'TimeoutInMs' undeclared (first use in this function)
  290. drivers/staging/ath6kl/htc2/AR6000/ar6k.c:502: error: 'counter' undeclared (first use in this function)
  291. drivers/staging/ath6kl/htc2/AR6000/ar6k.c:507: error: 'AR6K_DEVICE' has no member named 'HIFDevice'
  292. drivers/staging/ath6kl/htc2/AR6000/ar6k.c:509: error: 'host_int_status' undeclared (first use in this function)
  293. drivers/staging/ath6kl/htc2/AR6000/ar6k.c:512: error: 'NULL' undeclared (first use in this function)
  294. drivers/staging/ath6kl/htc2/AR6000/ar6k.c:512: error: passing argument 2 of 'HIFReadWrite' makes pointer from integer without a cast
  295. drivers/staging/ath6kl/include/hif.h:402: note: expected 'void *' but argument is of type 'int'
  296. drivers/staging/ath6kl/htc2/AR6000/ar6k.c:512: error: too many arguments to function 'HIFReadWrite'
  297. drivers/staging/ath6kl/htc2/AR6000/ar6k.c:515: error: left-hand operand of comma expression has no effect
  298. drivers/staging/ath6kl/htc2/AR6000/ar6k.c:523: error: 'pbIsRecvPending' undeclared (first use in this function)
  299. drivers/staging/ath6kl/htc2/AR6000/ar6k.c:531: error: implicit declaration of function 'A_MDELAY'
  300. drivers/staging/ath6kl/htc2/AR6000/ar6k.c: At top level:
  301. drivers/staging/ath6kl/htc2/AR6000/ar6k.c:540: error: expected declaration specifiers or '...' before 'AR6K_IRQ_PROC_REGISTERS'
  302. drivers/staging/ath6kl/htc2/AR6000/ar6k.c:541: error: expected declaration specifiers or '...' before 'AR6K_IRQ_ENABLE_REGISTERS'
  303. drivers/staging/ath6kl/htc2/AR6000/ar6k.c: In function 'DevDumpRegisters':
  304. drivers/staging/ath6kl/htc2/AR6000/ar6k.c:546: error: 'pIrqProcRegs' undeclared (first use in this function)
  305. drivers/staging/ath6kl/htc2/AR6000/ar6k.c:546: error: 'NULL' undeclared (first use in this function)
  306. drivers/staging/ath6kl/htc2/AR6000/ar6k.c:548: error: left-hand operand of comma expression has no effect
  307. drivers/staging/ath6kl/htc2/AR6000/ar6k.c:550: error: left-hand operand of comma expression has no effect
  308. drivers/staging/ath6kl/htc2/AR6000/ar6k.c:552: error: left-hand operand of comma expression has no effect
  309. drivers/staging/ath6kl/htc2/AR6000/ar6k.c:554: error: left-hand operand of comma expression has no effect
  310. drivers/staging/ath6kl/htc2/AR6000/ar6k.c:556: error: left-hand operand of comma expression has no effect
  311. drivers/staging/ath6kl/htc2/AR6000/ar6k.c:558: error: left-hand operand of comma expression has no effect
  312. drivers/staging/ath6kl/htc2/AR6000/ar6k.c:560: error: left-hand operand of comma expression has no effect
  313. drivers/staging/ath6kl/htc2/AR6000/ar6k.c:562: error: left-hand operand of comma expression has no effect
  314. drivers/staging/ath6kl/htc2/AR6000/ar6k.c:564: error: 'AR6K_DEVICE' has no member named 'MailBoxInfo'
  315. drivers/staging/ath6kl/htc2/AR6000/ar6k.c:567: error: left-hand operand of comma expression has no effect
  316. drivers/staging/ath6kl/htc2/AR6000/ar6k.c:569: error: left-hand operand of comma expression has no effect
  317. drivers/staging/ath6kl/htc2/AR6000/ar6k.c:571: error: left-hand operand of comma expression has no effect
  318. drivers/staging/ath6kl/htc2/AR6000/ar6k.c:573: error: left-hand operand of comma expression has no effect
  319. drivers/staging/ath6kl/htc2/AR6000/ar6k.c:578: error: 'pIrqEnableRegs' undeclared (first use in this function)
  320. drivers/staging/ath6kl/htc2/AR6000/ar6k.c:580: error: left-hand operand of comma expression has no effect
  321. drivers/staging/ath6kl/htc2/AR6000/ar6k.c:582: error: left-hand operand of comma expression has no effect
  322. drivers/staging/ath6kl/htc2/AR6000/ar6k.c: In function 'DevAllocScatterReq':
  323. drivers/staging/ath6kl/htc2/AR6000/ar6k.c:594: error: 'AR6K_DEVICE' has no member named 'Lock'
  324. drivers/staging/ath6kl/htc2/AR6000/ar6k.c:595: error: implicit declaration of function 'DL_ListRemoveItemFromHead'
  325. drivers/staging/ath6kl/htc2/AR6000/ar6k.c:595: error: 'AR6K_DEVICE' has no member named 'ScatterReqHead'
  326. drivers/staging/ath6kl/htc2/AR6000/ar6k.c:596: error: 'AR6K_DEVICE' has no member named 'Lock'
  327. drivers/staging/ath6kl/htc2/AR6000/ar6k.c:597: error: 'NULL' undeclared (first use in this function)
  328. drivers/staging/ath6kl/htc2/AR6000/ar6k.c: In function 'DevFreeScatterReq':
  329. drivers/staging/ath6kl/htc2/AR6000/ar6k.c:606: error: 'AR6K_DEVICE' has no member named 'Lock'
  330. drivers/staging/ath6kl/htc2/AR6000/ar6k.c:607: error: 'AR6K_DEVICE' has no member named 'ScatterReqHead'
  331. drivers/staging/ath6kl/htc2/AR6000/ar6k.c:608: error: 'AR6K_DEVICE' has no member named 'Lock'
  332. drivers/staging/ath6kl/htc2/AR6000/ar6k.c: At top level:
  333. drivers/staging/ath6kl/htc2/AR6000/ar6k.c:611: error: expected declaration specifiers or '...' before 'A_BOOL'
  334. drivers/staging/ath6kl/htc2/AR6000/ar6k.c: In function 'DevCopyScatterListToFromDMABuffer':
  335. drivers/staging/ath6kl/htc2/AR6000/ar6k.c:613: error: 'A_UINT8' undeclared (first use in this function)
  336. drivers/staging/ath6kl/htc2/AR6000/ar6k.c:613: error: 'pDMABuffer' undeclared (first use in this function)
  337. drivers/staging/ath6kl/htc2/AR6000/ar6k.c:613: error: 'NULL' undeclared (first use in this function)
  338. drivers/staging/ath6kl/htc2/AR6000/ar6k.c:614: error: ISO C90 forbids mixed declarations and code
  339. drivers/staging/ath6kl/htc2/AR6000/ar6k.c:615: error: 'A_UINT32' undeclared (first use in this function)
  340. drivers/staging/ath6kl/htc2/AR6000/ar6k.c:615: error: expected ';' before 'length'
  341. drivers/staging/ath6kl/htc2/AR6000/ar6k.c:617: error: 'HIF_SCATTER_REQ' has no member named 'pScatterBounceBuffer'
  342. drivers/staging/ath6kl/htc2/AR6000/ar6k.c:624: error: 'HIF_SCATTER_REQ' has no member named 'TotalLength'
  343. drivers/staging/ath6kl/htc2/AR6000/ar6k.c:626: error: 'HIF_SCATTER_REQ' has no member named 'ValidScatterEntries'
  344. drivers/staging/ath6kl/htc2/AR6000/ar6k.c:628: error: 'length' undeclared (first use in this function)
  345. drivers/staging/ath6kl/htc2/AR6000/ar6k.c:628: error: implicit declaration of function 'min'
  346. drivers/staging/ath6kl/htc2/AR6000/ar6k.c:628: error: 'HIF_SCATTER_REQ' has no member named 'ScatterList'
  347. drivers/staging/ath6kl/htc2/AR6000/ar6k.c:630: error: 'HIF_SCATTER_REQ' has no member named 'ScatterList'
  348. drivers/staging/ath6kl/htc2/AR6000/ar6k.c:636: error: 'FromDMA' undeclared (first use in this function)
  349. drivers/staging/ath6kl/htc2/AR6000/ar6k.c:638: error: 'HIF_SCATTER_REQ' has no member named 'ScatterList'
  350. drivers/staging/ath6kl/htc2/AR6000/ar6k.c:641: error: 'HIF_SCATTER_REQ' has no member named 'ScatterList'
  351. drivers/staging/ath6kl/htc2/AR6000/ar6k.c: In function 'DevReadWriteScatterAsyncHandler':
  352. drivers/staging/ath6kl/htc2/AR6000/ar6k.c:656: error: left-hand operand of comma expression has no effect
  353. drivers/staging/ath6kl/htc2/AR6000/ar6k.c:658: error: 'HIF_SCATTER_REQ' has no member named 'CompletionStatus'
  354. drivers/staging/ath6kl/htc2/AR6000/ar6k.c:658: error: 'HTC_PACKET' has no member named 'Status'
  355. drivers/staging/ath6kl/htc2/AR6000/ar6k.c:662: error: 'HIF_SCATTER_REQ' has no member named 'CompletionRoutine'
  356. drivers/staging/ath6kl/htc2/AR6000/ar6k.c: In function 'DevReadWriteScatter':
  357. drivers/staging/ath6kl/htc2/AR6000/ar6k.c:671: error: 'NULL' undeclared (first use in this function)
  358. drivers/staging/ath6kl/htc2/AR6000/ar6k.c:672: error: 'A_UINT32' undeclared (first use in this function)
  359. drivers/staging/ath6kl/htc2/AR6000/ar6k.c:672: error: expected ';' before 'request'
  360. drivers/staging/ath6kl/htc2/AR6000/ar6k.c:676: error: 'HIF_SCATTER_REQ' has no member named 'TotalLength'
  361. drivers/staging/ath6kl/htc2/AR6000/ar6k.c:678: error: 'HIF_SCATTER_REQ' has no member named 'TotalLength'
  362. drivers/staging/ath6kl/htc2/AR6000/ar6k.c:678: error: left-hand operand of comma expression has no effect
  363. drivers/staging/ath6kl/htc2/AR6000/ar6k.c:682: error: 'HIF_SCATTER_REQ' has no member named 'TotalLength'
  364. drivers/staging/ath6kl/htc2/AR6000/ar6k.c:687: error: 'request' undeclared (first use in this function)
  365. drivers/staging/ath6kl/htc2/AR6000/ar6k.c:698: error: 'HTC_PACKET' has no member named 'Completion'
  366. drivers/staging/ath6kl/htc2/AR6000/ar6k.c:699: error: 'HTC_PACKET' has no member named 'pContext'
  367. drivers/staging/ath6kl/htc2/AR6000/ar6k.c:709: error: 'HIF_SCATTER_REQ' has no member named 'Address'
  368. drivers/staging/ath6kl/htc2/AR6000/ar6k.c:709: error: 'AR6K_DEVICE' has no member named 'MailBoxInfo'
  369. drivers/staging/ath6kl/htc2/AR6000/ar6k.c:710: error: 'HIF_SCATTER_REQ' has no member named 'Address'
  370. drivers/staging/ath6kl/htc2/AR6000/ar6k.c:710: error: 'AR6K_DEVICE' has no member named 'MailBoxInfo'
  371. drivers/staging/ath6kl/htc2/AR6000/ar6k.c:710: error: 'HIF_SCATTER_REQ' has no member named 'TotalLength'
  372. drivers/staging/ath6kl/htc2/AR6000/ar6k.c:715: error: 'AR6K_DEVICE' has no member named 'HIFDevice'
  373. drivers/staging/ath6kl/htc2/AR6000/ar6k.c:716: error: 'HIF_SCATTER_REQ' has no member named 'Address'
  374. drivers/staging/ath6kl/htc2/AR6000/ar6k.c:717: error: 'HIF_SCATTER_REQ' has no member named 'HIFPrivate'
  375. drivers/staging/ath6kl/htc2/AR6000/ar6k.c:718: error: 'HIF_SCATTER_REQ' has no member named 'TotalLength'
  376. drivers/staging/ath6kl/htc2/AR6000/ar6k.c:720: error: too many arguments to function 'HIFReadWrite'
  377. drivers/staging/ath6kl/htc2/AR6000/ar6k.c:728: error: 'HIF_SCATTER_REQ' has no member named 'CompletionStatus'
  378. drivers/staging/ath6kl/htc2/AR6000/ar6k.c:729: error: 'HIF_SCATTER_REQ' has no member named 'CompletionRoutine'
  379. drivers/staging/ath6kl/htc2/AR6000/ar6k.c: In function 'DevCleanupVirtualScatterSupport':
  380. drivers/staging/ath6kl/htc2/AR6000/ar6k.c:743: error: 'NULL' undeclared (first use in this function)
  381. drivers/staging/ath6kl/htc2/AR6000/ar6k.c:746: error: implicit declaration of function 'A_FREE'
  382. drivers/staging/ath6kl/htc2/AR6000/ar6k.c: In function 'DevSetupVirtualScatterSupport':
  383. drivers/staging/ath6kl/htc2/AR6000/ar6k.c:761: error: implicit declaration of function 'A_GET_CACHE_LINE_BYTES'
  384. drivers/staging/ath6kl/htc2/AR6000/ar6k.c:768: error: implicit declaration of function 'A_MALLOC'
  385. drivers/staging/ath6kl/htc2/AR6000/ar6k.c:770: error: 'NULL' undeclared (first use in this function)
  386. drivers/staging/ath6kl/htc2/AR6000/ar6k.c:778: error: 'A_UINT8' undeclared (first use in this function)
  387. drivers/staging/ath6kl/htc2/AR6000/ar6k.c:778: error: expected expression before ')' token
  388. drivers/staging/ath6kl/htc2/AR6000/ar6k.c:781: error: 'DEV_SCATTER_DMA_VIRTUAL_INFO' has no member named 'pVirtDmaBuffer'
  389. drivers/staging/ath6kl/htc2/AR6000/ar6k.c:781: error: 'DEV_SCATTER_DMA_VIRTUAL_INFO' has no member named 'DataArea'
  390. drivers/staging/ath6kl/htc2/AR6000/ar6k.c:783: error: 'DEV_SCATTER_DMA_VIRTUAL_INFO' has no member named 'pVirtDmaBuffer'
  391. drivers/staging/ath6kl/htc2/AR6000/ar6k.c:783: error: implicit declaration of function 'A_ALIGN_TO_CACHE_LINE'
  392. drivers/staging/ath6kl/htc2/AR6000/ar6k.c:783: error: 'DEV_SCATTER_DMA_VIRTUAL_INFO' has no member named 'pVirtDmaBuffer'
  393. drivers/staging/ath6kl/htc2/AR6000/ar6k.c:785: error: 'HIF_SCATTER_REQ' has no member named 'HIFPrivate'
  394. drivers/staging/ath6kl/htc2/AR6000/ar6k.c:787: error: 'HIF_SCATTER_REQ' has no member named 'ScatterMethod'
  395. drivers/staging/ath6kl/htc2/AR6000/ar6k.c:788: error: 'HIF_SCATTER_REQ' has no member named 'pScatterBounceBuffer'
  396. drivers/staging/ath6kl/htc2/AR6000/ar6k.c:788: error: 'DEV_SCATTER_DMA_VIRTUAL_INFO' has no member named 'pVirtDmaBuffer'
  397. drivers/staging/ath6kl/htc2/AR6000/ar6k.c:796: error: 'AR6K_DEVICE' has no member named 'HifScatterInfo'
  398. drivers/staging/ath6kl/htc2/AR6000/ar6k.c:797: error: 'AR6K_DEVICE' has no member named 'HifScatterInfo'
  399. drivers/staging/ath6kl/htc2/AR6000/ar6k.c:798: error: 'AR6K_DEVICE' has no member named 'HifScatterInfo'
  400. drivers/staging/ath6kl/htc2/AR6000/ar6k.c:799: error: 'AR6K_DEVICE' has no member named 'MailBoxInfo'
  401. drivers/staging/ath6kl/htc2/AR6000/ar6k.c:801: error: 'AR6K_DEVICE' has no member named 'HifScatterInfo'
  402. drivers/staging/ath6kl/htc2/AR6000/ar6k.c:802: error: 'AR6K_DEVICE' has no member named 'HifScatterInfo'
  403. drivers/staging/ath6kl/htc2/AR6000/ar6k.c:804: error: 'AR6K_DEVICE' has no member named 'HifScatterInfo'
  404. drivers/staging/ath6kl/htc2/AR6000/ar6k.c:805: error: 'AR6K_DEVICE' has no member named 'HifScatterInfo'
  405. drivers/staging/ath6kl/htc2/AR6000/ar6k.c:807: error: 'AR6K_DEVICE' has no member named 'ScatterIsVirtual'
  406. drivers/staging/ath6kl/htc2/AR6000/ar6k.c: In function 'DevSetupMsgBundling':
  407. drivers/staging/ath6kl/htc2/AR6000/ar6k.c:818: error: 'AR6K_DEVICE' has no member named 'MailBoxInfo'
  408. drivers/staging/ath6kl/htc2/AR6000/ar6k.c:823: error: 'AR6K_DEVICE' has no member named 'HIFDevice'
  409. drivers/staging/ath6kl/htc2/AR6000/ar6k.c:825: error: 'AR6K_DEVICE' has no member named 'HifScatterInfo'
  410. drivers/staging/ath6kl/htc2/AR6000/ar6k.c:826: error: 'AR6K_DEVICE' has no member named 'HifScatterInfo'
  411. drivers/staging/ath6kl/htc2/AR6000/ar6k.c:826: error: too many arguments to function 'HIFConfigureDevice'
  412. drivers/staging/ath6kl/htc2/AR6000/ar6k.c:830: error: left-hand operand of comma expression has no effect
  413. drivers/staging/ath6kl/htc2/AR6000/ar6k.c:838: error: 'AR6K_DEVICE' has no member named 'HifScatterInfo'
  414. drivers/staging/ath6kl/htc2/AR6000/ar6k.c:838: error: left-hand operand of comma expression has no effect
  415. drivers/staging/ath6kl/htc2/AR6000/ar6k.c:838: error: 'AR6K_DEVICE' has no member named 'HifScatterInfo'
  416. drivers/staging/ath6kl/htc2/AR6000/ar6k.c:838: error: left-hand operand of comma expression has no effect
  417. drivers/staging/ath6kl/htc2/AR6000/ar6k.c:844: error: 'AR6K_DEVICE' has no member named 'HifScatterInfo'
  418. drivers/staging/ath6kl/htc2/AR6000/ar6k.c:844: error: left-hand operand of comma expression has no effect
  419. drivers/staging/ath6kl/htc2/AR6000/ar6k.c:844: error: 'AR6K_DEVICE' has no member named 'HifScatterInfo'
  420. drivers/staging/ath6kl/htc2/AR6000/ar6k.c:844: error: left-hand operand of comma expression has no effect
  421. drivers/staging/ath6kl/htc2/AR6000/ar6k.c:850: error: 'AR6K_DEVICE' has no member named 'MaxRecvBundleSize'
  422. drivers/staging/ath6kl/htc2/AR6000/ar6k.c:850: error: 'AR6K_DEVICE' has no member named 'HifScatterInfo'
  423. drivers/staging/ath6kl/htc2/AR6000/ar6k.c:852: error: 'AR6K_DEVICE' has no member named 'MailBoxInfo'
  424. drivers/staging/ath6kl/htc2/AR6000/ar6k.c:854: error: 'AR6K_DEVICE' has no member named 'MaxSendBundleSize'
  425. drivers/staging/ath6kl/htc2/AR6000/ar6k.c:858: error: 'AR6K_DEVICE' has no member named 'MailBoxInfo'
  426. drivers/staging/ath6kl/htc2/AR6000/ar6k.c:859: error: 'AR6K_DEVICE' has no member named 'MaxSendBundleSize'
  427. drivers/staging/ath6kl/htc2/AR6000/ar6k.c:859: error: 'AR6K_DEVICE' has no member named 'MailBoxInfo'
  428. drivers/staging/ath6kl/htc2/AR6000/ar6k.c:862: error: 'AR6K_DEVICE' has no member named 'MaxSendBundleSize'
  429. drivers/staging/ath6kl/htc2/AR6000/ar6k.c:865: error: 'AR6K_DEVICE' has no member named 'MaxSendBundleSize'
  430. drivers/staging/ath6kl/htc2/AR6000/ar6k.c:865: error: 'AR6K_DEVICE' has no member named 'HifScatterInfo'
  431. drivers/staging/ath6kl/htc2/AR6000/ar6k.c:867: error: 'AR6K_DEVICE' has no member named 'MaxSendBundleSize'
  432. drivers/staging/ath6kl/htc2/AR6000/ar6k.c:867: error: 'AR6K_DEVICE' has no member named 'HifScatterInfo'
  433. drivers/staging/ath6kl/htc2/AR6000/ar6k.c:873: error: 'AR6K_DEVICE' has no member named 'MaxRecvBundleSize'
  434. drivers/staging/ath6kl/htc2/AR6000/ar6k.c:873: error: left-hand operand of comma expression has no effect
  435. drivers/staging/ath6kl/htc2/AR6000/ar6k.c:873: error: 'AR6K_DEVICE' has no member named 'MaxSendBundleSize'
  436. drivers/staging/ath6kl/htc2/AR6000/ar6k.c:873: error: left-hand operand of comma expression has no effect
  437. drivers/staging/ath6kl/htc2/AR6000/ar6k.c: At top level:
  438. drivers/staging/ath6kl/htc2/AR6000/ar6k.c:879: error: expected declaration specifiers or '...' before 'A_BOOL'
  439. drivers/staging/ath6kl/htc2/AR6000/ar6k.c:879: error: expected declaration specifiers or '...' before 'A_BOOL'
  440. drivers/staging/ath6kl/htc2/AR6000/ar6k.c: In function 'DevSubmitScatterRequest':
  441. drivers/staging/ath6kl/htc2/AR6000/ar6k.c:883: error: 'Read' undeclared (first use in this function)
  442. drivers/staging/ath6kl/htc2/AR6000/ar6k.c:885: error: 'HIF_SCATTER_REQ' has no member named 'Request'
  443. drivers/staging/ath6kl/htc2/AR6000/ar6k.c:885: error: 'Async' undeclared (first use in this function)
  444. drivers/staging/ath6kl/htc2/AR6000/ar6k.c:886: error: 'HIF_SCATTER_REQ' has no member named 'Address'
  445. drivers/staging/ath6kl/htc2/AR6000/ar6k.c:886: error: 'AR6K_DEVICE' has no member named 'MailBoxInfo'
  446. drivers/staging/ath6kl/htc2/AR6000/ar6k.c:887: error: 'HIF_SCATTER_REQ' has no member named 'TotalLength'
  447. drivers/staging/ath6kl/htc2/AR6000/ar6k.c:887: error: 'A_UINT32' undeclared (first use in this function)
  448. drivers/staging/ath6kl/htc2/AR6000/ar6k.c:889: error: expected ';' before 'mailboxWidth'
  449. drivers/staging/ath6kl/htc2/AR6000/ar6k.c:892: error: 'HIF_SCATTER_REQ' has no member named 'Request'
  450. drivers/staging/ath6kl/htc2/AR6000/ar6k.c:893: error: 'HIF_SCATTER_REQ' has no member named 'TotalLength'
  451. drivers/staging/ath6kl/htc2/AR6000/ar6k.c:894: error: 'HIF_SCATTER_REQ' has no member named 'TotalLength'
  452. drivers/staging/ath6kl/htc2/AR6000/ar6k.c:896: error: 'HIF_SCATTER_REQ' has no member named 'Address'
  453. drivers/staging/ath6kl/htc2/AR6000/ar6k.c:896: error: 'AR6K_DEVICE' has no member named 'MailBoxInfo'
  454. drivers/staging/ath6kl/htc2/AR6000/ar6k.c:897: error: 'mailboxWidth' undeclared (first use in this function)
  455. drivers/staging/ath6kl/htc2/AR6000/ar6k.c:897: error: 'AR6K_DEVICE' has no member named 'MailBoxInfo'
  456. drivers/staging/ath6kl/htc2/AR6000/ar6k.c:899: error: 'HIF_SCATTER_REQ' has no member named 'Address'
  457. drivers/staging/ath6kl/htc2/AR6000/ar6k.c:899: error: 'AR6K_DEVICE' has no member named 'MailBoxInfo'
  458. drivers/staging/ath6kl/htc2/AR6000/ar6k.c:903: error: 'AR6K_DEVICE' has no member named 'ScatterIsVirtual'
  459. drivers/staging/ath6kl/htc2/AR6000/ar6k.c:907: error: 'HIF_SCATTER_REQ' has no member named 'Address'
  460. drivers/staging/ath6kl/htc2/AR6000/ar6k.c:907: error: 'HIF_SCATTER_REQ' has no member named 'TotalLength'
  461. drivers/staging/ath6kl/htc2/AR6000/ar6k.c:914: error: 'HIF_SCATTER_REQ' has no member named 'ValidScatterEntries'
  462. drivers/staging/ath6kl/htc2/AR6000/ar6k.c:914: error: left-hand operand of comma expression has no effect
  463. drivers/staging/ath6kl/htc2/AR6000/ar6k.c:915: error: 'HIF_SCATTER_REQ' has no member named 'TotalLength'
  464. drivers/staging/ath6kl/htc2/AR6000/ar6k.c:915: error: left-hand operand of comma expression has no effect
  465. drivers/staging/ath6kl/htc2/AR6000/ar6k.c:916: error: 'HIF_SCATTER_REQ' has no member named 'Address'
  466. drivers/staging/ath6kl/htc2/AR6000/ar6k.c:916: error: left-hand operand of comma expression has no effect
  467. drivers/staging/ath6kl/htc2/AR6000/ar6k.c:917: error: left-hand operand of comma expression has no effect
  468. drivers/staging/ath6kl/htc2/AR6000/ar6k.c:918: error: left-hand operand of comma expression has no effect
  469. drivers/staging/ath6kl/htc2/AR6000/ar6k.c:920: error: implicit declaration of function 'DEV_PREPARE_SCATTER_OPERATION'
  470. drivers/staging/ath6kl/htc2/AR6000/ar6k.c:924: error: 'HIF_SCATTER_REQ' has no member named 'CompletionStatus'
  471. drivers/staging/ath6kl/htc2/AR6000/ar6k.c:925: error: 'HIF_SCATTER_REQ' has no member named 'CompletionRoutine'
  472. drivers/staging/ath6kl/htc2/AR6000/ar6k.c:931: error: 'AR6K_DEVICE' has no member named 'HifScatterInfo'
  473. drivers/staging/ath6kl/htc2/AR6000/ar6k.c:931: error: 'AR6K_DEVICE' has no member named 'ScatterIsVirtual'
  474. drivers/staging/ath6kl/htc2/AR6000/ar6k.c:931: error: 'AR6K_DEVICE' has no member named 'HIFDevice'
  475. drivers/staging/ath6kl/htc2/AR6000/ar6k.c:935: error: 'HIF_SCATTER_REQ' has no member named 'CompletionStatus'
  476. drivers/staging/ath6kl/htc2/AR6000/ar6k.c:936: error: 'HIF_SCATTER_REQ' has no member named 'CompletionStatus'
  477. drivers/staging/ath6kl/htc2/AR6000/ar6k.c:936: error: 'HIF_SCATTER_REQ' has no member named 'Request'
  478. drivers/staging/ath6kl/htc2/AR6000/ar6k.c:936: error: 'HIF_SCATTER_REQ' has no member named 'ScatterMethod'
  479. drivers/staging/ath6kl/htc2/AR6000/ar6k.c:936: error: 'HIF_SCATTER_REQ' has no member named 'CompletionStatus'
  480. drivers/staging/ath6kl/htc2/AR6000/ar6k.c:936: error: too many arguments to function 'DevCopyScatterListToFromDMABuffer'
  481. make[3]: *** [drivers/staging/ath6kl/htc2/AR6000/ar6k.o] Error 1
  482. make[2]: *** [drivers/staging/ath6kl] Error 2
  483. make[1]: *** [drivers/staging] Error 2
  484. make: *** [drivers] Error 2
clone this paste RAW Paste Data