Pastebin launched a little side project called VERYVIRAL.com, check it out ;-) Want more features on Pastebin? Sign Up, it's FREE!
Guest

Untitled

By: a guest on Jan 29th, 2011  |  syntax: None  |  size: 7.90 KB  |  views: 117  |  expires: Never
download  |  raw  |  embed  |  report abuse  |  print
Text below is selected. Please press Ctrl+C to copy to your clipboard. (⌘+C on Mac)
  1. C:\clucene-2.3.2_mingw\src\shared\CLucene\SharedHeader.cpp: In function 'wchar_t* lucene_wcsdup(const wchar_t*)':
  2. C:\clucene-2.3.2_mingw\src\shared\CLucene\SharedHeader.cpp:33: warning: visibility attribute not supported in this configuration; ignored
  3. C:\clucene-2.3.2_mingw\src\shared\CLucene\config\gunichartables.cpp:132:3: warning: #warning "===== Note: using internal character function for compatibility ====="
  4. C:\clucene-2.3.2_mingw\src\shared\CLucene\config\gunichartables.cpp: In function 'TCHAR cl_tcasefold(TCHAR)':
  5. C:\clucene-2.3.2_mingw\src\shared\CLucene\config\gunichartables.cpp:351: warning: visibility attribute not supported in this configuration; ignored
  6. C:\clucene-2.3.2_mingw\src\shared\CLucene\config\repl_tcstoll.cpp: In function 'int64_t lucene_tcstoi64(const TCHAR*, TCHAR**, int)':
  7. C:\clucene-2.3.2_mingw\src\shared\CLucene\config\repl_tcstoll.cpp:46: warning: visibility attribute not supported in this configuration; ignored
  8. C:\clucene-2.3.2_mingw\src\shared\CLucene\config\repl_tprintf.cpp: In function 'void lucene_vfnwprintf(lucene::util::StringBuffer*, size_t, const wchar_t*, char*&)':
  9. C:\clucene-2.3.2_mingw\src\shared\CLucene\config\repl_tprintf.cpp:117: warning: visibility attribute not supported in this configuration; ignored
  10. C:\clucene-2.3.2_mingw\src\shared\CLucene\config\repl_tprintf.cpp: In function 'int lucene_vsnwprintf(wchar_t*, size_t, const wchar_t*, char*&)':
  11. C:\clucene-2.3.2_mingw\src\shared\CLucene\config\repl_tprintf.cpp:148: warning: visibility attribute not supported in this configuration; ignored
  12. C:\clucene-2.3.2_mingw\src\shared\CLucene\config\repl_lltot.cpp: In function 'TCHAR* lucene_i64tot(int64_t, TCHAR*, int)':
  13. C:\clucene-2.3.2_mingw\src\shared\CLucene\config\repl_lltot.cpp:47: warning: visibility attribute not supported in this configuration; ignored
  14. C:\clucene-2.3.2_mingw\src\shared\CLucene\config\repl_tcstod.cpp: In function 'double lucene_tcstod(const TCHAR*, TCHAR**)':
  15. C:\clucene-2.3.2_mingw\src\shared\CLucene\config\repl_tcstod.cpp:23: warning: visibility attribute not supported in this configuration; ignored
  16. In file included from C:\clucene-2.3.2_mingw\src\shared\CLucene\config\threads.cpp:9:
  17. C:\clucene-2.3.2_mingw\src\shared\CLucene\config\/_threads.h:21: error: using typedef-name 'CRITICAL_SECTION' after 'struct'
  18. c:\qt\4.6.2-mingw\mingw\bin\../lib/gcc/mingw32/4.4.0/../../../../include/winbase.h:801: error: 'CRITICAL_SECTION' has a previous declaration here
  19. C:\clucene-2.3.2_mingw\src\shared\CLucene\config\/_threads.h:46: error: redefinition of 'struct _SECURITY_ATTRIBUTES'
  20. c:\qt\4.6.2-mingw\mingw\bin\../lib/gcc/mingw32/4.4.0/../../../../include/winnt.h:2435: error: previous definition of 'struct _SECURITY_ATTRIBUTES'
  21. C:\clucene-2.3.2_mingw\src\shared\CLucene\config\/_threads.h:51: error: invalid type in declaration before ';' token
  22. C:\clucene-2.3.2_mingw\src\shared\CLucene\config\/_threads.h:51: error: conflicting declaration 'typedef int SECURITY_ATTRIBUTES'
  23. c:\qt\4.6.2-mingw\mingw\bin\../lib/gcc/mingw32/4.4.0/../../../../include/winnt.h:2439: error: 'SECURITY_ATTRIBUTES' has a previous declaration as 'typedef struct _SECURITY_ATTRIBUTES SECURITY_ATTRIBUTES'
  24. C:\clucene-2.3.2_mingw\src\shared\CLucene\config\/_threads.h:54: error: declaration of C function 'void* CreateEventA(SECURITY_ATTRIBUTES*, bool, bool, char*)' conflicts with
  25. c:\qt\4.6.2-mingw\mingw\bin\../lib/gcc/mingw32/4.4.0/../../../../include/winbase.h:1215: error: previous declaration 'void* CreateEventA(_SECURITY_ATTRIBUTES*, BOOL, BOOL, const CHAR*)' here
  26. C:\clucene-2.3.2_mingw\src\shared\CLucene\config\/_threads.h:55: error: declaration of C function 'bool SetEvent(void*)' conflicts with
  27. c:\qt\4.6.2-mingw\mingw\bin\../lib/gcc/mingw32/4.4.0/../../../../include/winbase.h:1911: error: previous declaration 'BOOL SetEvent(void*)' here
  28. C:\clucene-2.3.2_mingw\src\shared\CLucene\config\/_threads.h:56: error: declaration of C function 'bool CloseHandle(void*)' conflicts with
  29. c:\qt\4.6.2-mingw\mingw\bin\../lib/gcc/mingw32/4.4.0/../../../../include/winbase.h:1184: error: previous declaration 'BOOL CloseHandle(void*)' here
  30. C:\clucene-2.3.2_mingw\src\shared\CLucene\config\threads.cpp: In static member function 'static pthread_t lucene::util::mutex_thread::_GetCurrentThreadId()':
  31. C:\clucene-2.3.2_mingw\src\shared\CLucene\config\threads.cpp:59: error: conversion from 'long unsigned int' to non-scalar type 'pthread_t' requested
  32. C:\clucene-2.3.2_mingw\src\shared\CLucene\config\threads.cpp: At global scope:
  33. C:\clucene-2.3.2_mingw\src\shared\CLucene\config\threads.cpp:61: error: no 'void lucene::util::mutex_thread::_exitThread(int)' member function declared in class 'lucene::util::mutex_thread'
  34. C:\clucene-2.3.2_mingw\src\shared\CLucene\config\threads.cpp:65: error: no 'int32_t lucene::util::mutex_thread::atomic_increment(lucene::util::__LUCENE_ATOMIC_INT*)' member function declared in class 'lucene::util::mutex_thread'
  35. C:\clucene-2.3.2_mingw\src\shared\CLucene\config\threads.cpp:72: error: no 'int32_t lucene::util::mutex_thread::atomic_decrement(lucene::util::__LUCENE_ATOMIC_INT*)' member function declared in class 'lucene::util::mutex_thread'
  36. C:\clucene-2.3.2_mingw\src\shared\CLucene\config\threads.cpp: In static member function 'static pthread_t lucene::util::mutex_thread::CreateThread(void* (*)(void*), void*)':
  37. C:\clucene-2.3.2_mingw\src\shared\CLucene\config\threads.cpp:110: error: invalid conversion from 'void* (*)(void*)' to 'void (*)(void*)'
  38. C:\clucene-2.3.2_mingw\src\shared\CLucene\config\threads.cpp:110: error:   initializing argument 1 of 'void* _beginthread(void (*)(void*), unsigned int, void*)'
  39. C:\clucene-2.3.2_mingw\src\shared\CLucene\config\threads.cpp:110: error: no matching function for call to 'ptw32_handle_t::ptw32_handle_t(void*)'
  40. c:/pthread/include/pthread.h:569: note: candidates are: ptw32_handle_t::ptw32_handle_t()
  41. c:/pthread/include/pthread.h:569: note:                 ptw32_handle_t::ptw32_handle_t(const ptw32_handle_t&)
  42. C:\clucene-2.3.2_mingw\src\shared\CLucene\config\threads.cpp: In static member function 'static void lucene::util::mutex_thread::JoinThread(pthread_t)':
  43. C:\clucene-2.3.2_mingw\src\shared\CLucene\config\threads.cpp:113: error: invalid cast from type 'pthread_t' to type 'void*'
  44. mingw32-make[2]: *** [src/shared/CMakeFiles/clucene-shared.dir/CLucene/config/threads.obj] Error 1
  45. mingw32-make[1]: *** [src/shared/CMakeFiles/clucene-shared.dir/all] Error 2
  46. mingw32-make: *** [all] Error 2
  47. ENTRANT -D_UCS2 -D_UNICODE -o CMakeFiles\clucene-shared.dir\CLucene\config\repl_tcstod.obj -c C:\clucene-2.3.2_mingw\src\shared\CLucene\config\repl_tcstod.cpp
  48. "C:\Program Files\CMake 2.8\bin\cmake.exe" -E cmake_progress_report C:\clucene-2.3.2_mingw\CMakeFiles 95
  49. [  4%] Building CXX object src/shared/CMakeFiles/clucene-shared.dir/CLucene/config/utf8.obj
  50. cd C:\clucene-2.3.2_mingw\src\shared && C:\Qt\4.6.2-mingw\mingw\bin\g++.exe   -Dclucene_shared_EXPORTS -DMAKE_CLUCENE_SHARED_LIB -DUNICODE -Ic:/pthread/include -fvisibility=hidden -fvisibility-inlines-hidden -O3 -DNDEBUG -IC:\clucene-2.3.2_mingw\src\shared -IC:\clucene-2.3.2_mingw\src\core -IC:\gtk+\include    -D_REENTRANT -D_UCS2 -D_UNICODE -o CMakeFiles\clucene-shared.dir\CLucene\config\utf8.obj -c C:\clucene-2.3.2_mingw\src\shared\CLucene\config\utf8.cpp
  51. "C:\Program Files\CMake 2.8\bin\cmake.exe" -E cmake_progress_report C:\clucene-2.3.2_mingw\CMakeFiles
  52. [  4%] Building CXX object src/shared/CMakeFiles/clucene-shared.dir/CLucene/config/threads.obj
  53. cd C:\clucene-2.3.2_mingw\src\shared && C:\Qt\4.6.2-mingw\mingw\bin\g++.exe   -Dclucene_shared_EXPORTS -DMAKE_CLUCENE_SHARED_LIB -DUNICODE -Ic:/pthread/include -fvisibility=hidden -fvisibility-inlines-hidden -O3 -DNDEBUG -IC:\clucene-2.3.2_mingw\src\shared -IC:\clucene-2.3.2_mingw\src\core -IC:\gtk+\include    -D_REENTRANT -D_UCS2 -D_UNICODE -o CMakeFiles\clucene-shared.dir\CLucene\config\threads.obj -c C:\clucene-2.3.2_mingw\src\shared\CLucene\config\threads.cpp
  54. mingw32-make[2]: Leaving directory `C:/clucene-2.3.2_mingw'
  55. mingw32-make[1]: Leaving directory `C:/clucene-2.3.2_mingw'