Pastebin launched a little side project called HostCabi.net, check it out ;-)Don't like ads? PRO users don't see any ads ;-)
Guest

Untitled

By: a guest on Jun 17th, 2013  |  syntax: Make  |  size: 12.89 KB  |  hits: 51  |  expires: Never
download  |  raw  |  embed  |  report abuse  |  print
Text below is selected. Please press Ctrl+C to copy to your clipboard. (⌘+C on Mac)
  1. 16:52:35 **** Build of configuration Device-Debug for project ColorWheel ****
  2. make Device-Debug
  3. /Applications/Momentics.app/host_10_2_0_1/darwin/x86/usr/bin/qmake -spec unsupported/blackberry-armv7le-g++ -o arm/Makefile ColorWheel.pro CONFIG+=device
  4. /Applications/Momentics.app/host_10_2_0_1/darwin/x86/usr/bin/qmake -spec unsupported/blackberry-x86-g++ -o x86/Makefile ColorWheel.pro CONFIG+=simulator
  5. make -C ./arm -f Makefile debug
  6. make[1]: Entering directory `/workspaces/workspace-momentics/ColorWheel/arm'
  7. make -f Makefile.Debug
  8. make[2]: Entering directory `/workspaces/workspace-momentics/ColorWheel/arm'
  9. qcc -Vgcc_ntoarmv7le -c -Wno-psabi -lang-c++ -fstack-protector -fstack-protector-all -mcpu=cortex-a9 -g -Wno-psabi -Wall -W -D_REENTRANT -DQT_NO_IMPORT_QT47_QML -DQ_OS_BLACKBERRY -DQT_DECLARATIVE_LIB -DQT_SCRIPT_LIB -DQT_SVG_LIB -DQT_SQL_LIB -DQT_XMLPATTERNS_LIB -DQT_XML_LIB -DQT_GUI_LIB -DQT_NETWORK_LIB -DQT_CORE_LIB -DQT_SHARED -I/Applications/Momentics.app/target_10_2_0_339/qnx6/usr/share/qt4/mkspecs/unsupported/blackberry-armv7le-g++ -I../../ColorWheel -I/Applications/Momentics.app/target_10_2_0_339/qnx6/usr/include/qt4/QtCore -I/Applications/Momentics.app/target_10_2_0_339/qnx6/usr/include/qt4/QtNetwork -I/Applications/Momentics.app/target_10_2_0_339/qnx6/usr/include/qt4/QtGui -I/Applications/Momentics.app/target_10_2_0_339/qnx6/usr/include/qt4/QtXml -I/Applications/Momentics.app/target_10_2_0_339/qnx6/usr/include/qt4/QtXmlPatterns -I/Applications/Momentics.app/target_10_2_0_339/qnx6/usr/include/qt4/QtSql -I/Applications/Momentics.app/target_10_2_0_339/qnx6/usr/include/qt4/QtSvg -I/Applications/Momentics.app/target_10_2_0_339/qnx6/usr/include/qt4/QtScript -I/Applications/Momentics.app/target_10_2_0_339/qnx6/usr/include/qt4/QtDeclarative -I/Applications/Momentics.app/target_10_2_0_339/qnx6/usr/include/qt4 -I/Applications/Momentics.app/target_10_2_0_339/qnx6/usr/include/cpp -I/Applications/Momentics.app/target_10_2_0_339/qnx6/usr/include/qt4 -I/Applications/Momentics.app/target_10_2_0_339/qnx6/usr/include/cpp/embedded -I/Applications/Momentics.app/target_10_2_0_339/qnx6/usr/include/cpp/c -I/Applications/Momentics.app/target_10_2_0_339/qnx6/../target-override/usr/include -I/Applications/Momentics.app/target_10_2_0_339/qnx6/usr/include/qt4/QtCore -I../src -Io.le-v7-g/.moc -I/Applications/Momentics.app/target_10_2_0_339/qnx6/usr/include -I/Applications/Momentics.app/target_10_2_0_339/qnx6/usr/include/freetype2 -I. -o o.le-v7-g/.obj/BrightnessBarView.o ../src/BrightnessBarView.cpp
  10. In file included from /Applications/Momentics.app/target_10_2_0_339/qnx6/usr/include/cpp/xmemory:9:0,
  11.                  from /Applications/Momentics.app/target_10_2_0_339/qnx6/usr/include/cpp/memory:7,
  12.                  from /Applications/Momentics.app/target_10_2_0_339/qnx6/usr/include/cpp/algorithm:6,
  13.                  from /Applications/Momentics.app/target_10_2_0_339/qnx6/usr/include/qt4/QtCore/qglobal.h:68,
  14.                  from /Applications/Momentics.app/target_10_2_0_339/qnx6/usr/include/qt4/QtCore/qatomic.h:45,
  15.                  from /Applications/Momentics.app/target_10_2_0_339/qnx6/usr/include/qt4/QtCore/qvariant.h:45,
  16.                  from /Applications/Momentics.app/target_10_2_0_339/qnx6/usr/include/qt4/QtCore/QVariant:1,
  17.                  from /Applications/Momentics.app/target_10_2_0_339/qnx6/usr/include/bb/cascades/controls/container.h:6,
  18.                  from /Applications/Momentics.app/target_10_2_0_339/qnx6/usr/include/bb/cascades/Container:1,
  19.                  from ../src/BrightnessBarView.h:19,
  20.                  from ../src/BrightnessBarView.cpp:16:
  21. /Applications/Momentics.app/target_10_2_0_339/qnx6/usr/include/cpp/xutility:1281:10: error: 'basic_streambuf' does not name a type
  22. /Applications/Momentics.app/target_10_2_0_339/qnx6/usr/include/cpp/xutility:1282:10: error: 'basic_istream' does not name a type
  23. /Applications/Momentics.app/target_10_2_0_339/qnx6/usr/include/cpp/xutility:1287:37: error: expected ')' before '*' token
  24. /Applications/Momentics.app/target_10_2_0_339/qnx6/usr/include/cpp/xutility:1292:34: error: expected ')' before '&' token
  25. /Applications/Momentics.app/target_10_2_0_339/qnx6/usr/include/cpp/xutility:1365:2: error: 'streambuf_type' does not name a type
  26. /Applications/Momentics.app/target_10_2_0_339/qnx6/usr/include/cpp/xutility: In member function 'bool std::istreambuf_iterator<_Elem, _Traits>::equal(const _Myt&) const':
  27. /Applications/Momentics.app/target_10_2_0_339/qnx6/usr/include/cpp/xutility:1337:11: error: '_Strbuf' was not declared in this scope
  28. /Applications/Momentics.app/target_10_2_0_339/qnx6/usr/include/cpp/xutility: In member function 'void std::istreambuf_iterator<_Elem, _Traits>::_Inc()':
  29. /Applications/Momentics.app/target_10_2_0_339/qnx6/usr/include/cpp/xutility:1344:7: error: '_Strbuf' was not declared in this scope
  30. /Applications/Momentics.app/target_10_2_0_339/qnx6/usr/include/cpp/xutility: In member function '_Elem std::istreambuf_iterator<_Elem, _Traits>::_Peek()':
  31. /Applications/Momentics.app/target_10_2_0_339/qnx6/usr/include/cpp/xutility:1355:7: error: '_Strbuf' was not declared in this scope
  32. /Applications/Momentics.app/target_10_2_0_339/qnx6/usr/include/cpp/xutility: At global scope:
  33. /Applications/Momentics.app/target_10_2_0_339/qnx6/usr/include/cpp/xutility:1424:10: error: 'basic_streambuf' does not name a type
  34. /Applications/Momentics.app/target_10_2_0_339/qnx6/usr/include/cpp/xutility:1425:10: error: 'basic_ostream' does not name a type
  35. /Applications/Momentics.app/target_10_2_0_339/qnx6/usr/include/cpp/xutility:1428:37: error: expected ')' before '*' token
  36. /Applications/Momentics.app/target_10_2_0_339/qnx6/usr/include/cpp/xutility:1433:34: error: expected ')' before '&' token
  37. /Applications/Momentics.app/target_10_2_0_339/qnx6/usr/include/cpp/xutility:1469:2: error: 'streambuf_type' does not name a type
  38. /Applications/Momentics.app/target_10_2_0_339/qnx6/usr/include/cpp/xutility: In member function 'std::ostreambuf_iterator<_Elem, _Traits>::_Myt& std::ostreambuf_iterator<_Elem, _Traits>::operator=(_Elem)':
  39. /Applications/Momentics.app/target_10_2_0_339/qnx6/usr/include/cpp/xutility:1440:7: error: '_Strbuf' was not declared in this scope
  40. In file included from /Applications/Momentics.app/target_10_2_0_339/qnx6/usr/include/qt4/QtCore/qlist.h:50:0,
  41.                  from /Applications/Momentics.app/target_10_2_0_339/qnx6/usr/include/qt4/QtCore/qvariant.h:47,
  42.                  from /Applications/Momentics.app/target_10_2_0_339/qnx6/usr/include/qt4/QtCore/QVariant:1,
  43.                  from /Applications/Momentics.app/target_10_2_0_339/qnx6/usr/include/bb/cascades/controls/container.h:6,
  44.                  from /Applications/Momentics.app/target_10_2_0_339/qnx6/usr/include/bb/cascades/Container:1,
  45.                  from ../src/BrightnessBarView.h:19,
  46.                  from ../src/BrightnessBarView.cpp:16:
  47. /Applications/Momentics.app/target_10_2_0_339/qnx6/usr/include/cpp/iterator: At global scope:
  48. /Applications/Momentics.app/target_10_2_0_339/qnx6/usr/include/cpp/iterator:186:18: error: 'std::char_traits' is not a template
  49. /Applications/Momentics.app/target_10_2_0_339/qnx6/usr/include/cpp/iterator:196:10: error: 'basic_istream' does not name a type
  50. /Applications/Momentics.app/target_10_2_0_339/qnx6/usr/include/cpp/iterator:204:31: error: expected ')' before '&' token
  51. /Applications/Momentics.app/target_10_2_0_339/qnx6/usr/include/cpp/iterator:257:2: error: 'istream_type' does not name a type
  52. /Applications/Momentics.app/target_10_2_0_339/qnx6/usr/include/cpp/iterator: In constructor 'std::istream_iterator<_Ty, _Elem, _Traits, _Diff>::istream_iterator()':
  53. /Applications/Momentics.app/target_10_2_0_339/qnx6/usr/include/cpp/iterator:200:5: error: class 'std::istream_iterator<_Ty, _Elem, _Traits, _Diff>' does not have any field named '_Myistr'
  54. /Applications/Momentics.app/target_10_2_0_339/qnx6/usr/include/cpp/iterator: In member function 'bool std::istream_iterator<_Ty, _Elem, _Traits, _Diff>::_Equal(const _Myt&) const':
  55. /Applications/Momentics.app/target_10_2_0_339/qnx6/usr/include/cpp/iterator:247:11: error: '_Myistr' was not declared in this scope
  56. /Applications/Momentics.app/target_10_2_0_339/qnx6/usr/include/cpp/iterator: In member function 'void std::istream_iterator<_Ty, _Elem, _Traits, _Diff>::_Getval()':
  57. /Applications/Momentics.app/target_10_2_0_339/qnx6/usr/include/cpp/iterator:253:7: error: '_Myistr' was not declared in this scope
  58. /Applications/Momentics.app/target_10_2_0_339/qnx6/usr/include/cpp/iterator: At global scope:
  59. /Applications/Momentics.app/target_10_2_0_339/qnx6/usr/include/cpp/iterator:311:18: error: 'std::char_traits' is not a template
  60. /Applications/Momentics.app/target_10_2_0_339/qnx6/usr/include/cpp/iterator:318:10: error: 'basic_ostream' does not name a type
  61. /Applications/Momentics.app/target_10_2_0_339/qnx6/usr/include/cpp/iterator:321:31: error: expected ')' before '&' token
  62. /Applications/Momentics.app/target_10_2_0_339/qnx6/usr/include/cpp/iterator:358:2: error: 'ostream_type' does not name a type
  63. /Applications/Momentics.app/target_10_2_0_339/qnx6/usr/include/cpp/iterator: In member function 'std::ostream_iterator<_Ty, _Elem, _Traits>& std::ostream_iterator<_Ty, _Elem, _Traits>::operator=(const _Ty&)':
  64. /Applications/Momentics.app/target_10_2_0_339/qnx6/usr/include/cpp/iterator:329:4: error: '_Myostr' was not declared in this scope
  65. In file included from /Applications/Momentics.app/target_10_2_0_339/qnx6/usr/include/qt4/QtCore/qobject.h:48:0,
  66.                  from /Applications/Momentics.app/target_10_2_0_339/qnx6/usr/include/qt4/QtCore/qiodevice.h:46,
  67.                  from /Applications/Momentics.app/target_10_2_0_339/qnx6/usr/include/qt4/QtCore/qdatastream.h:46,
  68.                  from /Applications/Momentics.app/target_10_2_0_339/qnx6/usr/include/qt4/QtCore/qmetatype.h:49,
  69.                  from /Applications/Momentics.app/target_10_2_0_339/qnx6/usr/include/qt4/QtCore/qvariant.h:48,
  70.                  from /Applications/Momentics.app/target_10_2_0_339/qnx6/usr/include/qt4/QtCore/QVariant:1,
  71.                  from /Applications/Momentics.app/target_10_2_0_339/qnx6/usr/include/bb/cascades/controls/container.h:6,
  72.                  from /Applications/Momentics.app/target_10_2_0_339/qnx6/usr/include/bb/cascades/Container:1,
  73.                  from ../src/BrightnessBarView.h:19,
  74.                  from ../src/BrightnessBarView.cpp:16:
  75. /Applications/Momentics.app/target_10_2_0_339/qnx6/usr/include/qt4/QtCore/qstring.h: At global scope:
  76. /Applications/Momentics.app/target_10_2_0_339/qnx6/usr/include/qt4/QtCore/qstring.h:58:9: error: 'basic_string' in namespace 'std' does not name a type
  77. In file included from /Applications/Momentics.app/target_10_2_0_339/qnx6/usr/include/qt4/QtCore/qobject.h:48:0,
  78.                  from /Applications/Momentics.app/target_10_2_0_339/qnx6/usr/include/qt4/QtCore/qiodevice.h:46,
  79.                  from /Applications/Momentics.app/target_10_2_0_339/qnx6/usr/include/qt4/QtCore/qdatastream.h:46,
  80.                  from /Applications/Momentics.app/target_10_2_0_339/qnx6/usr/include/qt4/QtCore/qmetatype.h:49,
  81.                  from /Applications/Momentics.app/target_10_2_0_339/qnx6/usr/include/qt4/QtCore/qvariant.h:48,
  82.                  from /Applications/Momentics.app/target_10_2_0_339/qnx6/usr/include/qt4/QtCore/QVariant:1,
  83.                  from /Applications/Momentics.app/target_10_2_0_339/qnx6/usr/include/bb/cascades/controls/container.h:6,
  84.                  from /Applications/Momentics.app/target_10_2_0_339/qnx6/usr/include/bb/cascades/Container:1,
  85.                  from ../src/BrightnessBarView.h:19,
  86.                  from ../src/BrightnessBarView.cpp:16:
  87. /Applications/Momentics.app/target_10_2_0_339/qnx6/usr/include/qt4/QtCore/qstring.h:494:48: error: 'QStdWString' does not name a type
  88. /Applications/Momentics.app/target_10_2_0_339/qnx6/usr/include/qt4/QtCore/qstring.h:495:12: error: 'QStdWString' does not name a type
  89. /Applications/Momentics.app/target_10_2_0_339/qnx6/usr/include/qt4/QtCore/qstring.h:1051:8: error: 'QStdWString' does not name a type
  90. /Applications/Momentics.app/target_10_2_0_339/qnx6/usr/include/qt4/QtCore/qstring.h:1065:46: error: 'QStdWString' does not name a type
  91. /Applications/Momentics.app/target_10_2_0_339/qnx6/usr/include/qt4/QtCore/qstring.h: In static member function 'static QString QString::fromStdWString(const int&)':
  92. /Applications/Momentics.app/target_10_2_0_339/qnx6/usr/include/qt4/QtCore/qstring.h:1066:27: error: request for member 'data' in 's', which is of non-class type 'const int'
  93. /Applications/Momentics.app/target_10_2_0_339/qnx6/usr/include/qt4/QtCore/qstring.h:1066:41: error: request for member 'size' in 's', which is of non-class type 'const int'
  94. cc: /Applications/Momentics.app/host_10_2_0_1/darwin/x86/usr/lib/gcc/arm-unknown-nto-qnx8.0.0eabi/4.6.3/cc1plus error 1
  95. make[2]: Leaving directory `/workspaces/workspace-momentics/ColorWheel/arm'
  96. make[2]: *** [o.le-v7-g/.obj/BrightnessBarView.o] Error 1
  97. make[1]: Leaving directory `/workspaces/workspace-momentics/ColorWheel/arm'
  98. make[1]: *** [debug] Error 2
  99. make: *** [Device-Debug] Error 2
  100.  
  101. 16:52:38 Build Finished (took 2s.749ms)