This week only. Pastebin PRO Accounts Christmas Special! Don't miss out!Want more features on Pastebin? Sign Up, it's FREE!
Guest

Test

By: a guest on Aug 18th, 2011  |  syntax: None  |  size: 2.83 KB  |  views: 126  |  expires: Never
download  |  raw  |  embed  |  report abuse  |  print
Text below is selected. Please press Ctrl+C to copy to your clipboard. (⌘+C on Mac)
  1. Scanning dependencies of target partitionmanager-bin
  2. Scanning dependencies of target pmlibpartedbackendplugin                            
  3. [ 95%] [ 96%] Building CXX object src/CMakeFiles/partitionmanager-bin.dir/main.o    
  4. Building CXX object src/CMakeFiles/partitionmanager-bin.dir/partitionmanager-bin_automoc.o                                                                              
  5. [ 97%] Building CXX object src/plugins/libparted/CMakeFiles/pmlibpartedbackendplugin.dir/pmlibpartedbackendplugin_automoc.o                                            
  6. [ 98%] [ 98%] Building CXX object src/plugins/libparted/CMakeFiles/pmlibpartedbackendplugin.dir/libpartedpartitiontable.o                                              
  7. Building CXX object src/plugins/libparted/CMakeFiles/pmlibpartedbackendplugin.dir/libparteddevice.o                                                                    
  8. /tmp/yaourt-tmp-ubermenschjo/aur-partitionmanager-svn/src/partitionmanager-svn-build/src/plugins/libparted/libpartedpartitiontable.cpp: In member function ‘virtual bool LibPartedPartitionTable::clobberFileSystem(Report&, const Partition&)’:
  9. /tmp/yaourt-tmp-ubermenschjo/aur-partitionmanager-svn/src/partitionmanager-svn-build/src/plugins/libparted/libpartedpartitiontable.cpp:265:50: error: ‘ped_file_system_clobber’ was not declared in this scope
  10. /tmp/yaourt-tmp-ubermenschjo/aur-partitionmanager-svn/src/partitionmanager-svn-build/src/plugins/libparted/libpartedpartitiontable.cpp: In member function ‘virtual bool LibPartedPartitionTable::resizeFileSystem(Report&, const Partition&, qint64)’:
  11. /tmp/yaourt-tmp-ubermenschjo/aur-partitionmanager-svn/src/partitionmanager-svn-build/src/plugins/libparted/libpartedpartitiontable.cpp:303:75: error: ‘ped_file_system_open’ was not declared in this scope
  12. /tmp/yaourt-tmp-ubermenschjo/aur-partitionmanager-svn/src/partitionmanager-svn-build/src/plugins/libparted/libpartedpartitiontable.cpp:308:75: error: ‘ped_file_system_resize’ was not declared in this scope
  13. /tmp/yaourt-tmp-ubermenschjo/aur-partitionmanager-svn/src/partitionmanager-svn-build/src/plugins/libparted/libpartedpartitiontable.cpp:317:39: error: ‘ped_file_system_close’ was not declared in this scope
  14. make[2]: *** [src/plugins/libparted/CMakeFiles/pmlibpartedbackendplugin.dir/libpartedpartitiontable.o] 오류 1
  15. make[2]: *** 끝나지 않은 작업을 기다리고 있습니다....
  16. make[1]: *** [src/plugins/libparted/CMakeFiles/pmlibpartedbackendplugin.dir/all] 오류 2
  17. make[1]: *** 끝나지 않은 작업을 기다리고 있습니다....
  18. Linking CXX executable partitionmanager-bin
  19. [ 98%] Built target partitionmanager-bin                                            
  20. make: *** [all] 오류 2
  21. ==> ERROR: A failure occurred in build().
  22.     Aborting...
  23. ==> ERROR: Makepkg was unable to build partitionmanager-svn.
  24. ==> Restart building partitionmanager-svn ? [y/N]
clone this paste RAW Paste Data