Guest User

Untitled

a guest
Jan 3rd, 2011
132
0
Never
Not a member of Pastebin yet? Sign Up, it unlocks many cool features!
text 4.89 KB | None | 0 0
  1. aron@deb-aron:/tmp/uip-1.0/unix$ make
  2. ../apps/webserver/httpd-cgi.c:0: warning: Compiler option ignored due to lite-mode limitations
  3. ../apps/webserver/httpd-fs.c:0: warning: Compiler option ignored due to lite-mode limitations
  4. ../apps/webserver/http-strings.c:0: warning: Compiler option ignored due to lite-mode limitations
  5. ../apps/webserver/httpd.c:0: warning: Compiler option ignored due to lite-mode limitations
  6. ../uip/uip-neighbor.c:0: warning: Compiler option ignored due to lite-mode limitations
  7. ../uip/timer.c:0: warning: Compiler option ignored due to lite-mode limitations
  8. ../uip/psock.c:0: warning: Compiler option ignored due to lite-mode limitations
  9. In file included from ../uip/psock.c:41:
  10. ../uip/uip.h:1073:2: #error "HTONS already defined!"
  11. ../uip/uiplib.c:0: warning: Compiler option ignored due to lite-mode limitations
  12. ../uip/uip_arp.c:0: warning: Compiler option ignored due to lite-mode limitations
  13. ../uip/uip.c:0: warning: Compiler option ignored due to lite-mode limitations
  14. ../uip/psock.c:0: warning: Compiler option ignored due to lite-mode limitations
  15. In file included from ../uip/psock.c:41:
  16. ../uip/uip.h:1073:2: #error "HTONS already defined!"
  17. pic32-gcc -Wall -g -I../uip -I. -fpack-struct -Os -I../apps/webserver -c main.c -o obj/main.o
  18. main.c:1: warning: Compiler option ignored due to lite-mode limitations
  19. main.c: In function `uip_log':
  20. main.c:160: warning: implicit declaration of function `printf'
  21. main.c: In function `resolv_found':
  22. main.c:165: warning: unused variable `ipaddr2'
  23. pic32-gcc -Wall -g -I../uip -I. -fpack-struct -Os -I../apps/webserver -c tapdev.c -o obj/tapdev.o
  24. tapdev.c:1: warning: Compiler option ignored due to lite-mode limitations
  25. tapdev.c: In function `tapdev_read':
  26. tapdev.c:57: warning: no return statement in function returning non-void
  27. tapdev.c:56: warning: control reaches end of non-void function
  28. tapdev.c: At top level:
  29. tapdev.c:44: warning: 'drop' defined but not used
  30. tapdev.c:45: warning: 'fd' defined but not used
  31. pic32-gcc -Wall -g -I../uip -I. -fpack-struct -Os -I../apps/webserver -c clock-arch.c -o obj/clock-arch.o
  32. clock-arch.c:1: warning: Compiler option ignored due to lite-mode limitations
  33. pic32-gcc -Wall -g -I../uip -I. -fpack-struct -Os -I../apps/webserver -c ../apps/webserver/httpd.c -o obj/httpd.o
  34. ../apps/webserver/httpd.c:1: warning: Compiler option ignored due to lite-mode limitations
  35. pic32-gcc -Wall -g -I../uip -I. -fpack-struct -Os -I../apps/webserver -c ../apps/webserver/http-strings.c -o obj/http-strings.o
  36. ../apps/webserver/http-strings.c:1: warning: Compiler option ignored due to lite-mode limitations
  37. pic32-gcc -Wall -g -I../uip -I. -fpack-struct -Os -I../apps/webserver -c ../apps/webserver/httpd-fs.c -o obj/httpd-fs.o
  38. ../apps/webserver/httpd-fs.c:1: warning: Compiler option ignored due to lite-mode limitations
  39. pic32-gcc -Wall -g -I../uip -I. -fpack-struct -Os -I../apps/webserver -c ../apps/webserver/httpd-cgi.c -o obj/httpd-cgi.o
  40. ../apps/webserver/httpd-cgi.c:1: warning: Compiler option ignored due to lite-mode limitations
  41. pic32-ar rcf apps.a obj/httpd.o obj/http-strings.o obj/httpd-fs.o obj/httpd-cgi.o
  42. pic32-gcc -Wall -g -I../uip -I. -fpack-struct -Os -I../apps/webserver -c ../uip/uip.c -o obj/uip.o
  43. ../uip/uip.c:1: warning: Compiler option ignored due to lite-mode limitations
  44. ../uip/uip.c: In function `uip_process':
  45. ../uip/uip.c:998: error: invalid lvalue in assignment
  46. ../uip/uip.c:999: error: invalid lvalue in assignment
  47. ../uip/uip.c:1001: error: invalid lvalue in assignment
  48. ../uip/uip.c:1847: warning: label `ip_send_nolen' defined but not used
  49. ../uip/uip.c: At top level:
  50. ../uip/uip.c:1882: error: syntax error before "__extension__"
  51. ../uip/uip.c:1882: error: syntax error before '?' token
  52. ../uip/uip.c:1882: error: syntax error before ':' token
  53. ../uip/uip.c:1882: warning: type defaults to `int' in declaration of `__swap16md_v'
  54. ../uip/uip.c:1882: error: conflicting types for '__swap16md_v'
  55. ../uip/uip.c:1882: error: previous declaration of '__swap16md_v' was here
  56. ../uip/uip.c:1882: warning: data definition has no type or storage class
  57. ../uip/uip.c:1882: error: syntax error before '}' token
  58. ../uip/uip.c:1884: error: syntax error before '(' token
  59. ../uip/uip.c:1884: error: syntax error before ')' token
  60. ../uip/uip.c:1884: error: conflicting types for '__swap16md_v'
  61. ../uip/uip.c:1882: error: previous declaration of '__swap16md_v' was here
  62. ../uip/uip.c:1884: error: conflicting types for '__swap16md_v'
  63. ../uip/uip.c:1882: error: previous declaration of '__swap16md_v' was here
  64. ../uip/uip.c:1884: error: syntax error before ':' token
  65. ../uip/uip.c:1884: warning: type defaults to `int' in declaration of `__swap16md_v'
  66. ../uip/uip.c:1884: error: conflicting types for '__swap16md_v'
  67. ../uip/uip.c:1884: error: previous declaration of '__swap16md_v' was here
  68. ../uip/uip.c:1884: warning: data definition has no type or storage class
  69. ../uip/uip.c:1884: error: syntax error before '}' token
  70. make: *** [obj/uip.o] Error 1
Advertisement
Add Comment
Please, Sign In to add comment