Advertisement
Not a member of Pastebin yet?
Sign Up,
it unlocks many cool features!
- ubuntu@ip-172-31-45-59:/opt/install/paradox-1.4.3$ ls
- acinclude.m4 config.log config.w32 Makefile.fragments php_paradox.h
- aclocal.m4 config.m4 CREDITS Makefile.global run-tests.php
- autom4te.cache config.nice include Makefile.objects tests
- build config.status install-sh missing
- config.guess config.sub libtool mkinstalldirs
- config.h configure ltmain.sh modules
- config.h.in configure.in Makefile paradox.c
- ubuntu@ip-172-31-45-59:/opt/install/paradox-1.4.3$ sudo phpize
- Configuring for:
- PHP Api Version: 20121113
- Zend Module Api No: 20121212
- Zend Extension Api No: 220121212
- ubuntu@ip-172-31-45-59:/opt/install/paradox-1.4.3$ ./configure
- checking for grep that handles long lines and -e... /bin/grep
- checking for egrep... /bin/grep -E
- checking for a sed that does not truncate output... /bin/sed
- checking for cc... cc
- checking whether the C compiler works... yes
- checking for C compiler default output file name... a.out
- checking for suffix of executables...
- checking whether we are cross compiling... no
- checking for suffix of object files... o
- checking whether we are using the GNU C compiler... yes
- checking whether cc accepts -g... yes
- checking for cc option to accept ISO C89... none needed
- checking how to run the C preprocessor... cc -E
- checking for icc... no
- checking for suncc... no
- checking whether cc understands -c and -o together... yes
- checking for system library directory... lib
- checking if compiler supports -R... no
- checking if compiler supports -Wl,-rpath,... yes
- checking build system type... x86_64-unknown-linux-gnu
- checking host system type... x86_64-unknown-linux-gnu
- checking target system type... x86_64-unknown-linux-gnu
- checking for PHP prefix... /usr
- checking for PHP includes... -I/usr/include/php5 -I/usr/include/php5/main -I/usr/include/php5/TSRM -I/usr/include/php5/Zend -I/usr/include/php5/ext -I/usr/include/php5/ext/date/lib
- checking for PHP extension directory... /usr/lib/php5/20121212
- checking for PHP installed headers prefix... /usr/include/php5
- checking if debug is enabled... no
- checking if zts is enabled... no
- checking for re2c... no
- configure: WARNING: You will need re2c 0.13.4 or later if you want to regenerate PHP parsers.
- checking for gawk... gawk
- checking for paradox support... yes, shared
- checking for paradox files in default path... found in /usr/local
- found in /usr
- checking for PX_create_blob_fp in -lpx... yes
- checking for PX_insert_record in -lpx... yes
- checking for PX_update_record in -lpx... yes
- checking for PX_retrieve_record in -lpx... yes
- checking for PX_delete_record in -lpx... yes
- checking for PX_pack in -lpx... yes
- checking how to print strings... printf
- checking for a sed that does not truncate output... (cached) /bin/sed
- checking for fgrep... /bin/grep -F
- checking for ld used by cc... /usr/bin/ld
- checking if the linker (/usr/bin/ld) is GNU ld... yes
- checking for BSD- or MS-compatible name lister (nm)... /usr/bin/nm -B
- checking the name lister (/usr/bin/nm -B) interface... BSD nm
- checking whether ln -s works... yes
- checking the maximum length of command line arguments... 1572864
- checking whether the shell understands some XSI constructs... yes
- checking whether the shell understands "+="... yes
- checking how to convert x86_64-unknown-linux-gnu file names to x86_64-unknown-linux-gnu format... func_convert_file_noop
- checking how to convert x86_64-unknown-linux-gnu file names to toolchain format... func_convert_file_noop
- checking for /usr/bin/ld option to reload object files... -r
- checking for objdump... objdump
- checking how to recognize dependent libraries... pass_all
- checking for dlltool... no
- checking how to associate runtime and link libraries... printf %s\n
- checking for ar... ar
- checking for archiver @FILE support... @
- checking for strip... strip
- checking for ranlib... ranlib
- checking for gawk... (cached) gawk
- checking command to parse /usr/bin/nm -B output from cc object... ok
- checking for sysroot... no
- checking for mt... mt
- checking if mt is a manifest tool... no
- checking for ANSI C header files... yes
- checking for sys/types.h... yes
- checking for sys/stat.h... yes
- checking for stdlib.h... yes
- checking for string.h... yes
- checking for memory.h... yes
- checking for strings.h... yes
- checking for inttypes.h... yes
- checking for stdint.h... yes
- checking for unistd.h... yes
- checking for dlfcn.h... yes
- checking for objdir... .libs
- checking if cc supports -fno-rtti -fno-exceptions... no
- checking for cc option to produce PIC... -fPIC -DPIC
- checking if cc PIC flag -fPIC -DPIC works... yes
- checking if cc static flag -static works... yes
- checking if cc supports -c -o file.o... yes
- checking if cc supports -c -o file.o... (cached) yes
- checking whether the cc linker (/usr/bin/ld -m elf_x86_64) supports shared libraries... yes
- checking whether -lc should be explicitly linked in... no
- checking dynamic linker characteristics... GNU/Linux ld.so
- checking how to hardcode library paths into programs... immediate
- checking whether stripping libraries is possible... yes
- checking if libtool supports shared libraries... yes
- checking whether to build shared libraries... yes
- checking whether to build static libraries... no
- configure: creating ./config.status
- config.status: creating config.h
- config.status: config.h is unchanged
- config.status: executing libtool commands
- ubuntu@ip-172-31-45-59:/opt/install/paradox-1.4.3$ sudo make
- /bin/bash /opt/install/paradox-1.4.3/libtool --mode=compile cc -I. -I/opt/install/paradox-1.4.3 -DPHP_ATOM_INC -I/opt/install/paradox-1.4.3/include -I/opt/install/paradox-1.4.3/main -I/opt/install/paradox-1.4.3 -I/usr/include/php5 -I/usr/include/php5/main -I/usr/include/php5/TSRM -I/usr/include/php5/Zend -I/usr/include/php5/ext -I/usr/include/php5/ext/date/lib -DHAVE_CONFIG_H -g -O2 -c /opt/install/paradox-1.4.3/paradox.c -o paradox.lo
- libtool: compile: cc -I. -I/opt/install/paradox-1.4.3 -DPHP_ATOM_INC -I/opt/install/paradox-1.4.3/include -I/opt/install/paradox-1.4.3/main -I/opt/install/paradox-1.4.3 -I/usr/include/php5 -I/usr/include/php5/main -I/usr/include/php5/TSRM -I/usr/include/php5/Zend -I/usr/include/php5/ext -I/usr/include/php5/ext/date/lib -DHAVE_CONFIG_H -g -O2 -c /opt/install/paradox-1.4.3/paradox.c -fPIC -DPIC -o .libs/paradox.o
- /opt/install/paradox-1.4.3/paradox.c:51:1: error: unknown type name 'function_entry'
- function_entry paradox_functions[] = {
- ^
- /opt/install/paradox-1.4.3/paradox.c:52:2: warning: braces around scalar initializer [enabled by default]
- PHP_FE(px_new, NULL)
- ^
- /opt/install/paradox-1.4.3/paradox.c:52:2: warning: (near initialization for 'paradox_functions[0]') [enabled by default]
- /opt/install/paradox-1.4.3/paradox.c:52:2: warning: initialization makes integer from pointer without a cast [enabled by default]
- /opt/install/paradox-1.4.3/paradox.c:52:2: warning: (near initialization for 'paradox_functions[0]') [enabled by default]
- /opt/install/paradox-1.4.3/paradox.c:52:2: error: initializer element is not computable at load time
- /opt/install/paradox-1.4.3/paradox.c:52:2: error: (near initialization for 'paradox_functions[0]')
- /opt/install/paradox-1.4.3/paradox.c:52:2: warning: excess elements in scalar initializer [enabled by default]
- /opt/install/paradox-1.4.3/paradox.c:52:2: warning: (near initialization for 'paradox_functions[0]') [enabled by default]
- /opt/install/paradox-1.4.3/paradox.c:52:2: warning: excess elements in scalar initializer [enabled by default]
- /opt/install/paradox-1.4.3/paradox.c:52:2: warning: (near initialization for 'paradox_functions[0]') [enabled by default]
- In file included from /usr/include/php5/main/php.h:39:0,
- from /opt/install/paradox-1.4.3/paradox.c:25:
- /usr/include/php5/Zend/zend_API.h:71:129: warning: excess elements in scalar initializer [enabled by default]
- #define ZEND_FENTRY(zend_name, name, arg_info, flags) { #zend_name, name, arg_info, (zend_uint) (sizeof(arg_info)/sizeof(struct _zend_arg_info)-1), flags },
- ^
- /usr/include/php5/Zend/zend_API.h:77:38: note: in expansion of macro 'ZEND_FENTRY'
- #define ZEND_FE(name, arg_info) ZEND_FENTRY(name, ZEND_FN(name), arg_info, 0)
- ^
- /usr/include/php5/main/php.h:350:18: note: in expansion of macro 'ZEND_FE'
- #define PHP_FE ZEND_FE
- ^
- /opt/install/paradox-1.4.3/paradox.c:52:2: note: in expansion of macro 'PHP_FE'
- PHP_FE(px_new, NULL)
- ^
- /usr/include/php5/Zend/zend_API.h:71:129: warning: (near initialization for 'paradox_functions[0]') [enabled by default]
- #define ZEND_FENTRY(zend_name, name, arg_info, flags) { #zend_name, name, arg_info, (zend_uint) (sizeof(arg_info)/sizeof(struct _zend_arg_info)-1), flags },
- ^
- /usr/include/php5/Zend/zend_API.h:77:38: note: in expansion of macro 'ZEND_FENTRY'
- #define ZEND_FE(name, arg_info) ZEND_FENTRY(name, ZEND_FN(name), arg_info, 0)
- ^
- /usr/include/php5/main/php.h:350:18: note: in expansion of macro 'ZEND_FE'
- #define PHP_FE ZEND_FE
- ^
- /opt/install/paradox-1.4.3/paradox.c:52:2: note: in expansion of macro 'PHP_FE'
- PHP_FE(px_new, NULL)
- ^
- /usr/include/php5/Zend/zend_API.h:71:129: warning: excess elements in scalar initializer [enabled by default]
- #define ZEND_FENTRY(zend_name, name, arg_info, flags) { #zend_name, name, arg_info, (zend_uint) (sizeof(arg_info)/sizeof(struct _zend_arg_info)-1), flags },
- ^
- /usr/include/php5/Zend/zend_API.h:77:38: note: in expansion of macro 'ZEND_FENTRY'
- #define ZEND_FE(name, arg_info) ZEND_FENTRY(name, ZEND_FN(name), arg_info, 0)
- ^
- /usr/include/php5/main/php.h:350:18: note: in expansion of macro 'ZEND_FE'
- #define PHP_FE ZEND_FE
- ^
- /opt/install/paradox-1.4.3/paradox.c:52:2: note: in expansion of macro 'PHP_FE'
- PHP_FE(px_new, NULL)
- ^
- /usr/include/php5/Zend/zend_API.h:71:129: warning: (near initialization for 'paradox_functions[0]') [enabled by default]
- #define ZEND_FENTRY(zend_name, name, arg_info, flags) { #zend_name, name, arg_info, (zend_uint) (sizeof(arg_info)/sizeof(struct _zend_arg_info)-1), flags },
- ^
- /usr/include/php5/Zend/zend_API.h:77:38: note: in expansion of macro 'ZEND_FENTRY'
- #define ZEND_FE(name, arg_info) ZEND_FENTRY(name, ZEND_FN(name), arg_info, 0)
- ^
- /usr/include/php5/main/php.h:350:18: note: in expansion of macro 'ZEND_FE'
- #define PHP_FE ZEND_FE
- ^
- /opt/install/paradox-1.4.3/paradox.c:52:2: note: in expansion of macro 'PHP_FE'
- PHP_FE(px_new, NULL)
- ^
- /opt/install/paradox-1.4.3/paradox.c:53:2: warning: braces around scalar initializer [enabled by default]
- PHP_FE(px_open_fp, NULL)
- ^
- /opt/install/paradox-1.4.3/paradox.c:53:2: warning: (near initialization for 'paradox_functions[1]') [enabled by default]
- /opt/install/paradox-1.4.3/paradox.c:53:2: warning: initialization makes integer from pointer without a cast [enabled by default]
- /opt/install/paradox-1.4.3/paradox.c:53:2: warning: (near initialization for 'paradox_functions[1]') [enabled by default]
- /opt/install/paradox-1.4.3/paradox.c:53:2: error: initializer element is not computable at load time
- /opt/install/paradox-1.4.3/paradox.c:53:2: error: (near initialization for 'paradox_functions[1]')
- /opt/install/paradox-1.4.3/paradox.c:53:2: warning: excess elements in scalar initializer [enabled by default]
- /opt/install/paradox-1.4.3/paradox.c:53:2: warning: (near initialization for 'paradox_functions[1]') [enabled by default]
- /opt/install/paradox-1.4.3/paradox.c:53:2: warning: excess elements in scalar initializer [enabled by default]
- /opt/install/paradox-1.4.3/paradox.c:53:2: warning: (near initialization for 'paradox_functions[1]') [enabled by default]
- In file included from /usr/include/php5/main/php.h:39:0,
- from /opt/install/paradox-1.4.3/paradox.c:25:
- /usr/include/php5/Zend/zend_API.h:71:129: warning: excess elements in scalar initializer [enabled by default]
- #define ZEND_FENTRY(zend_name, name, arg_info, flags) { #zend_name, name, arg_info, (zend_uint) (sizeof(arg_info)/sizeof(struct _zend_arg_info)-1), flags },
- ^
- /usr/include/php5/Zend/zend_API.h:77:38: note: in expansion of macro 'ZEND_FENTRY'
- #define ZEND_FE(name, arg_info) ZEND_FENTRY(name, ZEND_FN(name), arg_info, 0)
- ^
- /usr/include/php5/main/php.h:350:18: note: in expansion of macro 'ZEND_FE'
- #define PHP_FE ZEND_FE
- ^
- /opt/install/paradox-1.4.3/paradox.c:53:2: note: in expansion of macro 'PHP_FE'
- PHP_FE(px_open_fp, NULL)
- ^
- /usr/include/php5/Zend/zend_API.h:71:129: warning: (near initialization for 'paradox_functions[1]') [enabled by default]
- #define ZEND_FENTRY(zend_name, name, arg_info, flags) { #zend_name, name, arg_info, (zend_uint) (sizeof(arg_info)/sizeof(struct _zend_arg_info)-1), flags },
- ^
- /usr/include/php5/Zend/zend_API.h:77:38: note: in expansion of macro 'ZEND_FENTRY'
- #define ZEND_FE(name, arg_info) ZEND_FENTRY(name, ZEND_FN(name), arg_info, 0)
- ^
- /usr/include/php5/main/php.h:350:18: note: in expansion of macro 'ZEND_FE'
- #define PHP_FE ZEND_FE
- ^
- /opt/install/paradox-1.4.3/paradox.c:53:2: note: in expansion of macro 'PHP_FE'
- PHP_FE(px_open_fp, NULL)
- ^
- /usr/include/php5/Zend/zend_API.h:71:129: warning: excess elements in scalar initializer [enabled by default]
- #define ZEND_FENTRY(zend_name, name, arg_info, flags) { #zend_name, name, arg_info, (zend_uint) (sizeof(arg_info)/sizeof(struct _zend_arg_info)-1), flags },
- ^
- /usr/include/php5/Zend/zend_API.h:77:38: note: in expansion of macro 'ZEND_FENTRY'
- #define ZEND_FE(name, arg_info) ZEND_FENTRY(name, ZEND_FN(name), arg_info, 0)
- ^
- /usr/include/php5/main/php.h:350:18: note: in expansion of macro 'ZEND_FE'
- #define PHP_FE ZEND_FE
- ^
- /opt/install/paradox-1.4.3/paradox.c:53:2: note: in expansion of macro 'PHP_FE'
- PHP_FE(px_open_fp, NULL)
- ^
- /usr/include/php5/Zend/zend_API.h:71:129: warning: (near initialization for 'paradox_functions[1]') [enabled by default]
- #define ZEND_FENTRY(zend_name, name, arg_info, flags) { #zend_name, name, arg_info, (zend_uint) (sizeof(arg_info)/sizeof(struct _zend_arg_info)-1), flags },
- ^
- /usr/include/php5/Zend/zend_API.h:77:38: note: in expansion of macro 'ZEND_FENTRY'
- #define ZEND_FE(name, arg_info) ZEND_FENTRY(name, ZEND_FN(name), arg_info, 0)
- ^
- /usr/include/php5/main/php.h:350:18: note: in expansion of macro 'ZEND_FE'
- #define PHP_FE ZEND_FE
- ^
- /opt/install/paradox-1.4.3/paradox.c:53:2: note: in expansion of macro 'PHP_FE'
- PHP_FE(px_open_fp, NULL)
- ^
- /opt/install/paradox-1.4.3/paradox.c:54:2: warning: braces around scalar initializer [enabled by default]
- PHP_FE(px_create_fp, NULL)
- ^
- /opt/install/paradox-1.4.3/paradox.c:54:2: warning: (near initialization for 'paradox_functions[2]') [enabled by default]
- /opt/install/paradox-1.4.3/paradox.c:54:2: warning: initialization makes integer from pointer without a cast [enabled by default]
- /opt/install/paradox-1.4.3/paradox.c:54:2: warning: (near initialization for 'paradox_functions[2]') [enabled by default]
- /opt/install/paradox-1.4.3/paradox.c:54:2: error: initializer element is not computable at load time
- /opt/install/paradox-1.4.3/paradox.c:54:2: error: (near initialization for 'paradox_functions[2]')
- /opt/install/paradox-1.4.3/paradox.c:54:2: warning: excess elements in scalar initializer [enabled by default]
- /opt/install/paradox-1.4.3/paradox.c:54:2: warning: (near initialization for 'paradox_functions[2]') [enabled by default]
- /opt/install/paradox-1.4.3/paradox.c:54:2: warning: excess elements in scalar initializer [enabled by default]
- /opt/install/paradox-1.4.3/paradox.c:54:2: warning: (near initialization for 'paradox_functions[2]') [enabled by default]
- In file included from /usr/include/php5/main/php.h:39:0,
- from /opt/install/paradox-1.4.3/paradox.c:25:
- /usr/include/php5/Zend/zend_API.h:71:129: warning: excess elements in scalar initializer [enabled by default]
- #define ZEND_FENTRY(zend_name, name, arg_info, flags) { #zend_name, name, arg_info, (zend_uint) (sizeof(arg_info)/sizeof(struct _zend_arg_info)-1), flags },
- ^
- /usr/include/php5/Zend/zend_API.h:77:38: note: in expansion of macro 'ZEND_FENTRY'
- #define ZEND_FE(name, arg_info) ZEND_FENTRY(name, ZEND_FN(name), arg_info, 0)
- ^
- /usr/include/php5/main/php.h:350:18: note: in expansion of macro 'ZEND_FE'
- #define PHP_FE ZEND_FE
- ^
- /opt/install/paradox-1.4.3/paradox.c:54:2: note: in expansion of macro 'PHP_FE'
- PHP_FE(px_create_fp, NULL)
- ^
- /usr/include/php5/Zend/zend_API.h:71:129: warning: (near initialization for 'paradox_functions[2]') [enabled by default]
- #define ZEND_FENTRY(zend_name, name, arg_info, flags) { #zend_name, name, arg_info, (zend_uint) (sizeof(arg_info)/sizeof(struct _zend_arg_info)-1), flags },
- ^
- /usr/include/php5/Zend/zend_API.h:77:38: note: in expansion of macro 'ZEND_FENTRY'
- #define ZEND_FE(name, arg_info) ZEND_FENTRY(name, ZEND_FN(name), arg_info, 0)
- ^
- /usr/include/php5/main/php.h:350:18: note: in expansion of macro 'ZEND_FE'
- #define PHP_FE ZEND_FE
- ^
- /opt/install/paradox-1.4.3/paradox.c:54:2: note: in expansion of macro 'PHP_FE'
- PHP_FE(px_create_fp, NULL)
- ^
- /usr/include/php5/Zend/zend_API.h:71:129: warning: excess elements in scalar initializer [enabled by default]
- #define ZEND_FENTRY(zend_name, name, arg_info, flags) { #zend_name, name, arg_info, (zend_uint) (sizeof(arg_info)/sizeof(struct _zend_arg_info)-1), flags },
- ^
- /usr/include/php5/Zend/zend_API.h:77:38: note: in expansion of macro 'ZEND_FENTRY'
- #define ZEND_FE(name, arg_info) ZEND_FENTRY(name, ZEND_FN(name), arg_info, 0)
- ^
- /usr/include/php5/main/php.h:350:18: note: in expansion of macro 'ZEND_FE'
- #define PHP_FE ZEND_FE
- ^
- /opt/install/paradox-1.4.3/paradox.c:54:2: note: in expansion of macro 'PHP_FE'
- PHP_FE(px_create_fp, NULL)
- ^
- /usr/include/php5/Zend/zend_API.h:71:129: warning: (near initialization for 'paradox_functions[2]') [enabled by default]
- #define ZEND_FENTRY(zend_name, name, arg_info, flags) { #zend_name, name, arg_info, (zend_uint) (sizeof(arg_info)/sizeof(struct _zend_arg_info)-1), flags },
- ^
- /usr/include/php5/Zend/zend_API.h:77:38: note: in expansion of macro 'ZEND_FENTRY'
- #define ZEND_FE(name, arg_info) ZEND_FENTRY(name, ZEND_FN(name), arg_info, 0)
- ^
- /usr/include/php5/main/php.h:350:18: note: in expansion of macro 'ZEND_FE'
- #define PHP_FE ZEND_FE
- ^
- /opt/install/paradox-1.4.3/paradox.c:54:2: note: in expansion of macro 'PHP_FE'
- PHP_FE(px_create_fp, NULL)
- ^
- /opt/install/paradox-1.4.3/paradox.c:55:2: warning: braces around scalar initializer [enabled by default]
- PHP_FE(px_close, NULL)
- ^
- /opt/install/paradox-1.4.3/paradox.c:55:2: warning: (near initialization for 'paradox_functions[3]') [enabled by default]
- /opt/install/paradox-1.4.3/paradox.c:55:2: warning: initialization makes integer from pointer without a cast [enabled by default]
- /opt/install/paradox-1.4.3/paradox.c:55:2: warning: (near initialization for 'paradox_functions[3]') [enabled by default]
- /opt/install/paradox-1.4.3/paradox.c:55:2: error: initializer element is not computable at load time
- /opt/install/paradox-1.4.3/paradox.c:55:2: error: (near initialization for 'paradox_functions[3]')
- /opt/install/paradox-1.4.3/paradox.c:55:2: warning: excess elements in scalar initializer [enabled by default]
- /opt/install/paradox-1.4.3/paradox.c:55:2: warning: (near initialization for 'paradox_functions[3]') [enabled by default]
- /opt/install/paradox-1.4.3/paradox.c:55:2: warning: excess elements in scalar initializer [enabled by default]
- /opt/install/paradox-1.4.3/paradox.c:55:2: warning: (near initialization for 'paradox_functions[3]') [enabled by default]
- In file included from /usr/include/php5/main/php.h:39:0,
- from /opt/install/paradox-1.4.3/paradox.c:25:
- /usr/include/php5/Zend/zend_API.h:71:129: warning: excess elements in scalar initializer [enabled by default]
- #define ZEND_FENTRY(zend_name, name, arg_info, flags) { #zend_name, name, arg_info, (zend_uint) (sizeof(arg_info)/sizeof(struct _zend_arg_info)-1), flags },
- ^
- /usr/include/php5/Zend/zend_API.h:77:38: note: in expansion of macro 'ZEND_FENTRY'
- #define ZEND_FE(name, arg_info) ZEND_FENTRY(name, ZEND_FN(name), arg_info, 0)
- ^
- /usr/include/php5/main/php.h:350:18: note: in expansion of macro 'ZEND_FE'
- #define PHP_FE ZEND_FE
- ^
- /opt/install/paradox-1.4.3/paradox.c:55:2: note: in expansion of macro 'PHP_FE'
- PHP_FE(px_close, NULL)
- ^
- /usr/include/php5/Zend/zend_API.h:71:129: warning: (near initialization for 'paradox_functions[3]') [enabled by default]
- #define ZEND_FENTRY(zend_name, name, arg_info, flags) { #zend_name, name, arg_info, (zend_uint) (sizeof(arg_info)/sizeof(struct _zend_arg_info)-1), flags },
- ^
- /usr/include/php5/Zend/zend_API.h:77:38: note: in expansion of macro 'ZEND_FENTRY'
- #define ZEND_FE(name, arg_info) ZEND_FENTRY(name, ZEND_FN(name), arg_info, 0)
- ^
- /usr/include/php5/main/php.h:350:18: note: in expansion of macro 'ZEND_FE'
- #define PHP_FE ZEND_FE
- ^
- /opt/install/paradox-1.4.3/paradox.c:55:2: note: in expansion of macro 'PHP_FE'
- PHP_FE(px_close, NULL)
- ^
- /usr/include/php5/Zend/zend_API.h:71:129: warning: excess elements in scalar initializer [enabled by default]
- #define ZEND_FENTRY(zend_name, name, arg_info, flags) { #zend_name, name, arg_info, (zend_uint) (sizeof(arg_info)/sizeof(struct _zend_arg_info)-1), flags },
- ^
- /usr/include/php5/Zend/zend_API.h:77:38: note: in expansion of macro 'ZEND_FENTRY'
- #define ZEND_FE(name, arg_info) ZEND_FENTRY(name, ZEND_FN(name), arg_info, 0)
- ^
- /usr/include/php5/main/php.h:350:18: note: in expansion of macro 'ZEND_FE'
- #define PHP_FE ZEND_FE
- ^
- /opt/install/paradox-1.4.3/paradox.c:55:2: note: in expansion of macro 'PHP_FE'
- PHP_FE(px_close, NULL)
- ^
- /usr/include/php5/Zend/zend_API.h:71:129: warning: (near initialization for 'paradox_functions[3]') [enabled by default]
- #define ZEND_FENTRY(zend_name, name, arg_info, flags) { #zend_name, name, arg_info, (zend_uint) (sizeof(arg_info)/sizeof(struct _zend_arg_info)-1), flags },
- ^
- /usr/include/php5/Zend/zend_API.h:77:38: note: in expansion of macro 'ZEND_FENTRY'
- #define ZEND_FE(name, arg_info) ZEND_FENTRY(name, ZEND_FN(name), arg_info, 0)
- ^
- /usr/include/php5/main/php.h:350:18: note: in expansion of macro 'ZEND_FE'
- #define PHP_FE ZEND_FE
- ^
- /opt/install/paradox-1.4.3/paradox.c:55:2: note: in expansion of macro 'PHP_FE'
- PHP_FE(px_close, NULL)
- ^
- /opt/install/paradox-1.4.3/paradox.c:56:2: warning: braces around scalar initializer [enabled by default]
- PHP_FE(px_delete, NULL)
- ^
- /opt/install/paradox-1.4.3/paradox.c:56:2: warning: (near initialization for 'paradox_functions[4]') [enabled by default]
- /opt/install/paradox-1.4.3/paradox.c:56:2: warning: initialization makes integer from pointer without a cast [enabled by default]
- /opt/install/paradox-1.4.3/paradox.c:56:2: warning: (near initialization for 'paradox_functions[4]') [enabled by default]
- /opt/install/paradox-1.4.3/paradox.c:56:2: error: initializer element is not computable at load time
- /opt/install/paradox-1.4.3/paradox.c:56:2: error: (near initialization for 'paradox_functions[4]')
- /opt/install/paradox-1.4.3/paradox.c:56:2: warning: excess elements in scalar initializer [enabled by default]
- /opt/install/paradox-1.4.3/paradox.c:56:2: warning: (near initialization for 'paradox_functions[4]') [enabled by default]
- /opt/install/paradox-1.4.3/paradox.c:56:2: warning: excess elements in scalar initializer [enabled by default]
- /opt/install/paradox-1.4.3/paradox.c:56:2: warning: (near initialization for 'paradox_functions[4]') [enabled by default]
- In file included from /usr/include/php5/main/php.h:39:0,
- from /opt/install/paradox-1.4.3/paradox.c:25:
- /usr/include/php5/Zend/zend_API.h:71:129: warning: excess elements in scalar initializer [enabled by default]
- #define ZEND_FENTRY(zend_name, name, arg_info, flags) { #zend_name, name, arg_info, (zend_uint) (sizeof(arg_info)/sizeof(struct _zend_arg_info)-1), flags },
- ^
- /usr/include/php5/Zend/zend_API.h:77:38: note: in expansion of macro 'ZEND_FENTRY'
- #define ZEND_FE(name, arg_info) ZEND_FENTRY(name, ZEND_FN(name), arg_info, 0)
- ^
- /usr/include/php5/main/php.h:350:18: note: in expansion of macro 'ZEND_FE'
- #define PHP_FE ZEND_FE
- ^
- /opt/install/paradox-1.4.3/paradox.c:56:2: note: in expansion of macro 'PHP_FE'
- PHP_FE(px_delete, NULL)
- ^
- /usr/include/php5/Zend/zend_API.h:71:129: warning: (near initialization for 'paradox_functions[4]') [enabled by default]
- #define ZEND_FENTRY(zend_name, name, arg_info, flags) { #zend_name, name, arg_info, (zend_uint) (sizeof(arg_info)/sizeof(struct _zend_arg_info)-1), flags },
- ^
- /usr/include/php5/Zend/zend_API.h:77:38: note: in expansion of macro 'ZEND_FENTRY'
- #define ZEND_FE(name, arg_info) ZEND_FENTRY(name, ZEND_FN(name), arg_info, 0)
- ^
- /usr/include/php5/main/php.h:350:18: note: in expansion of macro 'ZEND_FE'
- #define PHP_FE ZEND_FE
- ^
- /opt/install/paradox-1.4.3/paradox.c:56:2: note: in expansion of macro 'PHP_FE'
- PHP_FE(px_delete, NULL)
- ^
- /usr/include/php5/Zend/zend_API.h:71:129: warning: excess elements in scalar initializer [enabled by default]
- #define ZEND_FENTRY(zend_name, name, arg_info, flags) { #zend_name, name, arg_info, (zend_uint) (sizeof(arg_info)/sizeof(struct _zend_arg_info)-1), flags },
- ^
- /usr/include/php5/Zend/zend_API.h:77:38: note: in expansion of macro 'ZEND_FENTRY'
- #define ZEND_FE(name, arg_info) ZEND_FENTRY(name, ZEND_FN(name), arg_info, 0)
- ^
- /usr/include/php5/main/php.h:350:18: note: in expansion of macro 'ZEND_FE'
- #define PHP_FE ZEND_FE
- ^
- /opt/install/paradox-1.4.3/paradox.c:56:2: note: in expansion of macro 'PHP_FE'
- PHP_FE(px_delete, NULL)
- ^
- /usr/include/php5/Zend/zend_API.h:71:129: warning: (near initialization for 'paradox_functions[4]') [enabled by default]
- #define ZEND_FENTRY(zend_name, name, arg_info, flags) { #zend_name, name, arg_info, (zend_uint) (sizeof(arg_info)/sizeof(struct _zend_arg_info)-1), flags },
- ^
- /usr/include/php5/Zend/zend_API.h:77:38: note: in expansion of macro 'ZEND_FENTRY'
- #define ZEND_FE(name, arg_info) ZEND_FENTRY(name, ZEND_FN(name), arg_info, 0)
- ^
- /usr/include/php5/main/php.h:350:18: note: in expansion of macro 'ZEND_FE'
- #define PHP_FE ZEND_FE
- ^
- /opt/install/paradox-1.4.3/paradox.c:56:2: note: in expansion of macro 'PHP_FE'
- PHP_FE(px_delete, NULL)
- ^
- /opt/install/paradox-1.4.3/paradox.c:57:2: warning: braces around scalar initializer [enabled by default]
- PHP_FE(px_numrecords, NULL)
- ^
- /opt/install/paradox-1.4.3/paradox.c:57:2: warning: (near initialization for 'paradox_functions[5]') [enabled by default]
- /opt/install/paradox-1.4.3/paradox.c:57:2: warning: initialization makes integer from pointer without a cast [enabled by default]
- /opt/install/paradox-1.4.3/paradox.c:57:2: warning: (near initialization for 'paradox_functions[5]') [enabled by default]
- /opt/install/paradox-1.4.3/paradox.c:57:2: error: initializer element is not computable at load time
- /opt/install/paradox-1.4.3/paradox.c:57:2: error: (near initialization for 'paradox_functions[5]')
- /opt/install/paradox-1.4.3/paradox.c:57:2: warning: excess elements in scalar initializer [enabled by default]
- /opt/install/paradox-1.4.3/paradox.c:57:2: warning: (near initialization for 'paradox_functions[5]') [enabled by default]
- /opt/install/paradox-1.4.3/paradox.c:57:2: warning: excess elements in scalar initializer [enabled by default]
- /opt/install/paradox-1.4.3/paradox.c:57:2: warning: (near initialization for 'paradox_functions[5]') [enabled by default]
- In file included from /usr/include/php5/main/php.h:39:0,
- from /opt/install/paradox-1.4.3/paradox.c:25:
- /usr/include/php5/Zend/zend_API.h:71:129: warning: excess elements in scalar initializer [enabled by default]
- #define ZEND_FENTRY(zend_name, name, arg_info, flags) { #zend_name, name, arg_info, (zend_uint) (sizeof(arg_info)/sizeof(struct _zend_arg_info)-1), flags },
- ^
- /usr/include/php5/Zend/zend_API.h:77:38: note: in expansion of macro 'ZEND_FENTRY'
- #define ZEND_FE(name, arg_info) ZEND_FENTRY(name, ZEND_FN(name), arg_info, 0)
- ^
- /usr/include/php5/main/php.h:350:18: note: in expansion of macro 'ZEND_FE'
- #define PHP_FE ZEND_FE
- ^
- /opt/install/paradox-1.4.3/paradox.c:57:2: note: in expansion of macro 'PHP_FE'
- PHP_FE(px_numrecords, NULL)
- ^
- /usr/include/php5/Zend/zend_API.h:71:129: warning: (near initialization for 'paradox_functions[5]') [enabled by default]
- #define ZEND_FENTRY(zend_name, name, arg_info, flags) { #zend_name, name, arg_info, (zend_uint) (sizeof(arg_info)/sizeof(struct _zend_arg_info)-1), flags },
- ^
- /usr/include/php5/Zend/zend_API.h:77:38: note: in expansion of macro 'ZEND_FENTRY'
- #define ZEND_FE(name, arg_info) ZEND_FENTRY(name, ZEND_FN(name), arg_info, 0)
- ^
- /usr/include/php5/main/php.h:350:18: note: in expansion of macro 'ZEND_FE'
- #define PHP_FE ZEND_FE
- ^
- /opt/install/paradox-1.4.3/paradox.c:57:2: note: in expansion of macro 'PHP_FE'
- PHP_FE(px_numrecords, NULL)
- ^
- /usr/include/php5/Zend/zend_API.h:71:129: warning: excess elements in scalar initializer [enabled by default]
- #define ZEND_FENTRY(zend_name, name, arg_info, flags) { #zend_name, name, arg_info, (zend_uint) (sizeof(arg_info)/sizeof(struct _zend_arg_info)-1), flags },
- ^
- /usr/include/php5/Zend/zend_API.h:77:38: note: in expansion of macro 'ZEND_FENTRY'
- #define ZEND_FE(name, arg_info) ZEND_FENTRY(name, ZEND_FN(name), arg_info, 0)
- ^
- /usr/include/php5/main/php.h:350:18: note: in expansion of macro 'ZEND_FE'
- #define PHP_FE ZEND_FE
- ^
- /opt/install/paradox-1.4.3/paradox.c:57:2: note: in expansion of macro 'PHP_FE'
- PHP_FE(px_numrecords, NULL)
- ^
- /usr/include/php5/Zend/zend_API.h:71:129: warning: (near initialization for 'paradox_functions[5]') [enabled by default]
- #define ZEND_FENTRY(zend_name, name, arg_info, flags) { #zend_name, name, arg_info, (zend_uint) (sizeof(arg_info)/sizeof(struct _zend_arg_info)-1), flags },
- ^
- /usr/include/php5/Zend/zend_API.h:77:38: note: in expansion of macro 'ZEND_FENTRY'
- #define ZEND_FE(name, arg_info) ZEND_FENTRY(name, ZEND_FN(name), arg_info, 0)
- ^
- /usr/include/php5/main/php.h:350:18: note: in expansion of macro 'ZEND_FE'
- #define PHP_FE ZEND_FE
- ^
- /opt/install/paradox-1.4.3/paradox.c:57:2: note: in expansion of macro 'PHP_FE'
- PHP_FE(px_numrecords, NULL)
- ^
- /opt/install/paradox-1.4.3/paradox.c:58:2: warning: braces around scalar initializer [enabled by default]
- PHP_FE(px_numfields, NULL)
- ^
- /opt/install/paradox-1.4.3/paradox.c:58:2: warning: (near initialization for 'paradox_functions[6]') [enabled by default]
- /opt/install/paradox-1.4.3/paradox.c:58:2: warning: initialization makes integer from pointer without a cast [enabled by default]
- /opt/install/paradox-1.4.3/paradox.c:58:2: warning: (near initialization for 'paradox_functions[6]') [enabled by default]
- /opt/install/paradox-1.4.3/paradox.c:58:2: error: initializer element is not computable at load time
- /opt/install/paradox-1.4.3/paradox.c:58:2: error: (near initialization for 'paradox_functions[6]')
- /opt/install/paradox-1.4.3/paradox.c:58:2: warning: excess elements in scalar initializer [enabled by default]
- /opt/install/paradox-1.4.3/paradox.c:58:2: warning: (near initialization for 'paradox_functions[6]') [enabled by default]
- /opt/install/paradox-1.4.3/paradox.c:58:2: warning: excess elements in scalar initializer [enabled by default]
- /opt/install/paradox-1.4.3/paradox.c:58:2: warning: (near initialization for 'paradox_functions[6]') [enabled by default]
- In file included from /usr/include/php5/main/php.h:39:0,
- from /opt/install/paradox-1.4.3/paradox.c:25:
- /usr/include/php5/Zend/zend_API.h:71:129: warning: excess elements in scalar initializer [enabled by default]
- #define ZEND_FENTRY(zend_name, name, arg_info, flags) { #zend_name, name, arg_info, (zend_uint) (sizeof(arg_info)/sizeof(struct _zend_arg_info)-1), flags },
- ^
- /usr/include/php5/Zend/zend_API.h:77:38: note: in expansion of macro 'ZEND_FENTRY'
- #define ZEND_FE(name, arg_info) ZEND_FENTRY(name, ZEND_FN(name), arg_info, 0)
- ^
- /usr/include/php5/main/php.h:350:18: note: in expansion of macro 'ZEND_FE'
- #define PHP_FE ZEND_FE
- ^
- /opt/install/paradox-1.4.3/paradox.c:58:2: note: in expansion of macro 'PHP_FE'
- PHP_FE(px_numfields, NULL)
- ^
- /usr/include/php5/Zend/zend_API.h:71:129: warning: (near initialization for 'paradox_functions[6]') [enabled by default]
- #define ZEND_FENTRY(zend_name, name, arg_info, flags) { #zend_name, name, arg_info, (zend_uint) (sizeof(arg_info)/sizeof(struct _zend_arg_info)-1), flags },
- ^
- /usr/include/php5/Zend/zend_API.h:77:38: note: in expansion of macro 'ZEND_FENTRY'
- #define ZEND_FE(name, arg_info) ZEND_FENTRY(name, ZEND_FN(name), arg_info, 0)
- ^
- /usr/include/php5/main/php.h:350:18: note: in expansion of macro 'ZEND_FE'
- #define PHP_FE ZEND_FE
- ^
- /opt/install/paradox-1.4.3/paradox.c:58:2: note: in expansion of macro 'PHP_FE'
- PHP_FE(px_numfields, NULL)
- ^
- /usr/include/php5/Zend/zend_API.h:71:129: warning: excess elements in scalar initializer [enabled by default]
- #define ZEND_FENTRY(zend_name, name, arg_info, flags) { #zend_name, name, arg_info, (zend_uint) (sizeof(arg_info)/sizeof(struct _zend_arg_info)-1), flags },
- ^
- /usr/include/php5/Zend/zend_API.h:77:38: note: in expansion of macro 'ZEND_FENTRY'
- #define ZEND_FE(name, arg_info) ZEND_FENTRY(name, ZEND_FN(name), arg_info, 0)
- ^
- /usr/include/php5/main/php.h:350:18: note: in expansion of macro 'ZEND_FE'
- #define PHP_FE ZEND_FE
- ^
- /opt/install/paradox-1.4.3/paradox.c:58:2: note: in expansion of macro 'PHP_FE'
- PHP_FE(px_numfields, NULL)
- ^
- /usr/include/php5/Zend/zend_API.h:71:129: warning: (near initialization for 'paradox_functions[6]') [enabled by default]
- #define ZEND_FENTRY(zend_name, name, arg_info, flags) { #zend_name, name, arg_info, (zend_uint) (sizeof(arg_info)/sizeof(struct _zend_arg_info)-1), flags },
- ^
- /usr/include/php5/Zend/zend_API.h:77:38: note: in expansion of macro 'ZEND_FENTRY'
- #define ZEND_FE(name, arg_info) ZEND_FENTRY(name, ZEND_FN(name), arg_info, 0)
- ^
- /usr/include/php5/main/php.h:350:18: note: in expansion of macro 'ZEND_FE'
- #define PHP_FE ZEND_FE
- ^
- /opt/install/paradox-1.4.3/paradox.c:58:2: note: in expansion of macro 'PHP_FE'
- PHP_FE(px_numfields, NULL)
- ^
- /opt/install/paradox-1.4.3/paradox.c:59:2: warning: braces around scalar initializer [enabled by default]
- PHP_FE(px_get_record, NULL)
- ^
- /opt/install/paradox-1.4.3/paradox.c:59:2: warning: (near initialization for 'paradox_functions[7]') [enabled by default]
- /opt/install/paradox-1.4.3/paradox.c:59:2: warning: initialization makes integer from pointer without a cast [enabled by default]
- /opt/install/paradox-1.4.3/paradox.c:59:2: warning: (near initialization for 'paradox_functions[7]') [enabled by default]
- /opt/install/paradox-1.4.3/paradox.c:59:2: error: initializer element is not computable at load time
- /opt/install/paradox-1.4.3/paradox.c:59:2: error: (near initialization for 'paradox_functions[7]')
- /opt/install/paradox-1.4.3/paradox.c:59:2: warning: excess elements in scalar initializer [enabled by default]
- /opt/install/paradox-1.4.3/paradox.c:59:2: warning: (near initialization for 'paradox_functions[7]') [enabled by default]
- /opt/install/paradox-1.4.3/paradox.c:59:2: warning: excess elements in scalar initializer [enabled by default]
- /opt/install/paradox-1.4.3/paradox.c:59:2: warning: (near initialization for 'paradox_functions[7]') [enabled by default]
- In file included from /usr/include/php5/main/php.h:39:0,
- from /opt/install/paradox-1.4.3/paradox.c:25:
- /usr/include/php5/Zend/zend_API.h:71:129: warning: excess elements in scalar initializer [enabled by default]
- #define ZEND_FENTRY(zend_name, name, arg_info, flags) { #zend_name, name, arg_info, (zend_uint) (sizeof(arg_info)/sizeof(struct _zend_arg_info)-1), flags },
- ^
- /usr/include/php5/Zend/zend_API.h:77:38: note: in expansion of macro 'ZEND_FENTRY'
- #define ZEND_FE(name, arg_info) ZEND_FENTRY(name, ZEND_FN(name), arg_info, 0)
- ^
- /usr/include/php5/main/php.h:350:18: note: in expansion of macro 'ZEND_FE'
- #define PHP_FE ZEND_FE
- ^
- /opt/install/paradox-1.4.3/paradox.c:59:2: note: in expansion of macro 'PHP_FE'
- PHP_FE(px_get_record, NULL)
- ^
- /usr/include/php5/Zend/zend_API.h:71:129: warning: (near initialization for 'paradox_functions[7]') [enabled by default]
- #define ZEND_FENTRY(zend_name, name, arg_info, flags) { #zend_name, name, arg_info, (zend_uint) (sizeof(arg_info)/sizeof(struct _zend_arg_info)-1), flags },
- ^
- /usr/include/php5/Zend/zend_API.h:77:38: note: in expansion of macro 'ZEND_FENTRY'
- #define ZEND_FE(name, arg_info) ZEND_FENTRY(name, ZEND_FN(name), arg_info, 0)
- ^
- /usr/include/php5/main/php.h:350:18: note: in expansion of macro 'ZEND_FE'
- #define PHP_FE ZEND_FE
- ^
- /opt/install/paradox-1.4.3/paradox.c:59:2: note: in expansion of macro 'PHP_FE'
- PHP_FE(px_get_record, NULL)
- ^
- /usr/include/php5/Zend/zend_API.h:71:129: warning: excess elements in scalar initializer [enabled by default]
- #define ZEND_FENTRY(zend_name, name, arg_info, flags) { #zend_name, name, arg_info, (zend_uint) (sizeof(arg_info)/sizeof(struct _zend_arg_info)-1), flags },
- ^
- /usr/include/php5/Zend/zend_API.h:77:38: note: in expansion of macro 'ZEND_FENTRY'
- #define ZEND_FE(name, arg_info) ZEND_FENTRY(name, ZEND_FN(name), arg_info, 0)
- ^
- /usr/include/php5/main/php.h:350:18: note: in expansion of macro 'ZEND_FE'
- #define PHP_FE ZEND_FE
- ^
- /opt/install/paradox-1.4.3/paradox.c:59:2: note: in expansion of macro 'PHP_FE'
- PHP_FE(px_get_record, NULL)
- ^
- /usr/include/php5/Zend/zend_API.h:71:129: warning: (near initialization for 'paradox_functions[7]') [enabled by default]
- #define ZEND_FENTRY(zend_name, name, arg_info, flags) { #zend_name, name, arg_info, (zend_uint) (sizeof(arg_info)/sizeof(struct _zend_arg_info)-1), flags },
- ^
- /usr/include/php5/Zend/zend_API.h:77:38: note: in expansion of macro 'ZEND_FENTRY'
- #define ZEND_FE(name, arg_info) ZEND_FENTRY(name, ZEND_FN(name), arg_info, 0)
- ^
- /usr/include/php5/main/php.h:350:18: note: in expansion of macro 'ZEND_FE'
- #define PHP_FE ZEND_FE
- ^
- /opt/install/paradox-1.4.3/paradox.c:59:2: note: in expansion of macro 'PHP_FE'
- PHP_FE(px_get_record, NULL)
- ^
- /opt/install/paradox-1.4.3/paradox.c:60:2: warning: braces around scalar initializer [enabled by default]
- PHP_FE(px_put_record, NULL)
- ^
- /opt/install/paradox-1.4.3/paradox.c:60:2: warning: (near initialization for 'paradox_functions[8]') [enabled by default]
- /opt/install/paradox-1.4.3/paradox.c:60:2: warning: initialization makes integer from pointer without a cast [enabled by default]
- /opt/install/paradox-1.4.3/paradox.c:60:2: warning: (near initialization for 'paradox_functions[8]') [enabled by default]
- /opt/install/paradox-1.4.3/paradox.c:60:2: error: initializer element is not computable at load time
- /opt/install/paradox-1.4.3/paradox.c:60:2: error: (near initialization for 'paradox_functions[8]')
- /opt/install/paradox-1.4.3/paradox.c:60:2: warning: excess elements in scalar initializer [enabled by default]
- /opt/install/paradox-1.4.3/paradox.c:60:2: warning: (near initialization for 'paradox_functions[8]') [enabled by default]
- /opt/install/paradox-1.4.3/paradox.c:60:2: warning: excess elements in scalar initializer [enabled by default]
- /opt/install/paradox-1.4.3/paradox.c:60:2: warning: (near initialization for 'paradox_functions[8]') [enabled by default]
- In file included from /usr/include/php5/main/php.h:39:0,
- from /opt/install/paradox-1.4.3/paradox.c:25:
- /usr/include/php5/Zend/zend_API.h:71:129: warning: excess elements in scalar initializer [enabled by default]
- #define ZEND_FENTRY(zend_name, name, arg_info, flags) { #zend_name, name, arg_info, (zend_uint) (sizeof(arg_info)/sizeof(struct _zend_arg_info)-1), flags },
- ^
- /usr/include/php5/Zend/zend_API.h:77:38: note: in expansion of macro 'ZEND_FENTRY'
- #define ZEND_FE(name, arg_info) ZEND_FENTRY(name, ZEND_FN(name), arg_info, 0)
- ^
- /usr/include/php5/main/php.h:350:18: note: in expansion of macro 'ZEND_FE'
- #define PHP_FE ZEND_FE
- ^
- /opt/install/paradox-1.4.3/paradox.c:60:2: note: in expansion of macro 'PHP_FE'
- PHP_FE(px_put_record, NULL)
- ^
- /usr/include/php5/Zend/zend_API.h:71:129: warning: (near initialization for 'paradox_functions[8]') [enabled by default]
- #define ZEND_FENTRY(zend_name, name, arg_info, flags) { #zend_name, name, arg_info, (zend_uint) (sizeof(arg_info)/sizeof(struct _zend_arg_info)-1), flags },
- ^
- /usr/include/php5/Zend/zend_API.h:77:38: note: in expansion of macro 'ZEND_FENTRY'
- #define ZEND_FE(name, arg_info) ZEND_FENTRY(name, ZEND_FN(name), arg_info, 0)
- ^
- /usr/include/php5/main/php.h:350:18: note: in expansion of macro 'ZEND_FE'
- #define PHP_FE ZEND_FE
- ^
- /opt/install/paradox-1.4.3/paradox.c:60:2: note: in expansion of macro 'PHP_FE'
- PHP_FE(px_put_record, NULL)
- ^
- /usr/include/php5/Zend/zend_API.h:71:129: warning: excess elements in scalar initializer [enabled by default]
- #define ZEND_FENTRY(zend_name, name, arg_info, flags) { #zend_name, name, arg_info, (zend_uint) (sizeof(arg_info)/sizeof(struct _zend_arg_info)-1), flags },
- ^
- /usr/include/php5/Zend/zend_API.h:77:38: note: in expansion of macro 'ZEND_FENTRY'
- #define ZEND_FE(name, arg_info) ZEND_FENTRY(name, ZEND_FN(name), arg_info, 0)
- ^
- /usr/include/php5/main/php.h:350:18: note: in expansion of macro 'ZEND_FE'
- #define PHP_FE ZEND_FE
- ^
- /opt/install/paradox-1.4.3/paradox.c:60:2: note: in expansion of macro 'PHP_FE'
- PHP_FE(px_put_record, NULL)
- ^
- /usr/include/php5/Zend/zend_API.h:71:129: warning: (near initialization for 'paradox_functions[8]') [enabled by default]
- #define ZEND_FENTRY(zend_name, name, arg_info, flags) { #zend_name, name, arg_info, (zend_uint) (sizeof(arg_info)/sizeof(struct _zend_arg_info)-1), flags },
- ^
- /usr/include/php5/Zend/zend_API.h:77:38: note: in expansion of macro 'ZEND_FENTRY'
- #define ZEND_FE(name, arg_info) ZEND_FENTRY(name, ZEND_FN(name), arg_info, 0)
- ^
- /usr/include/php5/main/php.h:350:18: note: in expansion of macro 'ZEND_FE'
- #define PHP_FE ZEND_FE
- ^
- /opt/install/paradox-1.4.3/paradox.c:60:2: note: in expansion of macro 'PHP_FE'
- PHP_FE(px_put_record, NULL)
- ^
- /opt/install/paradox-1.4.3/paradox.c:62:2: warning: braces around scalar initializer [enabled by default]
- PHP_FE(px_delete_record, NULL)
- ^
- /opt/install/paradox-1.4.3/paradox.c:62:2: warning: (near initialization for 'paradox_functions[9]') [enabled by default]
- /opt/install/paradox-1.4.3/paradox.c:62:2: warning: initialization makes integer from pointer without a cast [enabled by default]
- /opt/install/paradox-1.4.3/paradox.c:62:2: warning: (near initialization for 'paradox_functions[9]') [enabled by default]
- /opt/install/paradox-1.4.3/paradox.c:62:2: error: initializer element is not computable at load time
- /opt/install/paradox-1.4.3/paradox.c:62:2: error: (near initialization for 'paradox_functions[9]')
- /opt/install/paradox-1.4.3/paradox.c:62:2: warning: excess elements in scalar initializer [enabled by default]
- /opt/install/paradox-1.4.3/paradox.c:62:2: warning: (near initialization for 'paradox_functions[9]') [enabled by default]
- /opt/install/paradox-1.4.3/paradox.c:62:2: warning: excess elements in scalar initializer [enabled by default]
- /opt/install/paradox-1.4.3/paradox.c:62:2: warning: (near initialization for 'paradox_functions[9]') [enabled by default]
- In file included from /usr/include/php5/main/php.h:39:0,
- from /opt/install/paradox-1.4.3/paradox.c:25:
- /usr/include/php5/Zend/zend_API.h:71:129: warning: excess elements in scalar initializer [enabled by default]
- #define ZEND_FENTRY(zend_name, name, arg_info, flags) { #zend_name, name, arg_info, (zend_uint) (sizeof(arg_info)/sizeof(struct _zend_arg_info)-1), flags },
- ^
- /usr/include/php5/Zend/zend_API.h:77:38: note: in expansion of macro 'ZEND_FENTRY'
- #define ZEND_FE(name, arg_info) ZEND_FENTRY(name, ZEND_FN(name), arg_info, 0)
- ^
- /usr/include/php5/main/php.h:350:18: note: in expansion of macro 'ZEND_FE'
- #define PHP_FE ZEND_FE
- ^
- /opt/install/paradox-1.4.3/paradox.c:62:2: note: in expansion of macro 'PHP_FE'
- PHP_FE(px_delete_record, NULL)
- ^
- /usr/include/php5/Zend/zend_API.h:71:129: warning: (near initialization for 'paradox_functions[9]') [enabled by default]
- #define ZEND_FENTRY(zend_name, name, arg_info, flags) { #zend_name, name, arg_info, (zend_uint) (sizeof(arg_info)/sizeof(struct _zend_arg_info)-1), flags },
- ^
- /usr/include/php5/Zend/zend_API.h:77:38: note: in expansion of macro 'ZEND_FENTRY'
- #define ZEND_FE(name, arg_info) ZEND_FENTRY(name, ZEND_FN(name), arg_info, 0)
- ^
- /usr/include/php5/main/php.h:350:18: note: in expansion of macro 'ZEND_FE'
- #define PHP_FE ZEND_FE
- ^
- /opt/install/paradox-1.4.3/paradox.c:62:2: note: in expansion of macro 'PHP_FE'
- PHP_FE(px_delete_record, NULL)
- ^
- /usr/include/php5/Zend/zend_API.h:71:129: warning: excess elements in scalar initializer [enabled by default]
- #define ZEND_FENTRY(zend_name, name, arg_info, flags) { #zend_name, name, arg_info, (zend_uint) (sizeof(arg_info)/sizeof(struct _zend_arg_info)-1), flags },
- ^
- /usr/include/php5/Zend/zend_API.h:77:38: note: in expansion of macro 'ZEND_FENTRY'
- #define ZEND_FE(name, arg_info) ZEND_FENTRY(name, ZEND_FN(name), arg_info, 0)
- ^
- /usr/include/php5/main/php.h:350:18: note: in expansion of macro 'ZEND_FE'
- #define PHP_FE ZEND_FE
- ^
- /opt/install/paradox-1.4.3/paradox.c:62:2: note: in expansion of macro 'PHP_FE'
- PHP_FE(px_delete_record, NULL)
- ^
- /usr/include/php5/Zend/zend_API.h:71:129: warning: (near initialization for 'paradox_functions[9]') [enabled by default]
- #define ZEND_FENTRY(zend_name, name, arg_info, flags) { #zend_name, name, arg_info, (zend_uint) (sizeof(arg_info)/sizeof(struct _zend_arg_info)-1), flags },
- ^
- /usr/include/php5/Zend/zend_API.h:77:38: note: in expansion of macro 'ZEND_FENTRY'
- #define ZEND_FE(name, arg_info) ZEND_FENTRY(name, ZEND_FN(name), arg_info, 0)
- ^
- /usr/include/php5/main/php.h:350:18: note: in expansion of macro 'ZEND_FE'
- #define PHP_FE ZEND_FE
- ^
- /opt/install/paradox-1.4.3/paradox.c:62:2: note: in expansion of macro 'PHP_FE'
- PHP_FE(px_delete_record, NULL)
- ^
- /opt/install/paradox-1.4.3/paradox.c:65:2: warning: braces around scalar initializer [enabled by default]
- PHP_FE(px_insert_record, NULL)
- ^
- /opt/install/paradox-1.4.3/paradox.c:65:2: warning: (near initialization for 'paradox_functions[10]') [enabled by default]
- /opt/install/paradox-1.4.3/paradox.c:65:2: warning: initialization makes integer from pointer without a cast [enabled by default]
- /opt/install/paradox-1.4.3/paradox.c:65:2: warning: (near initialization for 'paradox_functions[10]') [enabled by default]
- /opt/install/paradox-1.4.3/paradox.c:65:2: error: initializer element is not computable at load time
- /opt/install/paradox-1.4.3/paradox.c:65:2: error: (near initialization for 'paradox_functions[10]')
- /opt/install/paradox-1.4.3/paradox.c:65:2: warning: excess elements in scalar initializer [enabled by default]
- /opt/install/paradox-1.4.3/paradox.c:65:2: warning: (near initialization for 'paradox_functions[10]') [enabled by default]
- /opt/install/paradox-1.4.3/paradox.c:65:2: warning: excess elements in scalar initializer [enabled by default]
- /opt/install/paradox-1.4.3/paradox.c:65:2: warning: (near initialization for 'paradox_functions[10]') [enabled by default]
- In file included from /usr/include/php5/main/php.h:39:0,
- from /opt/install/paradox-1.4.3/paradox.c:25:
- /usr/include/php5/Zend/zend_API.h:71:129: warning: excess elements in scalar initializer [enabled by default]
- #define ZEND_FENTRY(zend_name, name, arg_info, flags) { #zend_name, name, arg_info, (zend_uint) (sizeof(arg_info)/sizeof(struct _zend_arg_info)-1), flags },
- ^
- /usr/include/php5/Zend/zend_API.h:77:38: note: in expansion of macro 'ZEND_FENTRY'
- #define ZEND_FE(name, arg_info) ZEND_FENTRY(name, ZEND_FN(name), arg_info, 0)
- ^
- /usr/include/php5/main/php.h:350:18: note: in expansion of macro 'ZEND_FE'
- #define PHP_FE ZEND_FE
- ^
- /opt/install/paradox-1.4.3/paradox.c:65:2: note: in expansion of macro 'PHP_FE'
- PHP_FE(px_insert_record, NULL)
- ^
- /usr/include/php5/Zend/zend_API.h:71:129: warning: (near initialization for 'paradox_functions[10]') [enabled by default]
- #define ZEND_FENTRY(zend_name, name, arg_info, flags) { #zend_name, name, arg_info, (zend_uint) (sizeof(arg_info)/sizeof(struct _zend_arg_info)-1), flags },
- ^
- /usr/include/php5/Zend/zend_API.h:77:38: note: in expansion of macro 'ZEND_FENTRY'
- #define ZEND_FE(name, arg_info) ZEND_FENTRY(name, ZEND_FN(name), arg_info, 0)
- ^
- /usr/include/php5/main/php.h:350:18: note: in expansion of macro 'ZEND_FE'
- #define PHP_FE ZEND_FE
- ^
- /opt/install/paradox-1.4.3/paradox.c:65:2: note: in expansion of macro 'PHP_FE'
- PHP_FE(px_insert_record, NULL)
- ^
- /usr/include/php5/Zend/zend_API.h:71:129: warning: excess elements in scalar initializer [enabled by default]
- #define ZEND_FENTRY(zend_name, name, arg_info, flags) { #zend_name, name, arg_info, (zend_uint) (sizeof(arg_info)/sizeof(struct _zend_arg_info)-1), flags },
- ^
- /usr/include/php5/Zend/zend_API.h:77:38: note: in expansion of macro 'ZEND_FENTRY'
- #define ZEND_FE(name, arg_info) ZEND_FENTRY(name, ZEND_FN(name), arg_info, 0)
- ^
- /usr/include/php5/main/php.h:350:18: note: in expansion of macro 'ZEND_FE'
- #define PHP_FE ZEND_FE
- ^
- /opt/install/paradox-1.4.3/paradox.c:65:2: note: in expansion of macro 'PHP_FE'
- PHP_FE(px_insert_record, NULL)
- ^
- /usr/include/php5/Zend/zend_API.h:71:129: warning: (near initialization for 'paradox_functions[10]') [enabled by default]
- #define ZEND_FENTRY(zend_name, name, arg_info, flags) { #zend_name, name, arg_info, (zend_uint) (sizeof(arg_info)/sizeof(struct _zend_arg_info)-1), flags },
- ^
- /usr/include/php5/Zend/zend_API.h:77:38: note: in expansion of macro 'ZEND_FENTRY'
- #define ZEND_FE(name, arg_info) ZEND_FENTRY(name, ZEND_FN(name), arg_info, 0)
- ^
- /usr/include/php5/main/php.h:350:18: note: in expansion of macro 'ZEND_FE'
- #define PHP_FE ZEND_FE
- ^
- /opt/install/paradox-1.4.3/paradox.c:65:2: note: in expansion of macro 'PHP_FE'
- PHP_FE(px_insert_record, NULL)
- ^
- /opt/install/paradox-1.4.3/paradox.c:68:2: warning: braces around scalar initializer [enabled by default]
- PHP_FE(px_update_record, NULL)
- ^
- /opt/install/paradox-1.4.3/paradox.c:68:2: warning: (near initialization for 'paradox_functions[11]') [enabled by default]
- /opt/install/paradox-1.4.3/paradox.c:68:2: warning: initialization makes integer from pointer without a cast [enabled by default]
- /opt/install/paradox-1.4.3/paradox.c:68:2: warning: (near initialization for 'paradox_functions[11]') [enabled by default]
- /opt/install/paradox-1.4.3/paradox.c:68:2: error: initializer element is not computable at load time
- /opt/install/paradox-1.4.3/paradox.c:68:2: error: (near initialization for 'paradox_functions[11]')
- /opt/install/paradox-1.4.3/paradox.c:68:2: warning: excess elements in scalar initializer [enabled by default]
- /opt/install/paradox-1.4.3/paradox.c:68:2: warning: (near initialization for 'paradox_functions[11]') [enabled by default]
- /opt/install/paradox-1.4.3/paradox.c:68:2: warning: excess elements in scalar initializer [enabled by default]
- /opt/install/paradox-1.4.3/paradox.c:68:2: warning: (near initialization for 'paradox_functions[11]') [enabled by default]
- In file included from /usr/include/php5/main/php.h:39:0,
- from /opt/install/paradox-1.4.3/paradox.c:25:
- /usr/include/php5/Zend/zend_API.h:71:129: warning: excess elements in scalar initializer [enabled by default]
- #define ZEND_FENTRY(zend_name, name, arg_info, flags) { #zend_name, name, arg_info, (zend_uint) (sizeof(arg_info)/sizeof(struct _zend_arg_info)-1), flags },
- ^
- /usr/include/php5/Zend/zend_API.h:77:38: note: in expansion of macro 'ZEND_FENTRY'
- #define ZEND_FE(name, arg_info) ZEND_FENTRY(name, ZEND_FN(name), arg_info, 0)
- ^
- /usr/include/php5/main/php.h:350:18: note: in expansion of macro 'ZEND_FE'
- #define PHP_FE ZEND_FE
- ^
- /opt/install/paradox-1.4.3/paradox.c:68:2: note: in expansion of macro 'PHP_FE'
- PHP_FE(px_update_record, NULL)
- ^
- /usr/include/php5/Zend/zend_API.h:71:129: warning: (near initialization for 'paradox_functions[11]') [enabled by default]
- #define ZEND_FENTRY(zend_name, name, arg_info, flags) { #zend_name, name, arg_info, (zend_uint) (sizeof(arg_info)/sizeof(struct _zend_arg_info)-1), flags },
- ^
- /usr/include/php5/Zend/zend_API.h:77:38: note: in expansion of macro 'ZEND_FENTRY'
- #define ZEND_FE(name, arg_info) ZEND_FENTRY(name, ZEND_FN(name), arg_info, 0)
- ^
- /usr/include/php5/main/php.h:350:18: note: in expansion of macro 'ZEND_FE'
- #define PHP_FE ZEND_FE
- ^
- /opt/install/paradox-1.4.3/paradox.c:68:2: note: in expansion of macro 'PHP_FE'
- PHP_FE(px_update_record, NULL)
- ^
- /usr/include/php5/Zend/zend_API.h:71:129: warning: excess elements in scalar initializer [enabled by default]
- #define ZEND_FENTRY(zend_name, name, arg_info, flags) { #zend_name, name, arg_info, (zend_uint) (sizeof(arg_info)/sizeof(struct _zend_arg_info)-1), flags },
- ^
- /usr/include/php5/Zend/zend_API.h:77:38: note: in expansion of macro 'ZEND_FENTRY'
- #define ZEND_FE(name, arg_info) ZEND_FENTRY(name, ZEND_FN(name), arg_info, 0)
- ^
- /usr/include/php5/main/php.h:350:18: note: in expansion of macro 'ZEND_FE'
- #define PHP_FE ZEND_FE
- ^
- /opt/install/paradox-1.4.3/paradox.c:68:2: note: in expansion of macro 'PHP_FE'
- PHP_FE(px_update_record, NULL)
- ^
- /usr/include/php5/Zend/zend_API.h:71:129: warning: (near initialization for 'paradox_functions[11]') [enabled by default]
- #define ZEND_FENTRY(zend_name, name, arg_info, flags) { #zend_name, name, arg_info, (zend_uint) (sizeof(arg_info)/sizeof(struct _zend_arg_info)-1), flags },
- ^
- /usr/include/php5/Zend/zend_API.h:77:38: note: in expansion of macro 'ZEND_FENTRY'
- #define ZEND_FE(name, arg_info) ZEND_FENTRY(name, ZEND_FN(name), arg_info, 0)
- ^
- /usr/include/php5/main/php.h:350:18: note: in expansion of macro 'ZEND_FE'
- #define PHP_FE ZEND_FE
- ^
- /opt/install/paradox-1.4.3/paradox.c:68:2: note: in expansion of macro 'PHP_FE'
- PHP_FE(px_update_record, NULL)
- ^
- /opt/install/paradox-1.4.3/paradox.c:71:2: warning: braces around scalar initializer [enabled by default]
- PHP_FE(px_retrieve_record, NULL)
- ^
- /opt/install/paradox-1.4.3/paradox.c:71:2: warning: (near initialization for 'paradox_functions[12]') [enabled by default]
- /opt/install/paradox-1.4.3/paradox.c:71:2: warning: initialization makes integer from pointer without a cast [enabled by default]
- /opt/install/paradox-1.4.3/paradox.c:71:2: warning: (near initialization for 'paradox_functions[12]') [enabled by default]
- /opt/install/paradox-1.4.3/paradox.c:71:2: error: initializer element is not computable at load time
- /opt/install/paradox-1.4.3/paradox.c:71:2: error: (near initialization for 'paradox_functions[12]')
- /opt/install/paradox-1.4.3/paradox.c:71:2: warning: excess elements in scalar initializer [enabled by default]
- /opt/install/paradox-1.4.3/paradox.c:71:2: warning: (near initialization for 'paradox_functions[12]') [enabled by default]
- /opt/install/paradox-1.4.3/paradox.c:71:2: warning: excess elements in scalar initializer [enabled by default]
- /opt/install/paradox-1.4.3/paradox.c:71:2: warning: (near initialization for 'paradox_functions[12]') [enabled by default]
- In file included from /usr/include/php5/main/php.h:39:0,
- from /opt/install/paradox-1.4.3/paradox.c:25:
- /usr/include/php5/Zend/zend_API.h:71:129: warning: excess elements in scalar initializer [enabled by default]
- #define ZEND_FENTRY(zend_name, name, arg_info, flags) { #zend_name, name, arg_info, (zend_uint) (sizeof(arg_info)/sizeof(struct _zend_arg_info)-1), flags },
- ^
- /usr/include/php5/Zend/zend_API.h:77:38: note: in expansion of macro 'ZEND_FENTRY'
- #define ZEND_FE(name, arg_info) ZEND_FENTRY(name, ZEND_FN(name), arg_info, 0)
- ^
- /usr/include/php5/main/php.h:350:18: note: in expansion of macro 'ZEND_FE'
- #define PHP_FE ZEND_FE
- ^
- /opt/install/paradox-1.4.3/paradox.c:71:2: note: in expansion of macro 'PHP_FE'
- PHP_FE(px_retrieve_record, NULL)
- ^
- /usr/include/php5/Zend/zend_API.h:71:129: warning: (near initialization for 'paradox_functions[12]') [enabled by default]
- #define ZEND_FENTRY(zend_name, name, arg_info, flags) { #zend_name, name, arg_info, (zend_uint) (sizeof(arg_info)/sizeof(struct _zend_arg_info)-1), flags },
- ^
- /usr/include/php5/Zend/zend_API.h:77:38: note: in expansion of macro 'ZEND_FENTRY'
- #define ZEND_FE(name, arg_info) ZEND_FENTRY(name, ZEND_FN(name), arg_info, 0)
- ^
- /usr/include/php5/main/php.h:350:18: note: in expansion of macro 'ZEND_FE'
- #define PHP_FE ZEND_FE
- ^
- /opt/install/paradox-1.4.3/paradox.c:71:2: note: in expansion of macro 'PHP_FE'
- PHP_FE(px_retrieve_record, NULL)
- ^
- /usr/include/php5/Zend/zend_API.h:71:129: warning: excess elements in scalar initializer [enabled by default]
- #define ZEND_FENTRY(zend_name, name, arg_info, flags) { #zend_name, name, arg_info, (zend_uint) (sizeof(arg_info)/sizeof(struct _zend_arg_info)-1), flags },
- ^
- /usr/include/php5/Zend/zend_API.h:77:38: note: in expansion of macro 'ZEND_FENTRY'
- #define ZEND_FE(name, arg_info) ZEND_FENTRY(name, ZEND_FN(name), arg_info, 0)
- ^
- /usr/include/php5/main/php.h:350:18: note: in expansion of macro 'ZEND_FE'
- #define PHP_FE ZEND_FE
- ^
- /opt/install/paradox-1.4.3/paradox.c:71:2: note: in expansion of macro 'PHP_FE'
- PHP_FE(px_retrieve_record, NULL)
- ^
- /usr/include/php5/Zend/zend_API.h:71:129: warning: (near initialization for 'paradox_functions[12]') [enabled by default]
- #define ZEND_FENTRY(zend_name, name, arg_info, flags) { #zend_name, name, arg_info, (zend_uint) (sizeof(arg_info)/sizeof(struct _zend_arg_info)-1), flags },
- ^
- /usr/include/php5/Zend/zend_API.h:77:38: note: in expansion of macro 'ZEND_FENTRY'
- #define ZEND_FE(name, arg_info) ZEND_FENTRY(name, ZEND_FN(name), arg_info, 0)
- ^
- /usr/include/php5/main/php.h:350:18: note: in expansion of macro 'ZEND_FE'
- #define PHP_FE ZEND_FE
- ^
- /opt/install/paradox-1.4.3/paradox.c:71:2: note: in expansion of macro 'PHP_FE'
- PHP_FE(px_retrieve_record, NULL)
- ^
- /opt/install/paradox-1.4.3/paradox.c:74:2: warning: braces around scalar initializer [enabled by default]
- PHP_FE(px_pack, NULL)
- ^
- /opt/install/paradox-1.4.3/paradox.c:74:2: warning: (near initialization for 'paradox_functions[13]') [enabled by default]
- /opt/install/paradox-1.4.3/paradox.c:74:2: warning: initialization makes integer from pointer without a cast [enabled by default]
- /opt/install/paradox-1.4.3/paradox.c:74:2: warning: (near initialization for 'paradox_functions[13]') [enabled by default]
- /opt/install/paradox-1.4.3/paradox.c:74:2: error: initializer element is not computable at load time
- /opt/install/paradox-1.4.3/paradox.c:74:2: error: (near initialization for 'paradox_functions[13]')
- /opt/install/paradox-1.4.3/paradox.c:74:2: warning: excess elements in scalar initializer [enabled by default]
- /opt/install/paradox-1.4.3/paradox.c:74:2: warning: (near initialization for 'paradox_functions[13]') [enabled by default]
- /opt/install/paradox-1.4.3/paradox.c:74:2: warning: excess elements in scalar initializer [enabled by default]
- /opt/install/paradox-1.4.3/paradox.c:74:2: warning: (near initialization for 'paradox_functions[13]') [enabled by default]
- In file included from /usr/include/php5/main/php.h:39:0,
- from /opt/install/paradox-1.4.3/paradox.c:25:
- /usr/include/php5/Zend/zend_API.h:71:129: warning: excess elements in scalar initializer [enabled by default]
- #define ZEND_FENTRY(zend_name, name, arg_info, flags) { #zend_name, name, arg_info, (zend_uint) (sizeof(arg_info)/sizeof(struct _zend_arg_info)-1), flags },
- ^
- /usr/include/php5/Zend/zend_API.h:77:38: note: in expansion of macro 'ZEND_FENTRY'
- #define ZEND_FE(name, arg_info) ZEND_FENTRY(name, ZEND_FN(name), arg_info, 0)
- ^
- /usr/include/php5/main/php.h:350:18: note: in expansion of macro 'ZEND_FE'
- #define PHP_FE ZEND_FE
- ^
- /opt/install/paradox-1.4.3/paradox.c:74:2: note: in expansion of macro 'PHP_FE'
- PHP_FE(px_pack, NULL)
- ^
- /usr/include/php5/Zend/zend_API.h:71:129: warning: (near initialization for 'paradox_functions[13]') [enabled by default]
- #define ZEND_FENTRY(zend_name, name, arg_info, flags) { #zend_name, name, arg_info, (zend_uint) (sizeof(arg_info)/sizeof(struct _zend_arg_info)-1), flags },
- ^
- /usr/include/php5/Zend/zend_API.h:77:38: note: in expansion of macro 'ZEND_FENTRY'
- #define ZEND_FE(name, arg_info) ZEND_FENTRY(name, ZEND_FN(name), arg_info, 0)
- ^
- /usr/include/php5/main/php.h:350:18: note: in expansion of macro 'ZEND_FE'
- #define PHP_FE ZEND_FE
- ^
- /opt/install/paradox-1.4.3/paradox.c:74:2: note: in expansion of macro 'PHP_FE'
- PHP_FE(px_pack, NULL)
- ^
- /usr/include/php5/Zend/zend_API.h:71:129: warning: excess elements in scalar initializer [enabled by default]
- #define ZEND_FENTRY(zend_name, name, arg_info, flags) { #zend_name, name, arg_info, (zend_uint) (sizeof(arg_info)/sizeof(struct _zend_arg_info)-1), flags },
- ^
- /usr/include/php5/Zend/zend_API.h:77:38: note: in expansion of macro 'ZEND_FENTRY'
- #define ZEND_FE(name, arg_info) ZEND_FENTRY(name, ZEND_FN(name), arg_info, 0)
- ^
- /usr/include/php5/main/php.h:350:18: note: in expansion of macro 'ZEND_FE'
- #define PHP_FE ZEND_FE
- ^
- /opt/install/paradox-1.4.3/paradox.c:74:2: note: in expansion of macro 'PHP_FE'
- PHP_FE(px_pack, NULL)
- ^
- /usr/include/php5/Zend/zend_API.h:71:129: warning: (near initialization for 'paradox_functions[13]') [enabled by default]
- #define ZEND_FENTRY(zend_name, name, arg_info, flags) { #zend_name, name, arg_info, (zend_uint) (sizeof(arg_info)/sizeof(struct _zend_arg_info)-1), flags },
- ^
- /usr/include/php5/Zend/zend_API.h:77:38: note: in expansion of macro 'ZEND_FENTRY'
- #define ZEND_FE(name, arg_info) ZEND_FENTRY(name, ZEND_FN(name), arg_info, 0)
- ^
- /usr/include/php5/main/php.h:350:18: note: in expansion of macro 'ZEND_FE'
- #define PHP_FE ZEND_FE
- ^
- /opt/install/paradox-1.4.3/paradox.c:74:2: note: in expansion of macro 'PHP_FE'
- PHP_FE(px_pack, NULL)
- ^
- /opt/install/paradox-1.4.3/paradox.c:76:2: warning: braces around scalar initializer [enabled by default]
- PHP_FE(px_get_field, NULL)
- ^
- /opt/install/paradox-1.4.3/paradox.c:76:2: warning: (near initialization for 'paradox_functions[14]') [enabled by default]
- /opt/install/paradox-1.4.3/paradox.c:76:2: warning: initialization makes integer from pointer without a cast [enabled by default]
- /opt/install/paradox-1.4.3/paradox.c:76:2: warning: (near initialization for 'paradox_functions[14]') [enabled by default]
- /opt/install/paradox-1.4.3/paradox.c:76:2: error: initializer element is not computable at load time
- /opt/install/paradox-1.4.3/paradox.c:76:2: error: (near initialization for 'paradox_functions[14]')
- /opt/install/paradox-1.4.3/paradox.c:76:2: warning: excess elements in scalar initializer [enabled by default]
- /opt/install/paradox-1.4.3/paradox.c:76:2: warning: (near initialization for 'paradox_functions[14]') [enabled by default]
- /opt/install/paradox-1.4.3/paradox.c:76:2: warning: excess elements in scalar initializer [enabled by default]
- /opt/install/paradox-1.4.3/paradox.c:76:2: warning: (near initialization for 'paradox_functions[14]') [enabled by default]
- In file included from /usr/include/php5/main/php.h:39:0,
- from /opt/install/paradox-1.4.3/paradox.c:25:
- /usr/include/php5/Zend/zend_API.h:71:129: warning: excess elements in scalar initializer [enabled by default]
- #define ZEND_FENTRY(zend_name, name, arg_info, flags) { #zend_name, name, arg_info, (zend_uint) (sizeof(arg_info)/sizeof(struct _zend_arg_info)-1), flags },
- ^
- /usr/include/php5/Zend/zend_API.h:77:38: note: in expansion of macro 'ZEND_FENTRY'
- #define ZEND_FE(name, arg_info) ZEND_FENTRY(name, ZEND_FN(name), arg_info, 0)
- ^
- /usr/include/php5/main/php.h:350:18: note: in expansion of macro 'ZEND_FE'
- #define PHP_FE ZEND_FE
- ^
- /opt/install/paradox-1.4.3/paradox.c:76:2: note: in expansion of macro 'PHP_FE'
- PHP_FE(px_get_field, NULL)
- ^
- /usr/include/php5/Zend/zend_API.h:71:129: warning: (near initialization for 'paradox_functions[14]') [enabled by default]
- #define ZEND_FENTRY(zend_name, name, arg_info, flags) { #zend_name, name, arg_info, (zend_uint) (sizeof(arg_info)/sizeof(struct _zend_arg_info)-1), flags },
- ^
- /usr/include/php5/Zend/zend_API.h:77:38: note: in expansion of macro 'ZEND_FENTRY'
- #define ZEND_FE(name, arg_info) ZEND_FENTRY(name, ZEND_FN(name), arg_info, 0)
- ^
- /usr/include/php5/main/php.h:350:18: note: in expansion of macro 'ZEND_FE'
- #define PHP_FE ZEND_FE
- ^
- /opt/install/paradox-1.4.3/paradox.c:76:2: note: in expansion of macro 'PHP_FE'
- PHP_FE(px_get_field, NULL)
- ^
- /usr/include/php5/Zend/zend_API.h:71:129: warning: excess elements in scalar initializer [enabled by default]
- #define ZEND_FENTRY(zend_name, name, arg_info, flags) { #zend_name, name, arg_info, (zend_uint) (sizeof(arg_info)/sizeof(struct _zend_arg_info)-1), flags },
- ^
- /usr/include/php5/Zend/zend_API.h:77:38: note: in expansion of macro 'ZEND_FENTRY'
- #define ZEND_FE(name, arg_info) ZEND_FENTRY(name, ZEND_FN(name), arg_info, 0)
- ^
- /usr/include/php5/main/php.h:350:18: note: in expansion of macro 'ZEND_FE'
- #define PHP_FE ZEND_FE
- ^
- /opt/install/paradox-1.4.3/paradox.c:76:2: note: in expansion of macro 'PHP_FE'
- PHP_FE(px_get_field, NULL)
- ^
- /usr/include/php5/Zend/zend_API.h:71:129: warning: (near initialization for 'paradox_functions[14]') [enabled by default]
- #define ZEND_FENTRY(zend_name, name, arg_info, flags) { #zend_name, name, arg_info, (zend_uint) (sizeof(arg_info)/sizeof(struct _zend_arg_info)-1), flags },
- ^
- /usr/include/php5/Zend/zend_API.h:77:38: note: in expansion of macro 'ZEND_FENTRY'
- #define ZEND_FE(name, arg_info) ZEND_FENTRY(name, ZEND_FN(name), arg_info, 0)
- ^
- /usr/include/php5/main/php.h:350:18: note: in expansion of macro 'ZEND_FE'
- #define PHP_FE ZEND_FE
- ^
- /opt/install/paradox-1.4.3/paradox.c:76:2: note: in expansion of macro 'PHP_FE'
- PHP_FE(px_get_field, NULL)
- ^
- /opt/install/paradox-1.4.3/paradox.c:77:2: warning: braces around scalar initializer [enabled by default]
- PHP_FE(px_get_schema, NULL)
- ^
- /opt/install/paradox-1.4.3/paradox.c:77:2: warning: (near initialization for 'paradox_functions[15]') [enabled by default]
- /opt/install/paradox-1.4.3/paradox.c:77:2: warning: initialization makes integer from pointer without a cast [enabled by default]
- /opt/install/paradox-1.4.3/paradox.c:77:2: warning: (near initialization for 'paradox_functions[15]') [enabled by default]
- /opt/install/paradox-1.4.3/paradox.c:77:2: error: initializer element is not computable at load time
- /opt/install/paradox-1.4.3/paradox.c:77:2: error: (near initialization for 'paradox_functions[15]')
- /opt/install/paradox-1.4.3/paradox.c:77:2: warning: excess elements in scalar initializer [enabled by default]
- /opt/install/paradox-1.4.3/paradox.c:77:2: warning: (near initialization for 'paradox_functions[15]') [enabled by default]
- /opt/install/paradox-1.4.3/paradox.c:77:2: warning: excess elements in scalar initializer [enabled by default]
- /opt/install/paradox-1.4.3/paradox.c:77:2: warning: (near initialization for 'paradox_functions[15]') [enabled by default]
- In file included from /usr/include/php5/main/php.h:39:0,
- from /opt/install/paradox-1.4.3/paradox.c:25:
- /usr/include/php5/Zend/zend_API.h:71:129: warning: excess elements in scalar initializer [enabled by default]
- #define ZEND_FENTRY(zend_name, name, arg_info, flags) { #zend_name, name, arg_info, (zend_uint) (sizeof(arg_info)/sizeof(struct _zend_arg_info)-1), flags },
- ^
- /usr/include/php5/Zend/zend_API.h:77:38: note: in expansion of macro 'ZEND_FENTRY'
- #define ZEND_FE(name, arg_info) ZEND_FENTRY(name, ZEND_FN(name), arg_info, 0)
- ^
- /usr/include/php5/main/php.h:350:18: note: in expansion of macro 'ZEND_FE'
- #define PHP_FE ZEND_FE
- ^
- /opt/install/paradox-1.4.3/paradox.c:77:2: note: in expansion of macro 'PHP_FE'
- PHP_FE(px_get_schema, NULL)
- ^
- /usr/include/php5/Zend/zend_API.h:71:129: warning: (near initialization for 'paradox_functions[15]') [enabled by default]
- #define ZEND_FENTRY(zend_name, name, arg_info, flags) { #zend_name, name, arg_info, (zend_uint) (sizeof(arg_info)/sizeof(struct _zend_arg_info)-1), flags },
- ^
- /usr/include/php5/Zend/zend_API.h:77:38: note: in expansion of macro 'ZEND_FENTRY'
- #define ZEND_FE(name, arg_info) ZEND_FENTRY(name, ZEND_FN(name), arg_info, 0)
- ^
- /usr/include/php5/main/php.h:350:18: note: in expansion of macro 'ZEND_FE'
- #define PHP_FE ZEND_FE
- ^
- /opt/install/paradox-1.4.3/paradox.c:77:2: note: in expansion of macro 'PHP_FE'
- PHP_FE(px_get_schema, NULL)
- ^
- /usr/include/php5/Zend/zend_API.h:71:129: warning: excess elements in scalar initializer [enabled by default]
- #define ZEND_FENTRY(zend_name, name, arg_info, flags) { #zend_name, name, arg_info, (zend_uint) (sizeof(arg_info)/sizeof(struct _zend_arg_info)-1), flags },
- ^
- /usr/include/php5/Zend/zend_API.h:77:38: note: in expansion of macro 'ZEND_FENTRY'
- #define ZEND_FE(name, arg_info) ZEND_FENTRY(name, ZEND_FN(name), arg_info, 0)
- ^
- /usr/include/php5/main/php.h:350:18: note: in expansion of macro 'ZEND_FE'
- #define PHP_FE ZEND_FE
- ^
- /opt/install/paradox-1.4.3/paradox.c:77:2: note: in expansion of macro 'PHP_FE'
- PHP_FE(px_get_schema, NULL)
- ^
- /usr/include/php5/Zend/zend_API.h:71:129: warning: (near initialization for 'paradox_functions[15]') [enabled by default]
- #define ZEND_FENTRY(zend_name, name, arg_info, flags) { #zend_name, name, arg_info, (zend_uint) (sizeof(arg_info)/sizeof(struct _zend_arg_info)-1), flags },
- ^
- /usr/include/php5/Zend/zend_API.h:77:38: note: in expansion of macro 'ZEND_FENTRY'
- #define ZEND_FE(name, arg_info) ZEND_FENTRY(name, ZEND_FN(name), arg_info, 0)
- ^
- /usr/include/php5/main/php.h:350:18: note: in expansion of macro 'ZEND_FE'
- #define PHP_FE ZEND_FE
- ^
- /opt/install/paradox-1.4.3/paradox.c:77:2: note: in expansion of macro 'PHP_FE'
- PHP_FE(px_get_schema, NULL)
- ^
- /opt/install/paradox-1.4.3/paradox.c:78:2: warning: braces around scalar initializer [enabled by default]
- PHP_FE(px_get_info, NULL)
- ^
- /opt/install/paradox-1.4.3/paradox.c:78:2: warning: (near initialization for 'paradox_functions[16]') [enabled by default]
- /opt/install/paradox-1.4.3/paradox.c:78:2: warning: initialization makes integer from pointer without a cast [enabled by default]
- /opt/install/paradox-1.4.3/paradox.c:78:2: warning: (near initialization for 'paradox_functions[16]') [enabled by default]
- /opt/install/paradox-1.4.3/paradox.c:78:2: error: initializer element is not computable at load time
- /opt/install/paradox-1.4.3/paradox.c:78:2: error: (near initialization for 'paradox_functions[16]')
- /opt/install/paradox-1.4.3/paradox.c:78:2: warning: excess elements in scalar initializer [enabled by default]
- /opt/install/paradox-1.4.3/paradox.c:78:2: warning: (near initialization for 'paradox_functions[16]') [enabled by default]
- /opt/install/paradox-1.4.3/paradox.c:78:2: warning: excess elements in scalar initializer [enabled by default]
- /opt/install/paradox-1.4.3/paradox.c:78:2: warning: (near initialization for 'paradox_functions[16]') [enabled by default]
- In file included from /usr/include/php5/main/php.h:39:0,
- from /opt/install/paradox-1.4.3/paradox.c:25:
- /usr/include/php5/Zend/zend_API.h:71:129: warning: excess elements in scalar initializer [enabled by default]
- #define ZEND_FENTRY(zend_name, name, arg_info, flags) { #zend_name, name, arg_info, (zend_uint) (sizeof(arg_info)/sizeof(struct _zend_arg_info)-1), flags },
- ^
- /usr/include/php5/Zend/zend_API.h:77:38: note: in expansion of macro 'ZEND_FENTRY'
- #define ZEND_FE(name, arg_info) ZEND_FENTRY(name, ZEND_FN(name), arg_info, 0)
- ^
- /usr/include/php5/main/php.h:350:18: note: in expansion of macro 'ZEND_FE'
- #define PHP_FE ZEND_FE
- ^
- /opt/install/paradox-1.4.3/paradox.c:78:2: note: in expansion of macro 'PHP_FE'
- PHP_FE(px_get_info, NULL)
- ^
- /usr/include/php5/Zend/zend_API.h:71:129: warning: (near initialization for 'paradox_functions[16]') [enabled by default]
- #define ZEND_FENTRY(zend_name, name, arg_info, flags) { #zend_name, name, arg_info, (zend_uint) (sizeof(arg_info)/sizeof(struct _zend_arg_info)-1), flags },
- ^
- /usr/include/php5/Zend/zend_API.h:77:38: note: in expansion of macro 'ZEND_FENTRY'
- #define ZEND_FE(name, arg_info) ZEND_FENTRY(name, ZEND_FN(name), arg_info, 0)
- ^
- /usr/include/php5/main/php.h:350:18: note: in expansion of macro 'ZEND_FE'
- #define PHP_FE ZEND_FE
- ^
- /opt/install/paradox-1.4.3/paradox.c:78:2: note: in expansion of macro 'PHP_FE'
- PHP_FE(px_get_info, NULL)
- ^
- /usr/include/php5/Zend/zend_API.h:71:129: warning: excess elements in scalar initializer [enabled by default]
- #define ZEND_FENTRY(zend_name, name, arg_info, flags) { #zend_name, name, arg_info, (zend_uint) (sizeof(arg_info)/sizeof(struct _zend_arg_info)-1), flags },
- ^
- /usr/include/php5/Zend/zend_API.h:77:38: note: in expansion of macro 'ZEND_FENTRY'
- #define ZEND_FE(name, arg_info) ZEND_FENTRY(name, ZEND_FN(name), arg_info, 0)
- ^
- /usr/include/php5/main/php.h:350:18: note: in expansion of macro 'ZEND_FE'
- #define PHP_FE ZEND_FE
- ^
- /opt/install/paradox-1.4.3/paradox.c:78:2: note: in expansion of macro 'PHP_FE'
- PHP_FE(px_get_info, NULL)
- ^
- /usr/include/php5/Zend/zend_API.h:71:129: warning: (near initialization for 'paradox_functions[16]') [enabled by default]
- #define ZEND_FENTRY(zend_name, name, arg_info, flags) { #zend_name, name, arg_info, (zend_uint) (sizeof(arg_info)/sizeof(struct _zend_arg_info)-1), flags },
- ^
- /usr/include/php5/Zend/zend_API.h:77:38: note: in expansion of macro 'ZEND_FENTRY'
- #define ZEND_FE(name, arg_info) ZEND_FENTRY(name, ZEND_FN(name), arg_info, 0)
- ^
- /usr/include/php5/main/php.h:350:18: note: in expansion of macro 'ZEND_FE'
- #define PHP_FE ZEND_FE
- ^
- /opt/install/paradox-1.4.3/paradox.c:78:2: note: in expansion of macro 'PHP_FE'
- PHP_FE(px_get_info, NULL)
- ^
- /opt/install/paradox-1.4.3/paradox.c:79:2: warning: braces around scalar initializer [enabled by default]
- PHP_FE(px_set_parameter, NULL)
- ^
- /opt/install/paradox-1.4.3/paradox.c:79:2: warning: (near initialization for 'paradox_functions[17]') [enabled by default]
- /opt/install/paradox-1.4.3/paradox.c:79:2: warning: initialization makes integer from pointer without a cast [enabled by default]
- /opt/install/paradox-1.4.3/paradox.c:79:2: warning: (near initialization for 'paradox_functions[17]') [enabled by default]
- /opt/install/paradox-1.4.3/paradox.c:79:2: error: initializer element is not computable at load time
- /opt/install/paradox-1.4.3/paradox.c:79:2: error: (near initialization for 'paradox_functions[17]')
- /opt/install/paradox-1.4.3/paradox.c:79:2: warning: excess elements in scalar initializer [enabled by default]
- /opt/install/paradox-1.4.3/paradox.c:79:2: warning: (near initialization for 'paradox_functions[17]') [enabled by default]
- /opt/install/paradox-1.4.3/paradox.c:79:2: warning: excess elements in scalar initializer [enabled by default]
- /opt/install/paradox-1.4.3/paradox.c:79:2: warning: (near initialization for 'paradox_functions[17]') [enabled by default]
- In file included from /usr/include/php5/main/php.h:39:0,
- from /opt/install/paradox-1.4.3/paradox.c:25:
- /usr/include/php5/Zend/zend_API.h:71:129: warning: excess elements in scalar initializer [enabled by default]
- #define ZEND_FENTRY(zend_name, name, arg_info, flags) { #zend_name, name, arg_info, (zend_uint) (sizeof(arg_info)/sizeof(struct _zend_arg_info)-1), flags },
- ^
- /usr/include/php5/Zend/zend_API.h:77:38: note: in expansion of macro 'ZEND_FENTRY'
- #define ZEND_FE(name, arg_info) ZEND_FENTRY(name, ZEND_FN(name), arg_info, 0)
- ^
- /usr/include/php5/main/php.h:350:18: note: in expansion of macro 'ZEND_FE'
- #define PHP_FE ZEND_FE
- ^
- /opt/install/paradox-1.4.3/paradox.c:79:2: note: in expansion of macro 'PHP_FE'
- PHP_FE(px_set_parameter, NULL)
- ^
- /usr/include/php5/Zend/zend_API.h:71:129: warning: (near initialization for 'paradox_functions[17]') [enabled by default]
- #define ZEND_FENTRY(zend_name, name, arg_info, flags) { #zend_name, name, arg_info, (zend_uint) (sizeof(arg_info)/sizeof(struct _zend_arg_info)-1), flags },
- ^
- /usr/include/php5/Zend/zend_API.h:77:38: note: in expansion of macro 'ZEND_FENTRY'
- #define ZEND_FE(name, arg_info) ZEND_FENTRY(name, ZEND_FN(name), arg_info, 0)
- ^
- /usr/include/php5/main/php.h:350:18: note: in expansion of macro 'ZEND_FE'
- #define PHP_FE ZEND_FE
- ^
- /opt/install/paradox-1.4.3/paradox.c:79:2: note: in expansion of macro 'PHP_FE'
- PHP_FE(px_set_parameter, NULL)
- ^
- /usr/include/php5/Zend/zend_API.h:71:129: warning: excess elements in scalar initializer [enabled by default]
- #define ZEND_FENTRY(zend_name, name, arg_info, flags) { #zend_name, name, arg_info, (zend_uint) (sizeof(arg_info)/sizeof(struct _zend_arg_info)-1), flags },
- ^
- /usr/include/php5/Zend/zend_API.h:77:38: note: in expansion of macro 'ZEND_FENTRY'
- #define ZEND_FE(name, arg_info) ZEND_FENTRY(name, ZEND_FN(name), arg_info, 0)
- ^
- /usr/include/php5/main/php.h:350:18: note: in expansion of macro 'ZEND_FE'
- #define PHP_FE ZEND_FE
- ^
- /opt/install/paradox-1.4.3/paradox.c:79:2: note: in expansion of macro 'PHP_FE'
- PHP_FE(px_set_parameter, NULL)
- ^
- /usr/include/php5/Zend/zend_API.h:71:129: warning: (near initialization for 'paradox_functions[17]') [enabled by default]
- #define ZEND_FENTRY(zend_name, name, arg_info, flags) { #zend_name, name, arg_info, (zend_uint) (sizeof(arg_info)/sizeof(struct _zend_arg_info)-1), flags },
- ^
- /usr/include/php5/Zend/zend_API.h:77:38: note: in expansion of macro 'ZEND_FENTRY'
- #define ZEND_FE(name, arg_info) ZEND_FENTRY(name, ZEND_FN(name), arg_info, 0)
- ^
- /usr/include/php5/main/php.h:350:18: note: in expansion of macro 'ZEND_FE'
- #define PHP_FE ZEND_FE
- ^
- /opt/install/paradox-1.4.3/paradox.c:79:2: note: in expansion of macro 'PHP_FE'
- PHP_FE(px_set_parameter, NULL)
- ^
- /opt/install/paradox-1.4.3/paradox.c:80:2: warning: braces around scalar initializer [enabled by default]
- PHP_FE(px_get_parameter, NULL)
- ^
- /opt/install/paradox-1.4.3/paradox.c:80:2: warning: (near initialization for 'paradox_functions[18]') [enabled by default]
- /opt/install/paradox-1.4.3/paradox.c:80:2: warning: initialization makes integer from pointer without a cast [enabled by default]
- /opt/install/paradox-1.4.3/paradox.c:80:2: warning: (near initialization for 'paradox_functions[18]') [enabled by default]
- /opt/install/paradox-1.4.3/paradox.c:80:2: error: initializer element is not computable at load time
- /opt/install/paradox-1.4.3/paradox.c:80:2: error: (near initialization for 'paradox_functions[18]')
- /opt/install/paradox-1.4.3/paradox.c:80:2: warning: excess elements in scalar initializer [enabled by default]
- /opt/install/paradox-1.4.3/paradox.c:80:2: warning: (near initialization for 'paradox_functions[18]') [enabled by default]
- /opt/install/paradox-1.4.3/paradox.c:80:2: warning: excess elements in scalar initializer [enabled by default]
- /opt/install/paradox-1.4.3/paradox.c:80:2: warning: (near initialization for 'paradox_functions[18]') [enabled by default]
- In file included from /usr/include/php5/main/php.h:39:0,
- from /opt/install/paradox-1.4.3/paradox.c:25:
- /usr/include/php5/Zend/zend_API.h:71:129: warning: excess elements in scalar initializer [enabled by default]
- #define ZEND_FENTRY(zend_name, name, arg_info, flags) { #zend_name, name, arg_info, (zend_uint) (sizeof(arg_info)/sizeof(struct _zend_arg_info)-1), flags },
- ^
- /usr/include/php5/Zend/zend_API.h:77:38: note: in expansion of macro 'ZEND_FENTRY'
- #define ZEND_FE(name, arg_info) ZEND_FENTRY(name, ZEND_FN(name), arg_info, 0)
- ^
- /usr/include/php5/main/php.h:350:18: note: in expansion of macro 'ZEND_FE'
- #define PHP_FE ZEND_FE
- ^
- /opt/install/paradox-1.4.3/paradox.c:80:2: note: in expansion of macro 'PHP_FE'
- PHP_FE(px_get_parameter, NULL)
- ^
- /usr/include/php5/Zend/zend_API.h:71:129: warning: (near initialization for 'paradox_functions[18]') [enabled by default]
- #define ZEND_FENTRY(zend_name, name, arg_info, flags) { #zend_name, name, arg_info, (zend_uint) (sizeof(arg_info)/sizeof(struct _zend_arg_info)-1), flags },
- ^
- /usr/include/php5/Zend/zend_API.h:77:38: note: in expansion of macro 'ZEND_FENTRY'
- #define ZEND_FE(name, arg_info) ZEND_FENTRY(name, ZEND_FN(name), arg_info, 0)
- ^
- /usr/include/php5/main/php.h:350:18: note: in expansion of macro 'ZEND_FE'
- #define PHP_FE ZEND_FE
- ^
- /opt/install/paradox-1.4.3/paradox.c:80:2: note: in expansion of macro 'PHP_FE'
- PHP_FE(px_get_parameter, NULL)
- ^
- /usr/include/php5/Zend/zend_API.h:71:129: warning: excess elements in scalar initializer [enabled by default]
- #define ZEND_FENTRY(zend_name, name, arg_info, flags) { #zend_name, name, arg_info, (zend_uint) (sizeof(arg_info)/sizeof(struct _zend_arg_info)-1), flags },
- ^
- /usr/include/php5/Zend/zend_API.h:77:38: note: in expansion of macro 'ZEND_FENTRY'
- #define ZEND_FE(name, arg_info) ZEND_FENTRY(name, ZEND_FN(name), arg_info, 0)
- ^
- /usr/include/php5/main/php.h:350:18: note: in expansion of macro 'ZEND_FE'
- #define PHP_FE ZEND_FE
- ^
- /opt/install/paradox-1.4.3/paradox.c:80:2: note: in expansion of macro 'PHP_FE'
- PHP_FE(px_get_parameter, NULL)
- ^
- /usr/include/php5/Zend/zend_API.h:71:129: warning: (near initialization for 'paradox_functions[18]') [enabled by default]
- #define ZEND_FENTRY(zend_name, name, arg_info, flags) { #zend_name, name, arg_info, (zend_uint) (sizeof(arg_info)/sizeof(struct _zend_arg_info)-1), flags },
- ^
- /usr/include/php5/Zend/zend_API.h:77:38: note: in expansion of macro 'ZEND_FENTRY'
- #define ZEND_FE(name, arg_info) ZEND_FENTRY(name, ZEND_FN(name), arg_info, 0)
- ^
- /usr/include/php5/main/php.h:350:18: note: in expansion of macro 'ZEND_FE'
- #define PHP_FE ZEND_FE
- ^
- /opt/install/paradox-1.4.3/paradox.c:80:2: note: in expansion of macro 'PHP_FE'
- PHP_FE(px_get_parameter, NULL)
- ^
- /opt/install/paradox-1.4.3/paradox.c:81:2: warning: braces around scalar initializer [enabled by default]
- PHP_FE(px_set_value, NULL)
- ^
- /opt/install/paradox-1.4.3/paradox.c:81:2: warning: (near initialization for 'paradox_functions[19]') [enabled by default]
- /opt/install/paradox-1.4.3/paradox.c:81:2: warning: initialization makes integer from pointer without a cast [enabled by default]
- /opt/install/paradox-1.4.3/paradox.c:81:2: warning: (near initialization for 'paradox_functions[19]') [enabled by default]
- /opt/install/paradox-1.4.3/paradox.c:81:2: error: initializer element is not computable at load time
- /opt/install/paradox-1.4.3/paradox.c:81:2: error: (near initialization for 'paradox_functions[19]')
- /opt/install/paradox-1.4.3/paradox.c:81:2: warning: excess elements in scalar initializer [enabled by default]
- /opt/install/paradox-1.4.3/paradox.c:81:2: warning: (near initialization for 'paradox_functions[19]') [enabled by default]
- /opt/install/paradox-1.4.3/paradox.c:81:2: warning: excess elements in scalar initializer [enabled by default]
- /opt/install/paradox-1.4.3/paradox.c:81:2: warning: (near initialization for 'paradox_functions[19]') [enabled by default]
- In file included from /usr/include/php5/main/php.h:39:0,
- from /opt/install/paradox-1.4.3/paradox.c:25:
- /usr/include/php5/Zend/zend_API.h:71:129: warning: excess elements in scalar initializer [enabled by default]
- #define ZEND_FENTRY(zend_name, name, arg_info, flags) { #zend_name, name, arg_info, (zend_uint) (sizeof(arg_info)/sizeof(struct _zend_arg_info)-1), flags },
- ^
- /usr/include/php5/Zend/zend_API.h:77:38: note: in expansion of macro 'ZEND_FENTRY'
- #define ZEND_FE(name, arg_info) ZEND_FENTRY(name, ZEND_FN(name), arg_info, 0)
- ^
- /usr/include/php5/main/php.h:350:18: note: in expansion of macro 'ZEND_FE'
- #define PHP_FE ZEND_FE
- ^
- /opt/install/paradox-1.4.3/paradox.c:81:2: note: in expansion of macro 'PHP_FE'
- PHP_FE(px_set_value, NULL)
- ^
- /usr/include/php5/Zend/zend_API.h:71:129: warning: (near initialization for 'paradox_functions[19]') [enabled by default]
- #define ZEND_FENTRY(zend_name, name, arg_info, flags) { #zend_name, name, arg_info, (zend_uint) (sizeof(arg_info)/sizeof(struct _zend_arg_info)-1), flags },
- ^
- /usr/include/php5/Zend/zend_API.h:77:38: note: in expansion of macro 'ZEND_FENTRY'
- #define ZEND_FE(name, arg_info) ZEND_FENTRY(name, ZEND_FN(name), arg_info, 0)
- ^
- /usr/include/php5/main/php.h:350:18: note: in expansion of macro 'ZEND_FE'
- #define PHP_FE ZEND_FE
- ^
- /opt/install/paradox-1.4.3/paradox.c:81:2: note: in expansion of macro 'PHP_FE'
- PHP_FE(px_set_value, NULL)
- ^
- /usr/include/php5/Zend/zend_API.h:71:129: warning: excess elements in scalar initializer [enabled by default]
- #define ZEND_FENTRY(zend_name, name, arg_info, flags) { #zend_name, name, arg_info, (zend_uint) (sizeof(arg_info)/sizeof(struct _zend_arg_info)-1), flags },
- ^
- /usr/include/php5/Zend/zend_API.h:77:38: note: in expansion of macro 'ZEND_FENTRY'
- #define ZEND_FE(name, arg_info) ZEND_FENTRY(name, ZEND_FN(name), arg_info, 0)
- ^
- /usr/include/php5/main/php.h:350:18: note: in expansion of macro 'ZEND_FE'
- #define PHP_FE ZEND_FE
- ^
- /opt/install/paradox-1.4.3/paradox.c:81:2: note: in expansion of macro 'PHP_FE'
- PHP_FE(px_set_value, NULL)
- ^
- /usr/include/php5/Zend/zend_API.h:71:129: warning: (near initialization for 'paradox_functions[19]') [enabled by default]
- #define ZEND_FENTRY(zend_name, name, arg_info, flags) { #zend_name, name, arg_info, (zend_uint) (sizeof(arg_info)/sizeof(struct _zend_arg_info)-1), flags },
- ^
- /usr/include/php5/Zend/zend_API.h:77:38: note: in expansion of macro 'ZEND_FENTRY'
- #define ZEND_FE(name, arg_info) ZEND_FENTRY(name, ZEND_FN(name), arg_info, 0)
- ^
- /usr/include/php5/main/php.h:350:18: note: in expansion of macro 'ZEND_FE'
- #define PHP_FE ZEND_FE
- ^
- /opt/install/paradox-1.4.3/paradox.c:81:2: note: in expansion of macro 'PHP_FE'
- PHP_FE(px_set_value, NULL)
- ^
- /opt/install/paradox-1.4.3/paradox.c:82:2: warning: braces around scalar initializer [enabled by default]
- PHP_FE(px_get_value, NULL)
- ^
- /opt/install/paradox-1.4.3/paradox.c:82:2: warning: (near initialization for 'paradox_functions[20]') [enabled by default]
- /opt/install/paradox-1.4.3/paradox.c:82:2: warning: initialization makes integer from pointer without a cast [enabled by default]
- /opt/install/paradox-1.4.3/paradox.c:82:2: warning: (near initialization for 'paradox_functions[20]') [enabled by default]
- /opt/install/paradox-1.4.3/paradox.c:82:2: error: initializer element is not computable at load time
- /opt/install/paradox-1.4.3/paradox.c:82:2: error: (near initialization for 'paradox_functions[20]')
- /opt/install/paradox-1.4.3/paradox.c:82:2: warning: excess elements in scalar initializer [enabled by default]
- /opt/install/paradox-1.4.3/paradox.c:82:2: warning: (near initialization for 'paradox_functions[20]') [enabled by default]
- /opt/install/paradox-1.4.3/paradox.c:82:2: warning: excess elements in scalar initializer [enabled by default]
- /opt/install/paradox-1.4.3/paradox.c:82:2: warning: (near initialization for 'paradox_functions[20]') [enabled by default]
- In file included from /usr/include/php5/main/php.h:39:0,
- from /opt/install/paradox-1.4.3/paradox.c:25:
- /usr/include/php5/Zend/zend_API.h:71:129: warning: excess elements in scalar initializer [enabled by default]
- #define ZEND_FENTRY(zend_name, name, arg_info, flags) { #zend_name, name, arg_info, (zend_uint) (sizeof(arg_info)/sizeof(struct _zend_arg_info)-1), flags },
- ^
- /usr/include/php5/Zend/zend_API.h:77:38: note: in expansion of macro 'ZEND_FENTRY'
- #define ZEND_FE(name, arg_info) ZEND_FENTRY(name, ZEND_FN(name), arg_info, 0)
- ^
- /usr/include/php5/main/php.h:350:18: note: in expansion of macro 'ZEND_FE'
- #define PHP_FE ZEND_FE
- ^
- /opt/install/paradox-1.4.3/paradox.c:82:2: note: in expansion of macro 'PHP_FE'
- PHP_FE(px_get_value, NULL)
- ^
- /usr/include/php5/Zend/zend_API.h:71:129: warning: (near initialization for 'paradox_functions[20]') [enabled by default]
- #define ZEND_FENTRY(zend_name, name, arg_info, flags) { #zend_name, name, arg_info, (zend_uint) (sizeof(arg_info)/sizeof(struct _zend_arg_info)-1), flags },
- ^
- /usr/include/php5/Zend/zend_API.h:77:38: note: in expansion of macro 'ZEND_FENTRY'
- #define ZEND_FE(name, arg_info) ZEND_FENTRY(name, ZEND_FN(name), arg_info, 0)
- ^
- /usr/include/php5/main/php.h:350:18: note: in expansion of macro 'ZEND_FE'
- #define PHP_FE ZEND_FE
- ^
- /opt/install/paradox-1.4.3/paradox.c:82:2: note: in expansion of macro 'PHP_FE'
- PHP_FE(px_get_value, NULL)
- ^
- /usr/include/php5/Zend/zend_API.h:71:129: warning: excess elements in scalar initializer [enabled by default]
- #define ZEND_FENTRY(zend_name, name, arg_info, flags) { #zend_name, name, arg_info, (zend_uint) (sizeof(arg_info)/sizeof(struct _zend_arg_info)-1), flags },
- ^
- /usr/include/php5/Zend/zend_API.h:77:38: note: in expansion of macro 'ZEND_FENTRY'
- #define ZEND_FE(name, arg_info) ZEND_FENTRY(name, ZEND_FN(name), arg_info, 0)
- ^
- /usr/include/php5/main/php.h:350:18: note: in expansion of macro 'ZEND_FE'
- #define PHP_FE ZEND_FE
- ^
- /opt/install/paradox-1.4.3/paradox.c:82:2: note: in expansion of macro 'PHP_FE'
- PHP_FE(px_get_value, NULL)
- ^
- /usr/include/php5/Zend/zend_API.h:71:129: warning: (near initialization for 'paradox_functions[20]') [enabled by default]
- #define ZEND_FENTRY(zend_name, name, arg_info, flags) { #zend_name, name, arg_info, (zend_uint) (sizeof(arg_info)/sizeof(struct _zend_arg_info)-1), flags },
- ^
- /usr/include/php5/Zend/zend_API.h:77:38: note: in expansion of macro 'ZEND_FENTRY'
- #define ZEND_FE(name, arg_info) ZEND_FENTRY(name, ZEND_FN(name), arg_info, 0)
- ^
- /usr/include/php5/main/php.h:350:18: note: in expansion of macro 'ZEND_FE'
- #define PHP_FE ZEND_FE
- ^
- /opt/install/paradox-1.4.3/paradox.c:82:2: note: in expansion of macro 'PHP_FE'
- PHP_FE(px_get_value, NULL)
- ^
- /opt/install/paradox-1.4.3/paradox.c:83:2: warning: braces around scalar initializer [enabled by default]
- PHP_FE(px_set_targetencoding, NULL)
- ^
- /opt/install/paradox-1.4.3/paradox.c:83:2: warning: (near initialization for 'paradox_functions[21]') [enabled by default]
- /opt/install/paradox-1.4.3/paradox.c:83:2: warning: initialization makes integer from pointer without a cast [enabled by default]
- /opt/install/paradox-1.4.3/paradox.c:83:2: warning: (near initialization for 'paradox_functions[21]') [enabled by default]
- /opt/install/paradox-1.4.3/paradox.c:83:2: error: initializer element is not computable at load time
- /opt/install/paradox-1.4.3/paradox.c:83:2: error: (near initialization for 'paradox_functions[21]')
- /opt/install/paradox-1.4.3/paradox.c:83:2: warning: excess elements in scalar initializer [enabled by default]
- /opt/install/paradox-1.4.3/paradox.c:83:2: warning: (near initialization for 'paradox_functions[21]') [enabled by default]
- /opt/install/paradox-1.4.3/paradox.c:83:2: warning: excess elements in scalar initializer [enabled by default]
- /opt/install/paradox-1.4.3/paradox.c:83:2: warning: (near initialization for 'paradox_functions[21]') [enabled by default]
- In file included from /usr/include/php5/main/php.h:39:0,
- from /opt/install/paradox-1.4.3/paradox.c:25:
- /usr/include/php5/Zend/zend_API.h:71:129: warning: excess elements in scalar initializer [enabled by default]
- #define ZEND_FENTRY(zend_name, name, arg_info, flags) { #zend_name, name, arg_info, (zend_uint) (sizeof(arg_info)/sizeof(struct _zend_arg_info)-1), flags },
- ^
- /usr/include/php5/Zend/zend_API.h:77:38: note: in expansion of macro 'ZEND_FENTRY'
- #define ZEND_FE(name, arg_info) ZEND_FENTRY(name, ZEND_FN(name), arg_info, 0)
- ^
- /usr/include/php5/main/php.h:350:18: note: in expansion of macro 'ZEND_FE'
- #define PHP_FE ZEND_FE
- ^
- /opt/install/paradox-1.4.3/paradox.c:83:2: note: in expansion of macro 'PHP_FE'
- PHP_FE(px_set_targetencoding, NULL)
- ^
- /usr/include/php5/Zend/zend_API.h:71:129: warning: (near initialization for 'paradox_functions[21]') [enabled by default]
- #define ZEND_FENTRY(zend_name, name, arg_info, flags) { #zend_name, name, arg_info, (zend_uint) (sizeof(arg_info)/sizeof(struct _zend_arg_info)-1), flags },
- ^
- /usr/include/php5/Zend/zend_API.h:77:38: note: in expansion of macro 'ZEND_FENTRY'
- #define ZEND_FE(name, arg_info) ZEND_FENTRY(name, ZEND_FN(name), arg_info, 0)
- ^
- /usr/include/php5/main/php.h:350:18: note: in expansion of macro 'ZEND_FE'
- #define PHP_FE ZEND_FE
- ^
- /opt/install/paradox-1.4.3/paradox.c:83:2: note: in expansion of macro 'PHP_FE'
- PHP_FE(px_set_targetencoding, NULL)
- ^
- /usr/include/php5/Zend/zend_API.h:71:129: warning: excess elements in scalar initializer [enabled by default]
- #define ZEND_FENTRY(zend_name, name, arg_info, flags) { #zend_name, name, arg_info, (zend_uint) (sizeof(arg_info)/sizeof(struct _zend_arg_info)-1), flags },
- ^
- /usr/include/php5/Zend/zend_API.h:77:38: note: in expansion of macro 'ZEND_FENTRY'
- #define ZEND_FE(name, arg_info) ZEND_FENTRY(name, ZEND_FN(name), arg_info, 0)
- ^
- /usr/include/php5/main/php.h:350:18: note: in expansion of macro 'ZEND_FE'
- #define PHP_FE ZEND_FE
- ^
- /opt/install/paradox-1.4.3/paradox.c:83:2: note: in expansion of macro 'PHP_FE'
- PHP_FE(px_set_targetencoding, NULL)
- ^
- /usr/include/php5/Zend/zend_API.h:71:129: warning: (near initialization for 'paradox_functions[21]') [enabled by default]
- #define ZEND_FENTRY(zend_name, name, arg_info, flags) { #zend_name, name, arg_info, (zend_uint) (sizeof(arg_info)/sizeof(struct _zend_arg_info)-1), flags },
- ^
- /usr/include/php5/Zend/zend_API.h:77:38: note: in expansion of macro 'ZEND_FENTRY'
- #define ZEND_FE(name, arg_info) ZEND_FENTRY(name, ZEND_FN(name), arg_info, 0)
- ^
- /usr/include/php5/main/php.h:350:18: note: in expansion of macro 'ZEND_FE'
- #define PHP_FE ZEND_FE
- ^
- /opt/install/paradox-1.4.3/paradox.c:83:2: note: in expansion of macro 'PHP_FE'
- PHP_FE(px_set_targetencoding, NULL)
- ^
- /opt/install/paradox-1.4.3/paradox.c:84:2: warning: braces around scalar initializer [enabled by default]
- PHP_FE(px_set_tablename, NULL)
- ^
- /opt/install/paradox-1.4.3/paradox.c:84:2: warning: (near initialization for 'paradox_functions[22]') [enabled by default]
- /opt/install/paradox-1.4.3/paradox.c:84:2: warning: initialization makes integer from pointer without a cast [enabled by default]
- /opt/install/paradox-1.4.3/paradox.c:84:2: warning: (near initialization for 'paradox_functions[22]') [enabled by default]
- /opt/install/paradox-1.4.3/paradox.c:84:2: error: initializer element is not computable at load time
- /opt/install/paradox-1.4.3/paradox.c:84:2: error: (near initialization for 'paradox_functions[22]')
- /opt/install/paradox-1.4.3/paradox.c:84:2: warning: excess elements in scalar initializer [enabled by default]
- /opt/install/paradox-1.4.3/paradox.c:84:2: warning: (near initialization for 'paradox_functions[22]') [enabled by default]
- /opt/install/paradox-1.4.3/paradox.c:84:2: warning: excess elements in scalar initializer [enabled by default]
- /opt/install/paradox-1.4.3/paradox.c:84:2: warning: (near initialization for 'paradox_functions[22]') [enabled by default]
- In file included from /usr/include/php5/main/php.h:39:0,
- from /opt/install/paradox-1.4.3/paradox.c:25:
- /usr/include/php5/Zend/zend_API.h:71:129: warning: excess elements in scalar initializer [enabled by default]
- #define ZEND_FENTRY(zend_name, name, arg_info, flags) { #zend_name, name, arg_info, (zend_uint) (sizeof(arg_info)/sizeof(struct _zend_arg_info)-1), flags },
- ^
- /usr/include/php5/Zend/zend_API.h:77:38: note: in expansion of macro 'ZEND_FENTRY'
- #define ZEND_FE(name, arg_info) ZEND_FENTRY(name, ZEND_FN(name), arg_info, 0)
- ^
- /usr/include/php5/main/php.h:350:18: note: in expansion of macro 'ZEND_FE'
- #define PHP_FE ZEND_FE
- ^
- /opt/install/paradox-1.4.3/paradox.c:84:2: note: in expansion of macro 'PHP_FE'
- PHP_FE(px_set_tablename, NULL)
- ^
- /usr/include/php5/Zend/zend_API.h:71:129: warning: (near initialization for 'paradox_functions[22]') [enabled by default]
- #define ZEND_FENTRY(zend_name, name, arg_info, flags) { #zend_name, name, arg_info, (zend_uint) (sizeof(arg_info)/sizeof(struct _zend_arg_info)-1), flags },
- ^
- /usr/include/php5/Zend/zend_API.h:77:38: note: in expansion of macro 'ZEND_FENTRY'
- #define ZEND_FE(name, arg_info) ZEND_FENTRY(name, ZEND_FN(name), arg_info, 0)
- ^
- /usr/include/php5/main/php.h:350:18: note: in expansion of macro 'ZEND_FE'
- #define PHP_FE ZEND_FE
- ^
- /opt/install/paradox-1.4.3/paradox.c:84:2: note: in expansion of macro 'PHP_FE'
- PHP_FE(px_set_tablename, NULL)
- ^
- /usr/include/php5/Zend/zend_API.h:71:129: warning: excess elements in scalar initializer [enabled by default]
- #define ZEND_FENTRY(zend_name, name, arg_info, flags) { #zend_name, name, arg_info, (zend_uint) (sizeof(arg_info)/sizeof(struct _zend_arg_info)-1), flags },
- ^
- /usr/include/php5/Zend/zend_API.h:77:38: note: in expansion of macro 'ZEND_FENTRY'
- #define ZEND_FE(name, arg_info) ZEND_FENTRY(name, ZEND_FN(name), arg_info, 0)
- ^
- /usr/include/php5/main/php.h:350:18: note: in expansion of macro 'ZEND_FE'
- #define PHP_FE ZEND_FE
- ^
- /opt/install/paradox-1.4.3/paradox.c:84:2: note: in expansion of macro 'PHP_FE'
- PHP_FE(px_set_tablename, NULL)
- ^
- /usr/include/php5/Zend/zend_API.h:71:129: warning: (near initialization for 'paradox_functions[22]') [enabled by default]
- #define ZEND_FENTRY(zend_name, name, arg_info, flags) { #zend_name, name, arg_info, (zend_uint) (sizeof(arg_info)/sizeof(struct _zend_arg_info)-1), flags },
- ^
- /usr/include/php5/Zend/zend_API.h:77:38: note: in expansion of macro 'ZEND_FENTRY'
- #define ZEND_FE(name, arg_info) ZEND_FENTRY(name, ZEND_FN(name), arg_info, 0)
- ^
- /usr/include/php5/main/php.h:350:18: note: in expansion of macro 'ZEND_FE'
- #define PHP_FE ZEND_FE
- ^
- /opt/install/paradox-1.4.3/paradox.c:84:2: note: in expansion of macro 'PHP_FE'
- PHP_FE(px_set_tablename, NULL)
- ^
- /opt/install/paradox-1.4.3/paradox.c:85:2: warning: braces around scalar initializer [enabled by default]
- PHP_FE(px_set_blob_file, NULL)
- ^
- /opt/install/paradox-1.4.3/paradox.c:85:2: warning: (near initialization for 'paradox_functions[23]') [enabled by default]
- /opt/install/paradox-1.4.3/paradox.c:85:2: warning: initialization makes integer from pointer without a cast [enabled by default]
- /opt/install/paradox-1.4.3/paradox.c:85:2: warning: (near initialization for 'paradox_functions[23]') [enabled by default]
- /opt/install/paradox-1.4.3/paradox.c:85:2: error: initializer element is not computable at load time
- /opt/install/paradox-1.4.3/paradox.c:85:2: error: (near initialization for 'paradox_functions[23]')
- /opt/install/paradox-1.4.3/paradox.c:85:2: warning: excess elements in scalar initializer [enabled by default]
- /opt/install/paradox-1.4.3/paradox.c:85:2: warning: (near initialization for 'paradox_functions[23]') [enabled by default]
- /opt/install/paradox-1.4.3/paradox.c:85:2: warning: excess elements in scalar initializer [enabled by default]
- /opt/install/paradox-1.4.3/paradox.c:85:2: warning: (near initialization for 'paradox_functions[23]') [enabled by default]
- In file included from /usr/include/php5/main/php.h:39:0,
- from /opt/install/paradox-1.4.3/paradox.c:25:
- /usr/include/php5/Zend/zend_API.h:71:129: warning: excess elements in scalar initializer [enabled by default]
- #define ZEND_FENTRY(zend_name, name, arg_info, flags) { #zend_name, name, arg_info, (zend_uint) (sizeof(arg_info)/sizeof(struct _zend_arg_info)-1), flags },
- ^
- /usr/include/php5/Zend/zend_API.h:77:38: note: in expansion of macro 'ZEND_FENTRY'
- #define ZEND_FE(name, arg_info) ZEND_FENTRY(name, ZEND_FN(name), arg_info, 0)
- ^
- /usr/include/php5/main/php.h:350:18: note: in expansion of macro 'ZEND_FE'
- #define PHP_FE ZEND_FE
- ^
- /opt/install/paradox-1.4.3/paradox.c:85:2: note: in expansion of macro 'PHP_FE'
- PHP_FE(px_set_blob_file, NULL)
- ^
- /usr/include/php5/Zend/zend_API.h:71:129: warning: (near initialization for 'paradox_functions[23]') [enabled by default]
- #define ZEND_FENTRY(zend_name, name, arg_info, flags) { #zend_name, name, arg_info, (zend_uint) (sizeof(arg_info)/sizeof(struct _zend_arg_info)-1), flags },
- ^
- /usr/include/php5/Zend/zend_API.h:77:38: note: in expansion of macro 'ZEND_FENTRY'
- #define ZEND_FE(name, arg_info) ZEND_FENTRY(name, ZEND_FN(name), arg_info, 0)
- ^
- /usr/include/php5/main/php.h:350:18: note: in expansion of macro 'ZEND_FE'
- #define PHP_FE ZEND_FE
- ^
- /opt/install/paradox-1.4.3/paradox.c:85:2: note: in expansion of macro 'PHP_FE'
- PHP_FE(px_set_blob_file, NULL)
- ^
- /usr/include/php5/Zend/zend_API.h:71:129: warning: excess elements in scalar initializer [enabled by default]
- #define ZEND_FENTRY(zend_name, name, arg_info, flags) { #zend_name, name, arg_info, (zend_uint) (sizeof(arg_info)/sizeof(struct _zend_arg_info)-1), flags },
- ^
- /usr/include/php5/Zend/zend_API.h:77:38: note: in expansion of macro 'ZEND_FENTRY'
- #define ZEND_FE(name, arg_info) ZEND_FENTRY(name, ZEND_FN(name), arg_info, 0)
- ^
- /usr/include/php5/main/php.h:350:18: note: in expansion of macro 'ZEND_FE'
- #define PHP_FE ZEND_FE
- ^
- /opt/install/paradox-1.4.3/paradox.c:85:2: note: in expansion of macro 'PHP_FE'
- PHP_FE(px_set_blob_file, NULL)
- ^
- /usr/include/php5/Zend/zend_API.h:71:129: warning: (near initialization for 'paradox_functions[23]') [enabled by default]
- #define ZEND_FENTRY(zend_name, name, arg_info, flags) { #zend_name, name, arg_info, (zend_uint) (sizeof(arg_info)/sizeof(struct _zend_arg_info)-1), flags },
- ^
- /usr/include/php5/Zend/zend_API.h:77:38: note: in expansion of macro 'ZEND_FENTRY'
- #define ZEND_FE(name, arg_info) ZEND_FENTRY(name, ZEND_FN(name), arg_info, 0)
- ^
- /usr/include/php5/main/php.h:350:18: note: in expansion of macro 'ZEND_FE'
- #define PHP_FE ZEND_FE
- ^
- /opt/install/paradox-1.4.3/paradox.c:85:2: note: in expansion of macro 'PHP_FE'
- PHP_FE(px_set_blob_file, NULL)
- ^
- /opt/install/paradox-1.4.3/paradox.c:86:2: warning: braces around scalar initializer [enabled by default]
- PHP_FE(px_timestamp2string, NULL)
- ^
- /opt/install/paradox-1.4.3/paradox.c:86:2: warning: (near initialization for 'paradox_functions[24]') [enabled by default]
- /opt/install/paradox-1.4.3/paradox.c:86:2: warning: initialization makes integer from pointer without a cast [enabled by default]
- /opt/install/paradox-1.4.3/paradox.c:86:2: warning: (near initialization for 'paradox_functions[24]') [enabled by default]
- /opt/install/paradox-1.4.3/paradox.c:86:2: error: initializer element is not computable at load time
- /opt/install/paradox-1.4.3/paradox.c:86:2: error: (near initialization for 'paradox_functions[24]')
- /opt/install/paradox-1.4.3/paradox.c:86:2: warning: excess elements in scalar initializer [enabled by default]
- /opt/install/paradox-1.4.3/paradox.c:86:2: warning: (near initialization for 'paradox_functions[24]') [enabled by default]
- /opt/install/paradox-1.4.3/paradox.c:86:2: warning: excess elements in scalar initializer [enabled by default]
- /opt/install/paradox-1.4.3/paradox.c:86:2: warning: (near initialization for 'paradox_functions[24]') [enabled by default]
- In file included from /usr/include/php5/main/php.h:39:0,
- from /opt/install/paradox-1.4.3/paradox.c:25:
- /usr/include/php5/Zend/zend_API.h:71:129: warning: excess elements in scalar initializer [enabled by default]
- #define ZEND_FENTRY(zend_name, name, arg_info, flags) { #zend_name, name, arg_info, (zend_uint) (sizeof(arg_info)/sizeof(struct _zend_arg_info)-1), flags },
- ^
- /usr/include/php5/Zend/zend_API.h:77:38: note: in expansion of macro 'ZEND_FENTRY'
- #define ZEND_FE(name, arg_info) ZEND_FENTRY(name, ZEND_FN(name), arg_info, 0)
- ^
- /usr/include/php5/main/php.h:350:18: note: in expansion of macro 'ZEND_FE'
- #define PHP_FE ZEND_FE
- ^
- /opt/install/paradox-1.4.3/paradox.c:86:2: note: in expansion of macro 'PHP_FE'
- PHP_FE(px_timestamp2string, NULL)
- ^
- /usr/include/php5/Zend/zend_API.h:71:129: warning: (near initialization for 'paradox_functions[24]') [enabled by default]
- #define ZEND_FENTRY(zend_name, name, arg_info, flags) { #zend_name, name, arg_info, (zend_uint) (sizeof(arg_info)/sizeof(struct _zend_arg_info)-1), flags },
- ^
- /usr/include/php5/Zend/zend_API.h:77:38: note: in expansion of macro 'ZEND_FENTRY'
- #define ZEND_FE(name, arg_info) ZEND_FENTRY(name, ZEND_FN(name), arg_info, 0)
- ^
- /usr/include/php5/main/php.h:350:18: note: in expansion of macro 'ZEND_FE'
- #define PHP_FE ZEND_FE
- ^
- /opt/install/paradox-1.4.3/paradox.c:86:2: note: in expansion of macro 'PHP_FE'
- PHP_FE(px_timestamp2string, NULL)
- ^
- /usr/include/php5/Zend/zend_API.h:71:129: warning: excess elements in scalar initializer [enabled by default]
- #define ZEND_FENTRY(zend_name, name, arg_info, flags) { #zend_name, name, arg_info, (zend_uint) (sizeof(arg_info)/sizeof(struct _zend_arg_info)-1), flags },
- ^
- /usr/include/php5/Zend/zend_API.h:77:38: note: in expansion of macro 'ZEND_FENTRY'
- #define ZEND_FE(name, arg_info) ZEND_FENTRY(name, ZEND_FN(name), arg_info, 0)
- ^
- /usr/include/php5/main/php.h:350:18: note: in expansion of macro 'ZEND_FE'
- #define PHP_FE ZEND_FE
- ^
- /opt/install/paradox-1.4.3/paradox.c:86:2: note: in expansion of macro 'PHP_FE'
- PHP_FE(px_timestamp2string, NULL)
- ^
- /usr/include/php5/Zend/zend_API.h:71:129: warning: (near initialization for 'paradox_functions[24]') [enabled by default]
- #define ZEND_FENTRY(zend_name, name, arg_info, flags) { #zend_name, name, arg_info, (zend_uint) (sizeof(arg_info)/sizeof(struct _zend_arg_info)-1), flags },
- ^
- /usr/include/php5/Zend/zend_API.h:77:38: note: in expansion of macro 'ZEND_FENTRY'
- #define ZEND_FE(name, arg_info) ZEND_FENTRY(name, ZEND_FN(name), arg_info, 0)
- ^
- /usr/include/php5/main/php.h:350:18: note: in expansion of macro 'ZEND_FE'
- #define PHP_FE ZEND_FE
- ^
- /opt/install/paradox-1.4.3/paradox.c:86:2: note: in expansion of macro 'PHP_FE'
- PHP_FE(px_timestamp2string, NULL)
- ^
- /opt/install/paradox-1.4.3/paradox.c:87:2: warning: braces around scalar initializer [enabled by default]
- PHP_FE(px_date2string, NULL)
- ^
- /opt/install/paradox-1.4.3/paradox.c:87:2: warning: (near initialization for 'paradox_functions[25]') [enabled by default]
- /opt/install/paradox-1.4.3/paradox.c:87:2: warning: initialization makes integer from pointer without a cast [enabled by default]
- /opt/install/paradox-1.4.3/paradox.c:87:2: warning: (near initialization for 'paradox_functions[25]') [enabled by default]
- /opt/install/paradox-1.4.3/paradox.c:87:2: error: initializer element is not computable at load time
- /opt/install/paradox-1.4.3/paradox.c:87:2: error: (near initialization for 'paradox_functions[25]')
- /opt/install/paradox-1.4.3/paradox.c:87:2: warning: excess elements in scalar initializer [enabled by default]
- /opt/install/paradox-1.4.3/paradox.c:87:2: warning: (near initialization for 'paradox_functions[25]') [enabled by default]
- /opt/install/paradox-1.4.3/paradox.c:87:2: warning: excess elements in scalar initializer [enabled by default]
- /opt/install/paradox-1.4.3/paradox.c:87:2: warning: (near initialization for 'paradox_functions[25]') [enabled by default]
- In file included from /usr/include/php5/main/php.h:39:0,
- from /opt/install/paradox-1.4.3/paradox.c:25:
- /usr/include/php5/Zend/zend_API.h:71:129: warning: excess elements in scalar initializer [enabled by default]
- #define ZEND_FENTRY(zend_name, name, arg_info, flags) { #zend_name, name, arg_info, (zend_uint) (sizeof(arg_info)/sizeof(struct _zend_arg_info)-1), flags },
- ^
- /usr/include/php5/Zend/zend_API.h:77:38: note: in expansion of macro 'ZEND_FENTRY'
- #define ZEND_FE(name, arg_info) ZEND_FENTRY(name, ZEND_FN(name), arg_info, 0)
- ^
- /usr/include/php5/main/php.h:350:18: note: in expansion of macro 'ZEND_FE'
- #define PHP_FE ZEND_FE
- ^
- /opt/install/paradox-1.4.3/paradox.c:87:2: note: in expansion of macro 'PHP_FE'
- PHP_FE(px_date2string, NULL)
- ^
- /usr/include/php5/Zend/zend_API.h:71:129: warning: (near initialization for 'paradox_functions[25]') [enabled by default]
- #define ZEND_FENTRY(zend_name, name, arg_info, flags) { #zend_name, name, arg_info, (zend_uint) (sizeof(arg_info)/sizeof(struct _zend_arg_info)-1), flags },
- ^
- /usr/include/php5/Zend/zend_API.h:77:38: note: in expansion of macro 'ZEND_FENTRY'
- #define ZEND_FE(name, arg_info) ZEND_FENTRY(name, ZEND_FN(name), arg_info, 0)
- ^
- /usr/include/php5/main/php.h:350:18: note: in expansion of macro 'ZEND_FE'
- #define PHP_FE ZEND_FE
- ^
- /opt/install/paradox-1.4.3/paradox.c:87:2: note: in expansion of macro 'PHP_FE'
- PHP_FE(px_date2string, NULL)
- ^
- /usr/include/php5/Zend/zend_API.h:71:129: warning: excess elements in scalar initializer [enabled by default]
- #define ZEND_FENTRY(zend_name, name, arg_info, flags) { #zend_name, name, arg_info, (zend_uint) (sizeof(arg_info)/sizeof(struct _zend_arg_info)-1), flags },
- ^
- /usr/include/php5/Zend/zend_API.h:77:38: note: in expansion of macro 'ZEND_FENTRY'
- #define ZEND_FE(name, arg_info) ZEND_FENTRY(name, ZEND_FN(name), arg_info, 0)
- ^
- /usr/include/php5/main/php.h:350:18: note: in expansion of macro 'ZEND_FE'
- #define PHP_FE ZEND_FE
- ^
- /opt/install/paradox-1.4.3/paradox.c:87:2: note: in expansion of macro 'PHP_FE'
- PHP_FE(px_date2string, NULL)
- ^
- /usr/include/php5/Zend/zend_API.h:71:129: warning: (near initialization for 'paradox_functions[25]') [enabled by default]
- #define ZEND_FENTRY(zend_name, name, arg_info, flags) { #zend_name, name, arg_info, (zend_uint) (sizeof(arg_info)/sizeof(struct _zend_arg_info)-1), flags },
- ^
- /usr/include/php5/Zend/zend_API.h:77:38: note: in expansion of macro 'ZEND_FENTRY'
- #define ZEND_FE(name, arg_info) ZEND_FENTRY(name, ZEND_FN(name), arg_info, 0)
- ^
- /usr/include/php5/main/php.h:350:18: note: in expansion of macro 'ZEND_FE'
- #define PHP_FE ZEND_FE
- ^
- /opt/install/paradox-1.4.3/paradox.c:87:2: note: in expansion of macro 'PHP_FE'
- PHP_FE(px_date2string, NULL)
- ^
- /opt/install/paradox-1.4.3/paradox.c:88:2: warning: braces around scalar initializer [enabled by default]
- {NULL, NULL, NULL} /* Must be the last line in paradox_functions[] */
- ^
- /opt/install/paradox-1.4.3/paradox.c:88:2: warning: (near initialization for 'paradox_functions[26]') [enabled by default]
- /opt/install/paradox-1.4.3/paradox.c:88:2: warning: initialization makes integer from pointer without a cast [enabled by default]
- /opt/install/paradox-1.4.3/paradox.c:88:2: warning: (near initialization for 'paradox_functions[26]') [enabled by default]
- /opt/install/paradox-1.4.3/paradox.c:88:2: warning: excess elements in scalar initializer [enabled by default]
- /opt/install/paradox-1.4.3/paradox.c:88:2: warning: (near initialization for 'paradox_functions[26]') [enabled by default]
- /opt/install/paradox-1.4.3/paradox.c:88:2: warning: excess elements in scalar initializer [enabled by default]
- /opt/install/paradox-1.4.3/paradox.c:88:2: warning: (near initialization for 'paradox_functions[26]') [enabled by default]
- /opt/install/paradox-1.4.3/paradox.c:92:1: error: unknown type name 'function_entry'
- function_entry paradox_funcs_db[] = {
- ^
- /opt/install/paradox-1.4.3/paradox.c:93:2: warning: braces around scalar initializer [enabled by default]
- PHP_ME_MAPPING(__construct, px_new, NULL, 0)
- ^
- /opt/install/paradox-1.4.3/paradox.c:93:2: warning: (near initialization for 'paradox_funcs_db[0]') [enabled by default]
- /opt/install/paradox-1.4.3/paradox.c:93:2: warning: initialization makes integer from pointer without a cast [enabled by default]
- /opt/install/paradox-1.4.3/paradox.c:93:2: warning: (near initialization for 'paradox_funcs_db[0]') [enabled by default]
- /opt/install/paradox-1.4.3/paradox.c:93:2: error: initializer element is not computable at load time
- /opt/install/paradox-1.4.3/paradox.c:93:2: error: (near initialization for 'paradox_funcs_db[0]')
- /opt/install/paradox-1.4.3/paradox.c:93:2: warning: excess elements in scalar initializer [enabled by default]
- /opt/install/paradox-1.4.3/paradox.c:93:2: warning: (near initialization for 'paradox_funcs_db[0]') [enabled by default]
- /opt/install/paradox-1.4.3/paradox.c:93:2: warning: excess elements in scalar initializer [enabled by default]
- /opt/install/paradox-1.4.3/paradox.c:93:2: warning: (near initialization for 'paradox_funcs_db[0]') [enabled by default]
- In file included from /usr/include/php5/main/php.h:39:0,
- from /opt/install/paradox-1.4.3/paradox.c:25:
- /usr/include/php5/Zend/zend_API.h:71:129: warning: excess elements in scalar initializer [enabled by default]
- #define ZEND_FENTRY(zend_name, name, arg_info, flags) { #zend_name, name, arg_info, (zend_uint) (sizeof(arg_info)/sizeof(struct _zend_arg_info)-1), flags },
- ^
- /usr/include/php5/Zend/zend_API.h:81:57: note: in expansion of macro 'ZEND_FENTRY'
- #define ZEND_NAMED_ME(zend_name, name, arg_info, flags) ZEND_FENTRY(zend_name, name, arg_info, flags)
- ^
- /usr/include/php5/Zend/zend_API.h:86:60: note: in expansion of macro 'ZEND_NAMED_ME'
- #define ZEND_ME_MAPPING(name, func_name, arg_types, flags) ZEND_NAMED_ME(name, ZEND_FN(func_name), arg_types, flags)
- ^
- /usr/include/php5/main/php.h:357:25: note: in expansion of macro 'ZEND_ME_MAPPING'
- #define PHP_ME_MAPPING ZEND_ME_MAPPING
- ^
- /opt/install/paradox-1.4.3/paradox.c:93:2: note: in expansion of macro 'PHP_ME_MAPPING'
- PHP_ME_MAPPING(__construct, px_new, NULL, 0)
- ^
- /usr/include/php5/Zend/zend_API.h:71:129: warning: (near initialization for 'paradox_funcs_db[0]') [enabled by default]
- #define ZEND_FENTRY(zend_name, name, arg_info, flags) { #zend_name, name, arg_info, (zend_uint) (sizeof(arg_info)/sizeof(struct _zend_arg_info)-1), flags },
- ^
- /usr/include/php5/Zend/zend_API.h:81:57: note: in expansion of macro 'ZEND_FENTRY'
- #define ZEND_NAMED_ME(zend_name, name, arg_info, flags) ZEND_FENTRY(zend_name, name, arg_info, flags)
- ^
- /usr/include/php5/Zend/zend_API.h:86:60: note: in expansion of macro 'ZEND_NAMED_ME'
- #define ZEND_ME_MAPPING(name, func_name, arg_types, flags) ZEND_NAMED_ME(name, ZEND_FN(func_name), arg_types, flags)
- ^
- /usr/include/php5/main/php.h:357:25: note: in expansion of macro 'ZEND_ME_MAPPING'
- #define PHP_ME_MAPPING ZEND_ME_MAPPING
- ^
- /opt/install/paradox-1.4.3/paradox.c:93:2: note: in expansion of macro 'PHP_ME_MAPPING'
- PHP_ME_MAPPING(__construct, px_new, NULL, 0)
- ^
- /usr/include/php5/Zend/zend_API.h:71:129: warning: excess elements in scalar initializer [enabled by default]
- #define ZEND_FENTRY(zend_name, name, arg_info, flags) { #zend_name, name, arg_info, (zend_uint) (sizeof(arg_info)/sizeof(struct _zend_arg_info)-1), flags },
- ^
- /usr/include/php5/Zend/zend_API.h:81:57: note: in expansion of macro 'ZEND_FENTRY'
- #define ZEND_NAMED_ME(zend_name, name, arg_info, flags) ZEND_FENTRY(zend_name, name, arg_info, flags)
- ^
- /usr/include/php5/Zend/zend_API.h:86:60: note: in expansion of macro 'ZEND_NAMED_ME'
- #define ZEND_ME_MAPPING(name, func_name, arg_types, flags) ZEND_NAMED_ME(name, ZEND_FN(func_name), arg_types, flags)
- ^
- /usr/include/php5/main/php.h:357:25: note: in expansion of macro 'ZEND_ME_MAPPING'
- #define PHP_ME_MAPPING ZEND_ME_MAPPING
- ^
- /opt/install/paradox-1.4.3/paradox.c:93:2: note: in expansion of macro 'PHP_ME_MAPPING'
- PHP_ME_MAPPING(__construct, px_new, NULL, 0)
- ^
- /usr/include/php5/Zend/zend_API.h:71:129: warning: (near initialization for 'paradox_funcs_db[0]') [enabled by default]
- #define ZEND_FENTRY(zend_name, name, arg_info, flags) { #zend_name, name, arg_info, (zend_uint) (sizeof(arg_info)/sizeof(struct _zend_arg_info)-1), flags },
- ^
- /usr/include/php5/Zend/zend_API.h:81:57: note: in expansion of macro 'ZEND_FENTRY'
- #define ZEND_NAMED_ME(zend_name, name, arg_info, flags) ZEND_FENTRY(zend_name, name, arg_info, flags)
- ^
- /usr/include/php5/Zend/zend_API.h:86:60: note: in expansion of macro 'ZEND_NAMED_ME'
- #define ZEND_ME_MAPPING(name, func_name, arg_types, flags) ZEND_NAMED_ME(name, ZEND_FN(func_name), arg_types, flags)
- ^
- /usr/include/php5/main/php.h:357:25: note: in expansion of macro 'ZEND_ME_MAPPING'
- #define PHP_ME_MAPPING ZEND_ME_MAPPING
- ^
- /opt/install/paradox-1.4.3/paradox.c:93:2: note: in expansion of macro 'PHP_ME_MAPPING'
- PHP_ME_MAPPING(__construct, px_new, NULL, 0)
- ^
- /opt/install/paradox-1.4.3/paradox.c:94:2: warning: braces around scalar initializer [enabled by default]
- PHP_ME_MAPPING(open_fp, px_open_fp, NULL, 0)
- ^
- /opt/install/paradox-1.4.3/paradox.c:94:2: warning: (near initialization for 'paradox_funcs_db[1]') [enabled by default]
- /opt/install/paradox-1.4.3/paradox.c:94:2: warning: initialization makes integer from pointer without a cast [enabled by default]
- /opt/install/paradox-1.4.3/paradox.c:94:2: warning: (near initialization for 'paradox_funcs_db[1]') [enabled by default]
- /opt/install/paradox-1.4.3/paradox.c:94:2: error: initializer element is not computable at load time
- /opt/install/paradox-1.4.3/paradox.c:94:2: error: (near initialization for 'paradox_funcs_db[1]')
- /opt/install/paradox-1.4.3/paradox.c:94:2: warning: excess elements in scalar initializer [enabled by default]
- /opt/install/paradox-1.4.3/paradox.c:94:2: warning: (near initialization for 'paradox_funcs_db[1]') [enabled by default]
- /opt/install/paradox-1.4.3/paradox.c:94:2: warning: excess elements in scalar initializer [enabled by default]
- /opt/install/paradox-1.4.3/paradox.c:94:2: warning: (near initialization for 'paradox_funcs_db[1]') [enabled by default]
- In file included from /usr/include/php5/main/php.h:39:0,
- from /opt/install/paradox-1.4.3/paradox.c:25:
- /usr/include/php5/Zend/zend_API.h:71:129: warning: excess elements in scalar initializer [enabled by default]
- #define ZEND_FENTRY(zend_name, name, arg_info, flags) { #zend_name, name, arg_info, (zend_uint) (sizeof(arg_info)/sizeof(struct _zend_arg_info)-1), flags },
- ^
- /usr/include/php5/Zend/zend_API.h:81:57: note: in expansion of macro 'ZEND_FENTRY'
- #define ZEND_NAMED_ME(zend_name, name, arg_info, flags) ZEND_FENTRY(zend_name, name, arg_info, flags)
- ^
- /usr/include/php5/Zend/zend_API.h:86:60: note: in expansion of macro 'ZEND_NAMED_ME'
- #define ZEND_ME_MAPPING(name, func_name, arg_types, flags) ZEND_NAMED_ME(name, ZEND_FN(func_name), arg_types, flags)
- ^
- /usr/include/php5/main/php.h:357:25: note: in expansion of macro 'ZEND_ME_MAPPING'
- #define PHP_ME_MAPPING ZEND_ME_MAPPING
- ^
- /opt/install/paradox-1.4.3/paradox.c:94:2: note: in expansion of macro 'PHP_ME_MAPPING'
- PHP_ME_MAPPING(open_fp, px_open_fp, NULL, 0)
- ^
- /usr/include/php5/Zend/zend_API.h:71:129: warning: (near initialization for 'paradox_funcs_db[1]') [enabled by default]
- #define ZEND_FENTRY(zend_name, name, arg_info, flags) { #zend_name, name, arg_info, (zend_uint) (sizeof(arg_info)/sizeof(struct _zend_arg_info)-1), flags },
- ^
- /usr/include/php5/Zend/zend_API.h:81:57: note: in expansion of macro 'ZEND_FENTRY'
- #define ZEND_NAMED_ME(zend_name, name, arg_info, flags) ZEND_FENTRY(zend_name, name, arg_info, flags)
- ^
- /usr/include/php5/Zend/zend_API.h:86:60: note: in expansion of macro 'ZEND_NAMED_ME'
- #define ZEND_ME_MAPPING(name, func_name, arg_types, flags) ZEND_NAMED_ME(name, ZEND_FN(func_name), arg_types, flags)
- ^
- /usr/include/php5/main/php.h:357:25: note: in expansion of macro 'ZEND_ME_MAPPING'
- #define PHP_ME_MAPPING ZEND_ME_MAPPING
- ^
- /opt/install/paradox-1.4.3/paradox.c:94:2: note: in expansion of macro 'PHP_ME_MAPPING'
- PHP_ME_MAPPING(open_fp, px_open_fp, NULL, 0)
- ^
- /usr/include/php5/Zend/zend_API.h:71:129: warning: excess elements in scalar initializer [enabled by default]
- #define ZEND_FENTRY(zend_name, name, arg_info, flags) { #zend_name, name, arg_info, (zend_uint) (sizeof(arg_info)/sizeof(struct _zend_arg_info)-1), flags },
- ^
- /usr/include/php5/Zend/zend_API.h:81:57: note: in expansion of macro 'ZEND_FENTRY'
- #define ZEND_NAMED_ME(zend_name, name, arg_info, flags) ZEND_FENTRY(zend_name, name, arg_info, flags)
- ^
- /usr/include/php5/Zend/zend_API.h:86:60: note: in expansion of macro 'ZEND_NAMED_ME'
- #define ZEND_ME_MAPPING(name, func_name, arg_types, flags) ZEND_NAMED_ME(name, ZEND_FN(func_name), arg_types, flags)
- ^
- /usr/include/php5/main/php.h:357:25: note: in expansion of macro 'ZEND_ME_MAPPING'
- #define PHP_ME_MAPPING ZEND_ME_MAPPING
- ^
- /opt/install/paradox-1.4.3/paradox.c:94:2: note: in expansion of macro 'PHP_ME_MAPPING'
- PHP_ME_MAPPING(open_fp, px_open_fp, NULL, 0)
- ^
- /usr/include/php5/Zend/zend_API.h:71:129: warning: (near initialization for 'paradox_funcs_db[1]') [enabled by default]
- #define ZEND_FENTRY(zend_name, name, arg_info, flags) { #zend_name, name, arg_info, (zend_uint) (sizeof(arg_info)/sizeof(struct _zend_arg_info)-1), flags },
- ^
- /usr/include/php5/Zend/zend_API.h:81:57: note: in expansion of macro 'ZEND_FENTRY'
- #define ZEND_NAMED_ME(zend_name, name, arg_info, flags) ZEND_FENTRY(zend_name, name, arg_info, flags)
- ^
- /usr/include/php5/Zend/zend_API.h:86:60: note: in expansion of macro 'ZEND_NAMED_ME'
- #define ZEND_ME_MAPPING(name, func_name, arg_types, flags) ZEND_NAMED_ME(name, ZEND_FN(func_name), arg_types, flags)
- ^
- /usr/include/php5/main/php.h:357:25: note: in expansion of macro 'ZEND_ME_MAPPING'
- #define PHP_ME_MAPPING ZEND_ME_MAPPING
- ^
- /opt/install/paradox-1.4.3/paradox.c:94:2: note: in expansion of macro 'PHP_ME_MAPPING'
- PHP_ME_MAPPING(open_fp, px_open_fp, NULL, 0)
- ^
- /opt/install/paradox-1.4.3/paradox.c:95:2: warning: braces around scalar initializer [enabled by default]
- PHP_ME_MAPPING(create_fp, px_create_fp, NULL, 0)
- ^
- /opt/install/paradox-1.4.3/paradox.c:95:2: warning: (near initialization for 'paradox_funcs_db[2]') [enabled by default]
- /opt/install/paradox-1.4.3/paradox.c:95:2: warning: initialization makes integer from pointer without a cast [enabled by default]
- /opt/install/paradox-1.4.3/paradox.c:95:2: warning: (near initialization for 'paradox_funcs_db[2]') [enabled by default]
- /opt/install/paradox-1.4.3/paradox.c:95:2: error: initializer element is not computable at load time
- /opt/install/paradox-1.4.3/paradox.c:95:2: error: (near initialization for 'paradox_funcs_db[2]')
- /opt/install/paradox-1.4.3/paradox.c:95:2: warning: excess elements in scalar initializer [enabled by default]
- /opt/install/paradox-1.4.3/paradox.c:95:2: warning: (near initialization for 'paradox_funcs_db[2]') [enabled by default]
- /opt/install/paradox-1.4.3/paradox.c:95:2: warning: excess elements in scalar initializer [enabled by default]
- /opt/install/paradox-1.4.3/paradox.c:95:2: warning: (near initialization for 'paradox_funcs_db[2]') [enabled by default]
- In file included from /usr/include/php5/main/php.h:39:0,
- from /opt/install/paradox-1.4.3/paradox.c:25:
- /usr/include/php5/Zend/zend_API.h:71:129: warning: excess elements in scalar initializer [enabled by default]
- #define ZEND_FENTRY(zend_name, name, arg_info, flags) { #zend_name, name, arg_info, (zend_uint) (sizeof(arg_info)/sizeof(struct _zend_arg_info)-1), flags },
- ^
- /usr/include/php5/Zend/zend_API.h:81:57: note: in expansion of macro 'ZEND_FENTRY'
- #define ZEND_NAMED_ME(zend_name, name, arg_info, flags) ZEND_FENTRY(zend_name, name, arg_info, flags)
- ^
- /usr/include/php5/Zend/zend_API.h:86:60: note: in expansion of macro 'ZEND_NAMED_ME'
- #define ZEND_ME_MAPPING(name, func_name, arg_types, flags) ZEND_NAMED_ME(name, ZEND_FN(func_name), arg_types, flags)
- ^
- /usr/include/php5/main/php.h:357:25: note: in expansion of macro 'ZEND_ME_MAPPING'
- #define PHP_ME_MAPPING ZEND_ME_MAPPING
- ^
- /opt/install/paradox-1.4.3/paradox.c:95:2: note: in expansion of macro 'PHP_ME_MAPPING'
- PHP_ME_MAPPING(create_fp, px_create_fp, NULL, 0)
- ^
- /usr/include/php5/Zend/zend_API.h:71:129: warning: (near initialization for 'paradox_funcs_db[2]') [enabled by default]
- #define ZEND_FENTRY(zend_name, name, arg_info, flags) { #zend_name, name, arg_info, (zend_uint) (sizeof(arg_info)/sizeof(struct _zend_arg_info)-1), flags },
- ^
- /usr/include/php5/Zend/zend_API.h:81:57: note: in expansion of macro 'ZEND_FENTRY'
- #define ZEND_NAMED_ME(zend_name, name, arg_info, flags) ZEND_FENTRY(zend_name, name, arg_info, flags)
- ^
- /usr/include/php5/Zend/zend_API.h:86:60: note: in expansion of macro 'ZEND_NAMED_ME'
- #define ZEND_ME_MAPPING(name, func_name, arg_types, flags) ZEND_NAMED_ME(name, ZEND_FN(func_name), arg_types, flags)
- ^
- /usr/include/php5/main/php.h:357:25: note: in expansion of macro 'ZEND_ME_MAPPING'
- #define PHP_ME_MAPPING ZEND_ME_MAPPING
- ^
- /opt/install/paradox-1.4.3/paradox.c:95:2: note: in expansion of macro 'PHP_ME_MAPPING'
- PHP_ME_MAPPING(create_fp, px_create_fp, NULL, 0)
- ^
- /usr/include/php5/Zend/zend_API.h:71:129: warning: excess elements in scalar initializer [enabled by default]
- #define ZEND_FENTRY(zend_name, name, arg_info, flags) { #zend_name, name, arg_info, (zend_uint) (sizeof(arg_info)/sizeof(struct _zend_arg_info)-1), flags },
- ^
- /usr/include/php5/Zend/zend_API.h:81:57: note: in expansion of macro 'ZEND_FENTRY'
- #define ZEND_NAMED_ME(zend_name, name, arg_info, flags) ZEND_FENTRY(zend_name, name, arg_info, flags)
- ^
- /usr/include/php5/Zend/zend_API.h:86:60: note: in expansion of macro 'ZEND_NAMED_ME'
- #define ZEND_ME_MAPPING(name, func_name, arg_types, flags) ZEND_NAMED_ME(name, ZEND_FN(func_name), arg_types, flags)
- ^
- /usr/include/php5/main/php.h:357:25: note: in expansion of macro 'ZEND_ME_MAPPING'
- #define PHP_ME_MAPPING ZEND_ME_MAPPING
- ^
- /opt/install/paradox-1.4.3/paradox.c:95:2: note: in expansion of macro 'PHP_ME_MAPPING'
- PHP_ME_MAPPING(create_fp, px_create_fp, NULL, 0)
- ^
- /usr/include/php5/Zend/zend_API.h:71:129: warning: (near initialization for 'paradox_funcs_db[2]') [enabled by default]
- #define ZEND_FENTRY(zend_name, name, arg_info, flags) { #zend_name, name, arg_info, (zend_uint) (sizeof(arg_info)/sizeof(struct _zend_arg_info)-1), flags },
- ^
- /usr/include/php5/Zend/zend_API.h:81:57: note: in expansion of macro 'ZEND_FENTRY'
- #define ZEND_NAMED_ME(zend_name, name, arg_info, flags) ZEND_FENTRY(zend_name, name, arg_info, flags)
- ^
- /usr/include/php5/Zend/zend_API.h:86:60: note: in expansion of macro 'ZEND_NAMED_ME'
- #define ZEND_ME_MAPPING(name, func_name, arg_types, flags) ZEND_NAMED_ME(name, ZEND_FN(func_name), arg_types, flags)
- ^
- /usr/include/php5/main/php.h:357:25: note: in expansion of macro 'ZEND_ME_MAPPING'
- #define PHP_ME_MAPPING ZEND_ME_MAPPING
- ^
- /opt/install/paradox-1.4.3/paradox.c:95:2: note: in expansion of macro 'PHP_ME_MAPPING'
- PHP_ME_MAPPING(create_fp, px_create_fp, NULL, 0)
- ^
- /opt/install/paradox-1.4.3/paradox.c:96:2: warning: braces around scalar initializer [enabled by default]
- PHP_ME_MAPPING(close, px_close, NULL, 0)
- ^
- /opt/install/paradox-1.4.3/paradox.c:96:2: warning: (near initialization for 'paradox_funcs_db[3]') [enabled by default]
- /opt/install/paradox-1.4.3/paradox.c:96:2: warning: initialization makes integer from pointer without a cast [enabled by default]
- /opt/install/paradox-1.4.3/paradox.c:96:2: warning: (near initialization for 'paradox_funcs_db[3]') [enabled by default]
- /opt/install/paradox-1.4.3/paradox.c:96:2: error: initializer element is not computable at load time
- /opt/install/paradox-1.4.3/paradox.c:96:2: error: (near initialization for 'paradox_funcs_db[3]')
- /opt/install/paradox-1.4.3/paradox.c:96:2: warning: excess elements in scalar initializer [enabled by default]
- /opt/install/paradox-1.4.3/paradox.c:96:2: warning: (near initialization for 'paradox_funcs_db[3]') [enabled by default]
- /opt/install/paradox-1.4.3/paradox.c:96:2: warning: excess elements in scalar initializer [enabled by default]
- /opt/install/paradox-1.4.3/paradox.c:96:2: warning: (near initialization for 'paradox_funcs_db[3]') [enabled by default]
- In file included from /usr/include/php5/main/php.h:39:0,
- from /opt/install/paradox-1.4.3/paradox.c:25:
- /usr/include/php5/Zend/zend_API.h:71:129: warning: excess elements in scalar initializer [enabled by default]
- #define ZEND_FENTRY(zend_name, name, arg_info, flags) { #zend_name, name, arg_info, (zend_uint) (sizeof(arg_info)/sizeof(struct _zend_arg_info)-1), flags },
- ^
- /usr/include/php5/Zend/zend_API.h:81:57: note: in expansion of macro 'ZEND_FENTRY'
- #define ZEND_NAMED_ME(zend_name, name, arg_info, flags) ZEND_FENTRY(zend_name, name, arg_info, flags)
- ^
- /usr/include/php5/Zend/zend_API.h:86:60: note: in expansion of macro 'ZEND_NAMED_ME'
- #define ZEND_ME_MAPPING(name, func_name, arg_types, flags) ZEND_NAMED_ME(name, ZEND_FN(func_name), arg_types, flags)
- ^
- /usr/include/php5/main/php.h:357:25: note: in expansion of macro 'ZEND_ME_MAPPING'
- #define PHP_ME_MAPPING ZEND_ME_MAPPING
- ^
- /opt/install/paradox-1.4.3/paradox.c:96:2: note: in expansion of macro 'PHP_ME_MAPPING'
- PHP_ME_MAPPING(close, px_close, NULL, 0)
- ^
- /usr/include/php5/Zend/zend_API.h:71:129: warning: (near initialization for 'paradox_funcs_db[3]') [enabled by default]
- #define ZEND_FENTRY(zend_name, name, arg_info, flags) { #zend_name, name, arg_info, (zend_uint) (sizeof(arg_info)/sizeof(struct _zend_arg_info)-1), flags },
- ^
- /usr/include/php5/Zend/zend_API.h:81:57: note: in expansion of macro 'ZEND_FENTRY'
- #define ZEND_NAMED_ME(zend_name, name, arg_info, flags) ZEND_FENTRY(zend_name, name, arg_info, flags)
- ^
- /usr/include/php5/Zend/zend_API.h:86:60: note: in expansion of macro 'ZEND_NAMED_ME'
- #define ZEND_ME_MAPPING(name, func_name, arg_types, flags) ZEND_NAMED_ME(name, ZEND_FN(func_name), arg_types, flags)
- ^
- /usr/include/php5/main/php.h:357:25: note: in expansion of macro 'ZEND_ME_MAPPING'
- #define PHP_ME_MAPPING ZEND_ME_MAPPING
- ^
- /opt/install/paradox-1.4.3/paradox.c:96:2: note: in expansion of macro 'PHP_ME_MAPPING'
- PHP_ME_MAPPING(close, px_close, NULL, 0)
- ^
- /usr/include/php5/Zend/zend_API.h:71:129: warning: excess elements in scalar initializer [enabled by default]
- #define ZEND_FENTRY(zend_name, name, arg_info, flags) { #zend_name, name, arg_info, (zend_uint) (sizeof(arg_info)/sizeof(struct _zend_arg_info)-1), flags },
- ^
- /usr/include/php5/Zend/zend_API.h:81:57: note: in expansion of macro 'ZEND_FENTRY'
- #define ZEND_NAMED_ME(zend_name, name, arg_info, flags) ZEND_FENTRY(zend_name, name, arg_info, flags)
- ^
- /usr/include/php5/Zend/zend_API.h:86:60: note: in expansion of macro 'ZEND_NAMED_ME'
- #define ZEND_ME_MAPPING(name, func_name, arg_types, flags) ZEND_NAMED_ME(name, ZEND_FN(func_name), arg_types, flags)
- ^
- /usr/include/php5/main/php.h:357:25: note: in expansion of macro 'ZEND_ME_MAPPING'
- #define PHP_ME_MAPPING ZEND_ME_MAPPING
- ^
- /opt/install/paradox-1.4.3/paradox.c:96:2: note: in expansion of macro 'PHP_ME_MAPPING'
- PHP_ME_MAPPING(close, px_close, NULL, 0)
- ^
- /usr/include/php5/Zend/zend_API.h:71:129: warning: (near initialization for 'paradox_funcs_db[3]') [enabled by default]
- #define ZEND_FENTRY(zend_name, name, arg_info, flags) { #zend_name, name, arg_info, (zend_uint) (sizeof(arg_info)/sizeof(struct _zend_arg_info)-1), flags },
- ^
- /usr/include/php5/Zend/zend_API.h:81:57: note: in expansion of macro 'ZEND_FENTRY'
- #define ZEND_NAMED_ME(zend_name, name, arg_info, flags) ZEND_FENTRY(zend_name, name, arg_info, flags)
- ^
- /usr/include/php5/Zend/zend_API.h:86:60: note: in expansion of macro 'ZEND_NAMED_ME'
- #define ZEND_ME_MAPPING(name, func_name, arg_types, flags) ZEND_NAMED_ME(name, ZEND_FN(func_name), arg_types, flags)
- ^
- /usr/include/php5/main/php.h:357:25: note: in expansion of macro 'ZEND_ME_MAPPING'
- #define PHP_ME_MAPPING ZEND_ME_MAPPING
- ^
- /opt/install/paradox-1.4.3/paradox.c:96:2: note: in expansion of macro 'PHP_ME_MAPPING'
- PHP_ME_MAPPING(close, px_close, NULL, 0)
- ^
- /opt/install/paradox-1.4.3/paradox.c:97:2: warning: braces around scalar initializer [enabled by default]
- PHP_ME_MAPPING(numrecords, px_numrecords, NULL, 0)
- ^
- /opt/install/paradox-1.4.3/paradox.c:97:2: warning: (near initialization for 'paradox_funcs_db[4]') [enabled by default]
- /opt/install/paradox-1.4.3/paradox.c:97:2: warning: initialization makes integer from pointer without a cast [enabled by default]
- /opt/install/paradox-1.4.3/paradox.c:97:2: warning: (near initialization for 'paradox_funcs_db[4]') [enabled by default]
- /opt/install/paradox-1.4.3/paradox.c:97:2: error: initializer element is not computable at load time
- /opt/install/paradox-1.4.3/paradox.c:97:2: error: (near initialization for 'paradox_funcs_db[4]')
- /opt/install/paradox-1.4.3/paradox.c:97:2: warning: excess elements in scalar initializer [enabled by default]
- /opt/install/paradox-1.4.3/paradox.c:97:2: warning: (near initialization for 'paradox_funcs_db[4]') [enabled by default]
- /opt/install/paradox-1.4.3/paradox.c:97:2: warning: excess elements in scalar initializer [enabled by default]
- /opt/install/paradox-1.4.3/paradox.c:97:2: warning: (near initialization for 'paradox_funcs_db[4]') [enabled by default]
- In file included from /usr/include/php5/main/php.h:39:0,
- from /opt/install/paradox-1.4.3/paradox.c:25:
- /usr/include/php5/Zend/zend_API.h:71:129: warning: excess elements in scalar initializer [enabled by default]
- #define ZEND_FENTRY(zend_name, name, arg_info, flags) { #zend_name, name, arg_info, (zend_uint) (sizeof(arg_info)/sizeof(struct _zend_arg_info)-1), flags },
- ^
- /usr/include/php5/Zend/zend_API.h:81:57: note: in expansion of macro 'ZEND_FENTRY'
- #define ZEND_NAMED_ME(zend_name, name, arg_info, flags) ZEND_FENTRY(zend_name, name, arg_info, flags)
- ^
- /usr/include/php5/Zend/zend_API.h:86:60: note: in expansion of macro 'ZEND_NAMED_ME'
- #define ZEND_ME_MAPPING(name, func_name, arg_types, flags) ZEND_NAMED_ME(name, ZEND_FN(func_name), arg_types, flags)
- ^
- /usr/include/php5/main/php.h:357:25: note: in expansion of macro 'ZEND_ME_MAPPING'
- #define PHP_ME_MAPPING ZEND_ME_MAPPING
- ^
- /opt/install/paradox-1.4.3/paradox.c:97:2: note: in expansion of macro 'PHP_ME_MAPPING'
- PHP_ME_MAPPING(numrecords, px_numrecords, NULL, 0)
- ^
- /usr/include/php5/Zend/zend_API.h:71:129: warning: (near initialization for 'paradox_funcs_db[4]') [enabled by default]
- #define ZEND_FENTRY(zend_name, name, arg_info, flags) { #zend_name, name, arg_info, (zend_uint) (sizeof(arg_info)/sizeof(struct _zend_arg_info)-1), flags },
- ^
- /usr/include/php5/Zend/zend_API.h:81:57: note: in expansion of macro 'ZEND_FENTRY'
- #define ZEND_NAMED_ME(zend_name, name, arg_info, flags) ZEND_FENTRY(zend_name, name, arg_info, flags)
- ^
- /usr/include/php5/Zend/zend_API.h:86:60: note: in expansion of macro 'ZEND_NAMED_ME'
- #define ZEND_ME_MAPPING(name, func_name, arg_types, flags) ZEND_NAMED_ME(name, ZEND_FN(func_name), arg_types, flags)
- ^
- /usr/include/php5/main/php.h:357:25: note: in expansion of macro 'ZEND_ME_MAPPING'
- #define PHP_ME_MAPPING ZEND_ME_MAPPING
- ^
- /opt/install/paradox-1.4.3/paradox.c:97:2: note: in expansion of macro 'PHP_ME_MAPPING'
- PHP_ME_MAPPING(numrecords, px_numrecords, NULL, 0)
- ^
- /usr/include/php5/Zend/zend_API.h:71:129: warning: excess elements in scalar initializer [enabled by default]
- #define ZEND_FENTRY(zend_name, name, arg_info, flags) { #zend_name, name, arg_info, (zend_uint) (sizeof(arg_info)/sizeof(struct _zend_arg_info)-1), flags },
- ^
- /usr/include/php5/Zend/zend_API.h:81:57: note: in expansion of macro 'ZEND_FENTRY'
- #define ZEND_NAMED_ME(zend_name, name, arg_info, flags) ZEND_FENTRY(zend_name, name, arg_info, flags)
- ^
- /usr/include/php5/Zend/zend_API.h:86:60: note: in expansion of macro 'ZEND_NAMED_ME'
- #define ZEND_ME_MAPPING(name, func_name, arg_types, flags) ZEND_NAMED_ME(name, ZEND_FN(func_name), arg_types, flags)
- ^
- /usr/include/php5/main/php.h:357:25: note: in expansion of macro 'ZEND_ME_MAPPING'
- #define PHP_ME_MAPPING ZEND_ME_MAPPING
- ^
- /opt/install/paradox-1.4.3/paradox.c:97:2: note: in expansion of macro 'PHP_ME_MAPPING'
- PHP_ME_MAPPING(numrecords, px_numrecords, NULL, 0)
- ^
- /usr/include/php5/Zend/zend_API.h:71:129: warning: (near initialization for 'paradox_funcs_db[4]') [enabled by default]
- #define ZEND_FENTRY(zend_name, name, arg_info, flags) { #zend_name, name, arg_info, (zend_uint) (sizeof(arg_info)/sizeof(struct _zend_arg_info)-1), flags },
- ^
- /usr/include/php5/Zend/zend_API.h:81:57: note: in expansion of macro 'ZEND_FENTRY'
- #define ZEND_NAMED_ME(zend_name, name, arg_info, flags) ZEND_FENTRY(zend_name, name, arg_info, flags)
- ^
- /usr/include/php5/Zend/zend_API.h:86:60: note: in expansion of macro 'ZEND_NAMED_ME'
- #define ZEND_ME_MAPPING(name, func_name, arg_types, flags) ZEND_NAMED_ME(name, ZEND_FN(func_name), arg_types, flags)
- ^
- /usr/include/php5/main/php.h:357:25: note: in expansion of macro 'ZEND_ME_MAPPING'
- #define PHP_ME_MAPPING ZEND_ME_MAPPING
- ^
- /opt/install/paradox-1.4.3/paradox.c:97:2: note: in expansion of macro 'PHP_ME_MAPPING'
- PHP_ME_MAPPING(numrecords, px_numrecords, NULL, 0)
- ^
- /opt/install/paradox-1.4.3/paradox.c:98:2: warning: braces around scalar initializer [enabled by default]
- PHP_ME_MAPPING(numfields, px_numfields, NULL, 0)
- ^
- /opt/install/paradox-1.4.3/paradox.c:98:2: warning: (near initialization for 'paradox_funcs_db[5]') [enabled by default]
- /opt/install/paradox-1.4.3/paradox.c:98:2: warning: initialization makes integer from pointer without a cast [enabled by default]
- /opt/install/paradox-1.4.3/paradox.c:98:2: warning: (near initialization for 'paradox_funcs_db[5]') [enabled by default]
- /opt/install/paradox-1.4.3/paradox.c:98:2: error: initializer element is not computable at load time
- /opt/install/paradox-1.4.3/paradox.c:98:2: error: (near initialization for 'paradox_funcs_db[5]')
- /opt/install/paradox-1.4.3/paradox.c:98:2: warning: excess elements in scalar initializer [enabled by default]
- /opt/install/paradox-1.4.3/paradox.c:98:2: warning: (near initialization for 'paradox_funcs_db[5]') [enabled by default]
- /opt/install/paradox-1.4.3/paradox.c:98:2: warning: excess elements in scalar initializer [enabled by default]
- /opt/install/paradox-1.4.3/paradox.c:98:2: warning: (near initialization for 'paradox_funcs_db[5]') [enabled by default]
- In file included from /usr/include/php5/main/php.h:39:0,
- from /opt/install/paradox-1.4.3/paradox.c:25:
- /usr/include/php5/Zend/zend_API.h:71:129: warning: excess elements in scalar initializer [enabled by default]
- #define ZEND_FENTRY(zend_name, name, arg_info, flags) { #zend_name, name, arg_info, (zend_uint) (sizeof(arg_info)/sizeof(struct _zend_arg_info)-1), flags },
- ^
- /usr/include/php5/Zend/zend_API.h:81:57: note: in expansion of macro 'ZEND_FENTRY'
- #define ZEND_NAMED_ME(zend_name, name, arg_info, flags) ZEND_FENTRY(zend_name, name, arg_info, flags)
- ^
- /usr/include/php5/Zend/zend_API.h:86:60: note: in expansion of macro 'ZEND_NAMED_ME'
- #define ZEND_ME_MAPPING(name, func_name, arg_types, flags) ZEND_NAMED_ME(name, ZEND_FN(func_name), arg_types, flags)
- ^
- /usr/include/php5/main/php.h:357:25: note: in expansion of macro 'ZEND_ME_MAPPING'
- #define PHP_ME_MAPPING ZEND_ME_MAPPING
- ^
- /opt/install/paradox-1.4.3/paradox.c:98:2: note: in expansion of macro 'PHP_ME_MAPPING'
- PHP_ME_MAPPING(numfields, px_numfields, NULL, 0)
- ^
- /usr/include/php5/Zend/zend_API.h:71:129: warning: (near initialization for 'paradox_funcs_db[5]') [enabled by default]
- #define ZEND_FENTRY(zend_name, name, arg_info, flags) { #zend_name, name, arg_info, (zend_uint) (sizeof(arg_info)/sizeof(struct _zend_arg_info)-1), flags },
- ^
- /usr/include/php5/Zend/zend_API.h:81:57: note: in expansion of macro 'ZEND_FENTRY'
- #define ZEND_NAMED_ME(zend_name, name, arg_info, flags) ZEND_FENTRY(zend_name, name, arg_info, flags)
- ^
- /usr/include/php5/Zend/zend_API.h:86:60: note: in expansion of macro 'ZEND_NAMED_ME'
- #define ZEND_ME_MAPPING(name, func_name, arg_types, flags) ZEND_NAMED_ME(name, ZEND_FN(func_name), arg_types, flags)
- ^
- /usr/include/php5/main/php.h:357:25: note: in expansion of macro 'ZEND_ME_MAPPING'
- #define PHP_ME_MAPPING ZEND_ME_MAPPING
- ^
- /opt/install/paradox-1.4.3/paradox.c:98:2: note: in expansion of macro 'PHP_ME_MAPPING'
- PHP_ME_MAPPING(numfields, px_numfields, NULL, 0)
- ^
- /usr/include/php5/Zend/zend_API.h:71:129: warning: excess elements in scalar initializer [enabled by default]
- #define ZEND_FENTRY(zend_name, name, arg_info, flags) { #zend_name, name, arg_info, (zend_uint) (sizeof(arg_info)/sizeof(struct _zend_arg_info)-1), flags },
- ^
- /usr/include/php5/Zend/zend_API.h:81:57: note: in expansion of macro 'ZEND_FENTRY'
- #define ZEND_NAMED_ME(zend_name, name, arg_info, flags) ZEND_FENTRY(zend_name, name, arg_info, flags)
- ^
- /usr/include/php5/Zend/zend_API.h:86:60: note: in expansion of macro 'ZEND_NAMED_ME'
- #define ZEND_ME_MAPPING(name, func_name, arg_types, flags) ZEND_NAMED_ME(name, ZEND_FN(func_name), arg_types, flags)
- ^
- /usr/include/php5/main/php.h:357:25: note: in expansion of macro 'ZEND_ME_MAPPING'
- #define PHP_ME_MAPPING ZEND_ME_MAPPING
- ^
- /opt/install/paradox-1.4.3/paradox.c:98:2: note: in expansion of macro 'PHP_ME_MAPPING'
- PHP_ME_MAPPING(numfields, px_numfields, NULL, 0)
- ^
- /usr/include/php5/Zend/zend_API.h:71:129: warning: (near initialization for 'paradox_funcs_db[5]') [enabled by default]
- #define ZEND_FENTRY(zend_name, name, arg_info, flags) { #zend_name, name, arg_info, (zend_uint) (sizeof(arg_info)/sizeof(struct _zend_arg_info)-1), flags },
- ^
- /usr/include/php5/Zend/zend_API.h:81:57: note: in expansion of macro 'ZEND_FENTRY'
- #define ZEND_NAMED_ME(zend_name, name, arg_info, flags) ZEND_FENTRY(zend_name, name, arg_info, flags)
- ^
- /usr/include/php5/Zend/zend_API.h:86:60: note: in expansion of macro 'ZEND_NAMED_ME'
- #define ZEND_ME_MAPPING(name, func_name, arg_types, flags) ZEND_NAMED_ME(name, ZEND_FN(func_name), arg_types, flags)
- ^
- /usr/include/php5/main/php.h:357:25: note: in expansion of macro 'ZEND_ME_MAPPING'
- #define PHP_ME_MAPPING ZEND_ME_MAPPING
- ^
- /opt/install/paradox-1.4.3/paradox.c:98:2: note: in expansion of macro 'PHP_ME_MAPPING'
- PHP_ME_MAPPING(numfields, px_numfields, NULL, 0)
- ^
- /opt/install/paradox-1.4.3/paradox.c:99:2: warning: braces around scalar initializer [enabled by default]
- PHP_ME_MAPPING(get_record, px_get_record, NULL, 0)
- ^
- /opt/install/paradox-1.4.3/paradox.c:99:2: warning: (near initialization for 'paradox_funcs_db[6]') [enabled by default]
- /opt/install/paradox-1.4.3/paradox.c:99:2: warning: initialization makes integer from pointer without a cast [enabled by default]
- /opt/install/paradox-1.4.3/paradox.c:99:2: warning: (near initialization for 'paradox_funcs_db[6]') [enabled by default]
- /opt/install/paradox-1.4.3/paradox.c:99:2: error: initializer element is not computable at load time
- /opt/install/paradox-1.4.3/paradox.c:99:2: error: (near initialization for 'paradox_funcs_db[6]')
- /opt/install/paradox-1.4.3/paradox.c:99:2: warning: excess elements in scalar initializer [enabled by default]
- /opt/install/paradox-1.4.3/paradox.c:99:2: warning: (near initialization for 'paradox_funcs_db[6]') [enabled by default]
- /opt/install/paradox-1.4.3/paradox.c:99:2: warning: excess elements in scalar initializer [enabled by default]
- /opt/install/paradox-1.4.3/paradox.c:99:2: warning: (near initialization for 'paradox_funcs_db[6]') [enabled by default]
- In file included from /usr/include/php5/main/php.h:39:0,
- from /opt/install/paradox-1.4.3/paradox.c:25:
- /usr/include/php5/Zend/zend_API.h:71:129: warning: excess elements in scalar initializer [enabled by default]
- #define ZEND_FENTRY(zend_name, name, arg_info, flags) { #zend_name, name, arg_info, (zend_uint) (sizeof(arg_info)/sizeof(struct _zend_arg_info)-1), flags },
- ^
- /usr/include/php5/Zend/zend_API.h:81:57: note: in expansion of macro 'ZEND_FENTRY'
- #define ZEND_NAMED_ME(zend_name, name, arg_info, flags) ZEND_FENTRY(zend_name, name, arg_info, flags)
- ^
- /usr/include/php5/Zend/zend_API.h:86:60: note: in expansion of macro 'ZEND_NAMED_ME'
- #define ZEND_ME_MAPPING(name, func_name, arg_types, flags) ZEND_NAMED_ME(name, ZEND_FN(func_name), arg_types, flags)
- ^
- /usr/include/php5/main/php.h:357:25: note: in expansion of macro 'ZEND_ME_MAPPING'
- #define PHP_ME_MAPPING ZEND_ME_MAPPING
- ^
- /opt/install/paradox-1.4.3/paradox.c:99:2: note: in expansion of macro 'PHP_ME_MAPPING'
- PHP_ME_MAPPING(get_record, px_get_record, NULL, 0)
- ^
- /usr/include/php5/Zend/zend_API.h:71:129: warning: (near initialization for 'paradox_funcs_db[6]') [enabled by default]
- #define ZEND_FENTRY(zend_name, name, arg_info, flags) { #zend_name, name, arg_info, (zend_uint) (sizeof(arg_info)/sizeof(struct _zend_arg_info)-1), flags },
- ^
- /usr/include/php5/Zend/zend_API.h:81:57: note: in expansion of macro 'ZEND_FENTRY'
- #define ZEND_NAMED_ME(zend_name, name, arg_info, flags) ZEND_FENTRY(zend_name, name, arg_info, flags)
- ^
- /usr/include/php5/Zend/zend_API.h:86:60: note: in expansion of macro 'ZEND_NAMED_ME'
- #define ZEND_ME_MAPPING(name, func_name, arg_types, flags) ZEND_NAMED_ME(name, ZEND_FN(func_name), arg_types, flags)
- ^
- /usr/include/php5/main/php.h:357:25: note: in expansion of macro 'ZEND_ME_MAPPING'
- #define PHP_ME_MAPPING ZEND_ME_MAPPING
- ^
- /opt/install/paradox-1.4.3/paradox.c:99:2: note: in expansion of macro 'PHP_ME_MAPPING'
- PHP_ME_MAPPING(get_record, px_get_record, NULL, 0)
- ^
- /usr/include/php5/Zend/zend_API.h:71:129: warning: excess elements in scalar initializer [enabled by default]
- #define ZEND_FENTRY(zend_name, name, arg_info, flags) { #zend_name, name, arg_info, (zend_uint) (sizeof(arg_info)/sizeof(struct _zend_arg_info)-1), flags },
- ^
- /usr/include/php5/Zend/zend_API.h:81:57: note: in expansion of macro 'ZEND_FENTRY'
- #define ZEND_NAMED_ME(zend_name, name, arg_info, flags) ZEND_FENTRY(zend_name, name, arg_info, flags)
- ^
- /usr/include/php5/Zend/zend_API.h:86:60: note: in expansion of macro 'ZEND_NAMED_ME'
- #define ZEND_ME_MAPPING(name, func_name, arg_types, flags) ZEND_NAMED_ME(name, ZEND_FN(func_name), arg_types, flags)
- ^
- /usr/include/php5/main/php.h:357:25: note: in expansion of macro 'ZEND_ME_MAPPING'
- #define PHP_ME_MAPPING ZEND_ME_MAPPING
- ^
- /opt/install/paradox-1.4.3/paradox.c:99:2: note: in expansion of macro 'PHP_ME_MAPPING'
- PHP_ME_MAPPING(get_record, px_get_record, NULL, 0)
- ^
- /usr/include/php5/Zend/zend_API.h:71:129: warning: (near initialization for 'paradox_funcs_db[6]') [enabled by default]
- #define ZEND_FENTRY(zend_name, name, arg_info, flags) { #zend_name, name, arg_info, (zend_uint) (sizeof(arg_info)/sizeof(struct _zend_arg_info)-1), flags },
- ^
- /usr/include/php5/Zend/zend_API.h:81:57: note: in expansion of macro 'ZEND_FENTRY'
- #define ZEND_NAMED_ME(zend_name, name, arg_info, flags) ZEND_FENTRY(zend_name, name, arg_info, flags)
- ^
- /usr/include/php5/Zend/zend_API.h:86:60: note: in expansion of macro 'ZEND_NAMED_ME'
- #define ZEND_ME_MAPPING(name, func_name, arg_types, flags) ZEND_NAMED_ME(name, ZEND_FN(func_name), arg_types, flags)
- ^
- /usr/include/php5/main/php.h:357:25: note: in expansion of macro 'ZEND_ME_MAPPING'
- #define PHP_ME_MAPPING ZEND_ME_MAPPING
- ^
- /opt/install/paradox-1.4.3/paradox.c:99:2: note: in expansion of macro 'PHP_ME_MAPPING'
- PHP_ME_MAPPING(get_record, px_get_record, NULL, 0)
- ^
- /opt/install/paradox-1.4.3/paradox.c:100:2: warning: braces around scalar initializer [enabled by default]
- PHP_ME_MAPPING(put_record, px_put_record, NULL, 0)
- ^
- /opt/install/paradox-1.4.3/paradox.c:100:2: warning: (near initialization for 'paradox_funcs_db[7]') [enabled by default]
- /opt/install/paradox-1.4.3/paradox.c:100:2: warning: initialization makes integer from pointer without a cast [enabled by default]
- /opt/install/paradox-1.4.3/paradox.c:100:2: warning: (near initialization for 'paradox_funcs_db[7]') [enabled by default]
- /opt/install/paradox-1.4.3/paradox.c:100:2: error: initializer element is not computable at load time
- /opt/install/paradox-1.4.3/paradox.c:100:2: error: (near initialization for 'paradox_funcs_db[7]')
- /opt/install/paradox-1.4.3/paradox.c:100:2: warning: excess elements in scalar initializer [enabled by default]
- /opt/install/paradox-1.4.3/paradox.c:100:2: warning: (near initialization for 'paradox_funcs_db[7]') [enabled by default]
- /opt/install/paradox-1.4.3/paradox.c:100:2: warning: excess elements in scalar initializer [enabled by default]
- /opt/install/paradox-1.4.3/paradox.c:100:2: warning: (near initialization for 'paradox_funcs_db[7]') [enabled by default]
- In file included from /usr/include/php5/main/php.h:39:0,
- from /opt/install/paradox-1.4.3/paradox.c:25:
- /usr/include/php5/Zend/zend_API.h:71:129: warning: excess elements in scalar initializer [enabled by default]
- #define ZEND_FENTRY(zend_name, name, arg_info, flags) { #zend_name, name, arg_info, (zend_uint) (sizeof(arg_info)/sizeof(struct _zend_arg_info)-1), flags },
- ^
- /usr/include/php5/Zend/zend_API.h:81:57: note: in expansion of macro 'ZEND_FENTRY'
- #define ZEND_NAMED_ME(zend_name, name, arg_info, flags) ZEND_FENTRY(zend_name, name, arg_info, flags)
- ^
- /usr/include/php5/Zend/zend_API.h:86:60: note: in expansion of macro 'ZEND_NAMED_ME'
- #define ZEND_ME_MAPPING(name, func_name, arg_types, flags) ZEND_NAMED_ME(name, ZEND_FN(func_name), arg_types, flags)
- ^
- /usr/include/php5/main/php.h:357:25: note: in expansion of macro 'ZEND_ME_MAPPING'
- #define PHP_ME_MAPPING ZEND_ME_MAPPING
- ^
- /opt/install/paradox-1.4.3/paradox.c:100:2: note: in expansion of macro 'PHP_ME_MAPPING'
- PHP_ME_MAPPING(put_record, px_put_record, NULL, 0)
- ^
- /usr/include/php5/Zend/zend_API.h:71:129: warning: (near initialization for 'paradox_funcs_db[7]') [enabled by default]
- #define ZEND_FENTRY(zend_name, name, arg_info, flags) { #zend_name, name, arg_info, (zend_uint) (sizeof(arg_info)/sizeof(struct _zend_arg_info)-1), flags },
- ^
- /usr/include/php5/Zend/zend_API.h:81:57: note: in expansion of macro 'ZEND_FENTRY'
- #define ZEND_NAMED_ME(zend_name, name, arg_info, flags) ZEND_FENTRY(zend_name, name, arg_info, flags)
- ^
- /usr/include/php5/Zend/zend_API.h:86:60: note: in expansion of macro 'ZEND_NAMED_ME'
- #define ZEND_ME_MAPPING(name, func_name, arg_types, flags) ZEND_NAMED_ME(name, ZEND_FN(func_name), arg_types, flags)
- ^
- /usr/include/php5/main/php.h:357:25: note: in expansion of macro 'ZEND_ME_MAPPING'
- #define PHP_ME_MAPPING ZEND_ME_MAPPING
- ^
- /opt/install/paradox-1.4.3/paradox.c:100:2: note: in expansion of macro 'PHP_ME_MAPPING'
- PHP_ME_MAPPING(put_record, px_put_record, NULL, 0)
- ^
- /usr/include/php5/Zend/zend_API.h:71:129: warning: excess elements in scalar initializer [enabled by default]
- #define ZEND_FENTRY(zend_name, name, arg_info, flags) { #zend_name, name, arg_info, (zend_uint) (sizeof(arg_info)/sizeof(struct _zend_arg_info)-1), flags },
- ^
- /usr/include/php5/Zend/zend_API.h:81:57: note: in expansion of macro 'ZEND_FENTRY'
- #define ZEND_NAMED_ME(zend_name, name, arg_info, flags) ZEND_FENTRY(zend_name, name, arg_info, flags)
- ^
- /usr/include/php5/Zend/zend_API.h:86:60: note: in expansion of macro 'ZEND_NAMED_ME'
- #define ZEND_ME_MAPPING(name, func_name, arg_types, flags) ZEND_NAMED_ME(name, ZEND_FN(func_name), arg_types, flags)
- ^
- /usr/include/php5/main/php.h:357:25: note: in expansion of macro 'ZEND_ME_MAPPING'
- #define PHP_ME_MAPPING ZEND_ME_MAPPING
- ^
- /opt/install/paradox-1.4.3/paradox.c:100:2: note: in expansion of macro 'PHP_ME_MAPPING'
- PHP_ME_MAPPING(put_record, px_put_record, NULL, 0)
- ^
- /usr/include/php5/Zend/zend_API.h:71:129: warning: (near initialization for 'paradox_funcs_db[7]') [enabled by default]
- #define ZEND_FENTRY(zend_name, name, arg_info, flags) { #zend_name, name, arg_info, (zend_uint) (sizeof(arg_info)/sizeof(struct _zend_arg_info)-1), flags },
- ^
- /usr/include/php5/Zend/zend_API.h:81:57: note: in expansion of macro 'ZEND_FENTRY'
- #define ZEND_NAMED_ME(zend_name, name, arg_info, flags) ZEND_FENTRY(zend_name, name, arg_info, flags)
- ^
- /usr/include/php5/Zend/zend_API.h:86:60: note: in expansion of macro 'ZEND_NAMED_ME'
- #define ZEND_ME_MAPPING(name, func_name, arg_types, flags) ZEND_NAMED_ME(name, ZEND_FN(func_name), arg_types, flags)
- ^
- /usr/include/php5/main/php.h:357:25: note: in expansion of macro 'ZEND_ME_MAPPING'
- #define PHP_ME_MAPPING ZEND_ME_MAPPING
- ^
- /opt/install/paradox-1.4.3/paradox.c:100:2: note: in expansion of macro 'PHP_ME_MAPPING'
- PHP_ME_MAPPING(put_record, px_put_record, NULL, 0)
- ^
- /opt/install/paradox-1.4.3/paradox.c:102:2: warning: braces around scalar initializer [enabled by default]
- PHP_ME_MAPPING(delete_record, px_delete_record, NULL, 0)
- ^
- /opt/install/paradox-1.4.3/paradox.c:102:2: warning: (near initialization for 'paradox_funcs_db[8]') [enabled by default]
- /opt/install/paradox-1.4.3/paradox.c:102:2: warning: initialization makes integer from pointer without a cast [enabled by default]
- /opt/install/paradox-1.4.3/paradox.c:102:2: warning: (near initialization for 'paradox_funcs_db[8]') [enabled by default]
- /opt/install/paradox-1.4.3/paradox.c:102:2: error: initializer element is not computable at load time
- /opt/install/paradox-1.4.3/paradox.c:102:2: error: (near initialization for 'paradox_funcs_db[8]')
- /opt/install/paradox-1.4.3/paradox.c:102:2: warning: excess elements in scalar initializer [enabled by default]
- /opt/install/paradox-1.4.3/paradox.c:102:2: warning: (near initialization for 'paradox_funcs_db[8]') [enabled by default]
- /opt/install/paradox-1.4.3/paradox.c:102:2: warning: excess elements in scalar initializer [enabled by default]
- /opt/install/paradox-1.4.3/paradox.c:102:2: warning: (near initialization for 'paradox_funcs_db[8]') [enabled by default]
- In file included from /usr/include/php5/main/php.h:39:0,
- from /opt/install/paradox-1.4.3/paradox.c:25:
- /usr/include/php5/Zend/zend_API.h:71:129: warning: excess elements in scalar initializer [enabled by default]
- #define ZEND_FENTRY(zend_name, name, arg_info, flags) { #zend_name, name, arg_info, (zend_uint) (sizeof(arg_info)/sizeof(struct _zend_arg_info)-1), flags },
- ^
- /usr/include/php5/Zend/zend_API.h:81:57: note: in expansion of macro 'ZEND_FENTRY'
- #define ZEND_NAMED_ME(zend_name, name, arg_info, flags) ZEND_FENTRY(zend_name, name, arg_info, flags)
- ^
- /usr/include/php5/Zend/zend_API.h:86:60: note: in expansion of macro 'ZEND_NAMED_ME'
- #define ZEND_ME_MAPPING(name, func_name, arg_types, flags) ZEND_NAMED_ME(name, ZEND_FN(func_name), arg_types, flags)
- ^
- /usr/include/php5/main/php.h:357:25: note: in expansion of macro 'ZEND_ME_MAPPING'
- #define PHP_ME_MAPPING ZEND_ME_MAPPING
- ^
- /opt/install/paradox-1.4.3/paradox.c:102:2: note: in expansion of macro 'PHP_ME_MAPPING'
- PHP_ME_MAPPING(delete_record, px_delete_record, NULL, 0)
- ^
- /usr/include/php5/Zend/zend_API.h:71:129: warning: (near initialization for 'paradox_funcs_db[8]') [enabled by default]
- #define ZEND_FENTRY(zend_name, name, arg_info, flags) { #zend_name, name, arg_info, (zend_uint) (sizeof(arg_info)/sizeof(struct _zend_arg_info)-1), flags },
- ^
- /usr/include/php5/Zend/zend_API.h:81:57: note: in expansion of macro 'ZEND_FENTRY'
- #define ZEND_NAMED_ME(zend_name, name, arg_info, flags) ZEND_FENTRY(zend_name, name, arg_info, flags)
- ^
- /usr/include/php5/Zend/zend_API.h:86:60: note: in expansion of macro 'ZEND_NAMED_ME'
- #define ZEND_ME_MAPPING(name, func_name, arg_types, flags) ZEND_NAMED_ME(name, ZEND_FN(func_name), arg_types, flags)
- ^
- /usr/include/php5/main/php.h:357:25: note: in expansion of macro 'ZEND_ME_MAPPING'
- #define PHP_ME_MAPPING ZEND_ME_MAPPING
- ^
- /opt/install/paradox-1.4.3/paradox.c:102:2: note: in expansion of macro 'PHP_ME_MAPPING'
- PHP_ME_MAPPING(delete_record, px_delete_record, NULL, 0)
- ^
- /usr/include/php5/Zend/zend_API.h:71:129: warning: excess elements in scalar initializer [enabled by default]
- #define ZEND_FENTRY(zend_name, name, arg_info, flags) { #zend_name, name, arg_info, (zend_uint) (sizeof(arg_info)/sizeof(struct _zend_arg_info)-1), flags },
- ^
- /usr/include/php5/Zend/zend_API.h:81:57: note: in expansion of macro 'ZEND_FENTRY'
- #define ZEND_NAMED_ME(zend_name, name, arg_info, flags) ZEND_FENTRY(zend_name, name, arg_info, flags)
- ^
- /usr/include/php5/Zend/zend_API.h:86:60: note: in expansion of macro 'ZEND_NAMED_ME'
- #define ZEND_ME_MAPPING(name, func_name, arg_types, flags) ZEND_NAMED_ME(name, ZEND_FN(func_name), arg_types, flags)
- ^
- /usr/include/php5/main/php.h:357:25: note: in expansion of macro 'ZEND_ME_MAPPING'
- #define PHP_ME_MAPPING ZEND_ME_MAPPING
- ^
- /opt/install/paradox-1.4.3/paradox.c:102:2: note: in expansion of macro 'PHP_ME_MAPPING'
- PHP_ME_MAPPING(delete_record, px_delete_record, NULL, 0)
- ^
- /usr/include/php5/Zend/zend_API.h:71:129: warning: (near initialization for 'paradox_funcs_db[8]') [enabled by default]
- #define ZEND_FENTRY(zend_name, name, arg_info, flags) { #zend_name, name, arg_info, (zend_uint) (sizeof(arg_info)/sizeof(struct _zend_arg_info)-1), flags },
- ^
- /usr/include/php5/Zend/zend_API.h:81:57: note: in expansion of macro 'ZEND_FENTRY'
- #define ZEND_NAMED_ME(zend_name, name, arg_info, flags) ZEND_FENTRY(zend_name, name, arg_info, flags)
- ^
- /usr/include/php5/Zend/zend_API.h:86:60: note: in expansion of macro 'ZEND_NAMED_ME'
- #define ZEND_ME_MAPPING(name, func_name, arg_types, flags) ZEND_NAMED_ME(name, ZEND_FN(func_name), arg_types, flags)
- ^
- /usr/include/php5/main/php.h:357:25: note: in expansion of macro 'ZEND_ME_MAPPING'
- #define PHP_ME_MAPPING ZEND_ME_MAPPING
- ^
- /opt/install/paradox-1.4.3/paradox.c:102:2: note: in expansion of macro 'PHP_ME_MAPPING'
- PHP_ME_MAPPING(delete_record, px_delete_record, NULL, 0)
- ^
- /opt/install/paradox-1.4.3/paradox.c:105:2: warning: braces around scalar initializer [enabled by default]
- PHP_ME_MAPPING(insert_record, px_insert_record, NULL, 0)
- ^
- /opt/install/paradox-1.4.3/paradox.c:105:2: warning: (near initialization for 'paradox_funcs_db[9]') [enabled by default]
- /opt/install/paradox-1.4.3/paradox.c:105:2: warning: initialization makes integer from pointer without a cast [enabled by default]
- /opt/install/paradox-1.4.3/paradox.c:105:2: warning: (near initialization for 'paradox_funcs_db[9]') [enabled by default]
- /opt/install/paradox-1.4.3/paradox.c:105:2: error: initializer element is not computable at load time
- /opt/install/paradox-1.4.3/paradox.c:105:2: error: (near initialization for 'paradox_funcs_db[9]')
- /opt/install/paradox-1.4.3/paradox.c:105:2: warning: excess elements in scalar initializer [enabled by default]
- /opt/install/paradox-1.4.3/paradox.c:105:2: warning: (near initialization for 'paradox_funcs_db[9]') [enabled by default]
- /opt/install/paradox-1.4.3/paradox.c:105:2: warning: excess elements in scalar initializer [enabled by default]
- /opt/install/paradox-1.4.3/paradox.c:105:2: warning: (near initialization for 'paradox_funcs_db[9]') [enabled by default]
- In file included from /usr/include/php5/main/php.h:39:0,
- from /opt/install/paradox-1.4.3/paradox.c:25:
- /usr/include/php5/Zend/zend_API.h:71:129: warning: excess elements in scalar initializer [enabled by default]
- #define ZEND_FENTRY(zend_name, name, arg_info, flags) { #zend_name, name, arg_info, (zend_uint) (sizeof(arg_info)/sizeof(struct _zend_arg_info)-1), flags },
- ^
- /usr/include/php5/Zend/zend_API.h:81:57: note: in expansion of macro 'ZEND_FENTRY'
- #define ZEND_NAMED_ME(zend_name, name, arg_info, flags) ZEND_FENTRY(zend_name, name, arg_info, flags)
- ^
- /usr/include/php5/Zend/zend_API.h:86:60: note: in expansion of macro 'ZEND_NAMED_ME'
- #define ZEND_ME_MAPPING(name, func_name, arg_types, flags) ZEND_NAMED_ME(name, ZEND_FN(func_name), arg_types, flags)
- ^
- /usr/include/php5/main/php.h:357:25: note: in expansion of macro 'ZEND_ME_MAPPING'
- #define PHP_ME_MAPPING ZEND_ME_MAPPING
- ^
- /opt/install/paradox-1.4.3/paradox.c:105:2: note: in expansion of macro 'PHP_ME_MAPPING'
- PHP_ME_MAPPING(insert_record, px_insert_record, NULL, 0)
- ^
- /usr/include/php5/Zend/zend_API.h:71:129: warning: (near initialization for 'paradox_funcs_db[9]') [enabled by default]
- #define ZEND_FENTRY(zend_name, name, arg_info, flags) { #zend_name, name, arg_info, (zend_uint) (sizeof(arg_info)/sizeof(struct _zend_arg_info)-1), flags },
- ^
- /usr/include/php5/Zend/zend_API.h:81:57: note: in expansion of macro 'ZEND_FENTRY'
- #define ZEND_NAMED_ME(zend_name, name, arg_info, flags) ZEND_FENTRY(zend_name, name, arg_info, flags)
- ^
- /usr/include/php5/Zend/zend_API.h:86:60: note: in expansion of macro 'ZEND_NAMED_ME'
- #define ZEND_ME_MAPPING(name, func_name, arg_types, flags) ZEND_NAMED_ME(name, ZEND_FN(func_name), arg_types, flags)
- ^
- /usr/include/php5/main/php.h:357:25: note: in expansion of macro 'ZEND_ME_MAPPING'
- #define PHP_ME_MAPPING ZEND_ME_MAPPING
- ^
- /opt/install/paradox-1.4.3/paradox.c:105:2: note: in expansion of macro 'PHP_ME_MAPPING'
- PHP_ME_MAPPING(insert_record, px_insert_record, NULL, 0)
- ^
- /usr/include/php5/Zend/zend_API.h:71:129: warning: excess elements in scalar initializer [enabled by default]
- #define ZEND_FENTRY(zend_name, name, arg_info, flags) { #zend_name, name, arg_info, (zend_uint) (sizeof(arg_info)/sizeof(struct _zend_arg_info)-1), flags },
- ^
- /usr/include/php5/Zend/zend_API.h:81:57: note: in expansion of macro 'ZEND_FENTRY'
- #define ZEND_NAMED_ME(zend_name, name, arg_info, flags) ZEND_FENTRY(zend_name, name, arg_info, flags)
- ^
- /usr/include/php5/Zend/zend_API.h:86:60: note: in expansion of macro 'ZEND_NAMED_ME'
- #define ZEND_ME_MAPPING(name, func_name, arg_types, flags) ZEND_NAMED_ME(name, ZEND_FN(func_name), arg_types, flags)
- ^
- /usr/include/php5/main/php.h:357:25: note: in expansion of macro 'ZEND_ME_MAPPING'
- #define PHP_ME_MAPPING ZEND_ME_MAPPING
- ^
- /opt/install/paradox-1.4.3/paradox.c:105:2: note: in expansion of macro 'PHP_ME_MAPPING'
- PHP_ME_MAPPING(insert_record, px_insert_record, NULL, 0)
- ^
- /usr/include/php5/Zend/zend_API.h:71:129: warning: (near initialization for 'paradox_funcs_db[9]') [enabled by default]
- #define ZEND_FENTRY(zend_name, name, arg_info, flags) { #zend_name, name, arg_info, (zend_uint) (sizeof(arg_info)/sizeof(struct _zend_arg_info)-1), flags },
- ^
- /usr/include/php5/Zend/zend_API.h:81:57: note: in expansion of macro 'ZEND_FENTRY'
- #define ZEND_NAMED_ME(zend_name, name, arg_info, flags) ZEND_FENTRY(zend_name, name, arg_info, flags)
- ^
- /usr/include/php5/Zend/zend_API.h:86:60: note: in expansion of macro 'ZEND_NAMED_ME'
- #define ZEND_ME_MAPPING(name, func_name, arg_types, flags) ZEND_NAMED_ME(name, ZEND_FN(func_name), arg_types, flags)
- ^
- /usr/include/php5/main/php.h:357:25: note: in expansion of macro 'ZEND_ME_MAPPING'
- #define PHP_ME_MAPPING ZEND_ME_MAPPING
- ^
- /opt/install/paradox-1.4.3/paradox.c:105:2: note: in expansion of macro 'PHP_ME_MAPPING'
- PHP_ME_MAPPING(insert_record, px_insert_record, NULL, 0)
- ^
- /opt/install/paradox-1.4.3/paradox.c:108:2: warning: braces around scalar initializer [enabled by default]
- PHP_ME_MAPPING(update_record, px_update_record, NULL, 0)
- ^
- /opt/install/paradox-1.4.3/paradox.c:108:2: warning: (near initialization for 'paradox_funcs_db[10]') [enabled by default]
- /opt/install/paradox-1.4.3/paradox.c:108:2: warning: initialization makes integer from pointer without a cast [enabled by default]
- /opt/install/paradox-1.4.3/paradox.c:108:2: warning: (near initialization for 'paradox_funcs_db[10]') [enabled by default]
- /opt/install/paradox-1.4.3/paradox.c:108:2: error: initializer element is not computable at load time
- /opt/install/paradox-1.4.3/paradox.c:108:2: error: (near initialization for 'paradox_funcs_db[10]')
- /opt/install/paradox-1.4.3/paradox.c:108:2: warning: excess elements in scalar initializer [enabled by default]
- /opt/install/paradox-1.4.3/paradox.c:108:2: warning: (near initialization for 'paradox_funcs_db[10]') [enabled by default]
- /opt/install/paradox-1.4.3/paradox.c:108:2: warning: excess elements in scalar initializer [enabled by default]
- /opt/install/paradox-1.4.3/paradox.c:108:2: warning: (near initialization for 'paradox_funcs_db[10]') [enabled by default]
- In file included from /usr/include/php5/main/php.h:39:0,
- from /opt/install/paradox-1.4.3/paradox.c:25:
- /usr/include/php5/Zend/zend_API.h:71:129: warning: excess elements in scalar initializer [enabled by default]
- #define ZEND_FENTRY(zend_name, name, arg_info, flags) { #zend_name, name, arg_info, (zend_uint) (sizeof(arg_info)/sizeof(struct _zend_arg_info)-1), flags },
- ^
- /usr/include/php5/Zend/zend_API.h:81:57: note: in expansion of macro 'ZEND_FENTRY'
- #define ZEND_NAMED_ME(zend_name, name, arg_info, flags) ZEND_FENTRY(zend_name, name, arg_info, flags)
- ^
- /usr/include/php5/Zend/zend_API.h:86:60: note: in expansion of macro 'ZEND_NAMED_ME'
- #define ZEND_ME_MAPPING(name, func_name, arg_types, flags) ZEND_NAMED_ME(name, ZEND_FN(func_name), arg_types, flags)
- ^
- /usr/include/php5/main/php.h:357:25: note: in expansion of macro 'ZEND_ME_MAPPING'
- #define PHP_ME_MAPPING ZEND_ME_MAPPING
- ^
- /opt/install/paradox-1.4.3/paradox.c:108:2: note: in expansion of macro 'PHP_ME_MAPPING'
- PHP_ME_MAPPING(update_record, px_update_record, NULL, 0)
- ^
- /usr/include/php5/Zend/zend_API.h:71:129: warning: (near initialization for 'paradox_funcs_db[10]') [enabled by default]
- #define ZEND_FENTRY(zend_name, name, arg_info, flags) { #zend_name, name, arg_info, (zend_uint) (sizeof(arg_info)/sizeof(struct _zend_arg_info)-1), flags },
- ^
- /usr/include/php5/Zend/zend_API.h:81:57: note: in expansion of macro 'ZEND_FENTRY'
- #define ZEND_NAMED_ME(zend_name, name, arg_info, flags) ZEND_FENTRY(zend_name, name, arg_info, flags)
- ^
- /usr/include/php5/Zend/zend_API.h:86:60: note: in expansion of macro 'ZEND_NAMED_ME'
- #define ZEND_ME_MAPPING(name, func_name, arg_types, flags) ZEND_NAMED_ME(name, ZEND_FN(func_name), arg_types, flags)
- ^
- /usr/include/php5/main/php.h:357:25: note: in expansion of macro 'ZEND_ME_MAPPING'
- #define PHP_ME_MAPPING ZEND_ME_MAPPING
- ^
- /opt/install/paradox-1.4.3/paradox.c:108:2: note: in expansion of macro 'PHP_ME_MAPPING'
- PHP_ME_MAPPING(update_record, px_update_record, NULL, 0)
- ^
- /usr/include/php5/Zend/zend_API.h:71:129: warning: excess elements in scalar initializer [enabled by default]
- #define ZEND_FENTRY(zend_name, name, arg_info, flags) { #zend_name, name, arg_info, (zend_uint) (sizeof(arg_info)/sizeof(struct _zend_arg_info)-1), flags },
- ^
- /usr/include/php5/Zend/zend_API.h:81:57: note: in expansion of macro 'ZEND_FENTRY'
- #define ZEND_NAMED_ME(zend_name, name, arg_info, flags) ZEND_FENTRY(zend_name, name, arg_info, flags)
- ^
- /usr/include/php5/Zend/zend_API.h:86:60: note: in expansion of macro 'ZEND_NAMED_ME'
- #define ZEND_ME_MAPPING(name, func_name, arg_types, flags) ZEND_NAMED_ME(name, ZEND_FN(func_name), arg_types, flags)
- ^
- /usr/include/php5/main/php.h:357:25: note: in expansion of macro 'ZEND_ME_MAPPING'
- #define PHP_ME_MAPPING ZEND_ME_MAPPING
- ^
- /opt/install/paradox-1.4.3/paradox.c:108:2: note: in expansion of macro 'PHP_ME_MAPPING'
- PHP_ME_MAPPING(update_record, px_update_record, NULL, 0)
- ^
- /usr/include/php5/Zend/zend_API.h:71:129: warning: (near initialization for 'paradox_funcs_db[10]') [enabled by default]
- #define ZEND_FENTRY(zend_name, name, arg_info, flags) { #zend_name, name, arg_info, (zend_uint) (sizeof(arg_info)/sizeof(struct _zend_arg_info)-1), flags },
- ^
- /usr/include/php5/Zend/zend_API.h:81:57: note: in expansion of macro 'ZEND_FENTRY'
- #define ZEND_NAMED_ME(zend_name, name, arg_info, flags) ZEND_FENTRY(zend_name, name, arg_info, flags)
- ^
- /usr/include/php5/Zend/zend_API.h:86:60: note: in expansion of macro 'ZEND_NAMED_ME'
- #define ZEND_ME_MAPPING(name, func_name, arg_types, flags) ZEND_NAMED_ME(name, ZEND_FN(func_name), arg_types, flags)
- ^
- /usr/include/php5/main/php.h:357:25: note: in expansion of macro 'ZEND_ME_MAPPING'
- #define PHP_ME_MAPPING ZEND_ME_MAPPING
- ^
- /opt/install/paradox-1.4.3/paradox.c:108:2: note: in expansion of macro 'PHP_ME_MAPPING'
- PHP_ME_MAPPING(update_record, px_update_record, NULL, 0)
- ^
- /opt/install/paradox-1.4.3/paradox.c:111:2: warning: braces around scalar initializer [enabled by default]
- PHP_ME_MAPPING(retrieve_record, px_retrieve_record, NULL, 0)
- ^
- /opt/install/paradox-1.4.3/paradox.c:111:2: warning: (near initialization for 'paradox_funcs_db[11]') [enabled by default]
- /opt/install/paradox-1.4.3/paradox.c:111:2: warning: initialization makes integer from pointer without a cast [enabled by default]
- /opt/install/paradox-1.4.3/paradox.c:111:2: warning: (near initialization for 'paradox_funcs_db[11]') [enabled by default]
- /opt/install/paradox-1.4.3/paradox.c:111:2: error: initializer element is not computable at load time
- /opt/install/paradox-1.4.3/paradox.c:111:2: error: (near initialization for 'paradox_funcs_db[11]')
- /opt/install/paradox-1.4.3/paradox.c:111:2: warning: excess elements in scalar initializer [enabled by default]
- /opt/install/paradox-1.4.3/paradox.c:111:2: warning: (near initialization for 'paradox_funcs_db[11]') [enabled by default]
- /opt/install/paradox-1.4.3/paradox.c:111:2: warning: excess elements in scalar initializer [enabled by default]
- /opt/install/paradox-1.4.3/paradox.c:111:2: warning: (near initialization for 'paradox_funcs_db[11]') [enabled by default]
- In file included from /usr/include/php5/main/php.h:39:0,
- from /opt/install/paradox-1.4.3/paradox.c:25:
- /usr/include/php5/Zend/zend_API.h:71:129: warning: excess elements in scalar initializer [enabled by default]
- #define ZEND_FENTRY(zend_name, name, arg_info, flags) { #zend_name, name, arg_info, (zend_uint) (sizeof(arg_info)/sizeof(struct _zend_arg_info)-1), flags },
- ^
- /usr/include/php5/Zend/zend_API.h:81:57: note: in expansion of macro 'ZEND_FENTRY'
- #define ZEND_NAMED_ME(zend_name, name, arg_info, flags) ZEND_FENTRY(zend_name, name, arg_info, flags)
- ^
- /usr/include/php5/Zend/zend_API.h:86:60: note: in expansion of macro 'ZEND_NAMED_ME'
- #define ZEND_ME_MAPPING(name, func_name, arg_types, flags) ZEND_NAMED_ME(name, ZEND_FN(func_name), arg_types, flags)
- ^
- /usr/include/php5/main/php.h:357:25: note: in expansion of macro 'ZEND_ME_MAPPING'
- #define PHP_ME_MAPPING ZEND_ME_MAPPING
- ^
- /opt/install/paradox-1.4.3/paradox.c:111:2: note: in expansion of macro 'PHP_ME_MAPPING'
- PHP_ME_MAPPING(retrieve_record, px_retrieve_record, NULL, 0)
- ^
- /usr/include/php5/Zend/zend_API.h:71:129: warning: (near initialization for 'paradox_funcs_db[11]') [enabled by default]
- #define ZEND_FENTRY(zend_name, name, arg_info, flags) { #zend_name, name, arg_info, (zend_uint) (sizeof(arg_info)/sizeof(struct _zend_arg_info)-1), flags },
- ^
- /usr/include/php5/Zend/zend_API.h:81:57: note: in expansion of macro 'ZEND_FENTRY'
- #define ZEND_NAMED_ME(zend_name, name, arg_info, flags) ZEND_FENTRY(zend_name, name, arg_info, flags)
- ^
- /usr/include/php5/Zend/zend_API.h:86:60: note: in expansion of macro 'ZEND_NAMED_ME'
- #define ZEND_ME_MAPPING(name, func_name, arg_types, flags) ZEND_NAMED_ME(name, ZEND_FN(func_name), arg_types, flags)
- ^
- /usr/include/php5/main/php.h:357:25: note: in expansion of macro 'ZEND_ME_MAPPING'
- #define PHP_ME_MAPPING ZEND_ME_MAPPING
- ^
- /opt/install/paradox-1.4.3/paradox.c:111:2: note: in expansion of macro 'PHP_ME_MAPPING'
- PHP_ME_MAPPING(retrieve_record, px_retrieve_record, NULL, 0)
- ^
- /usr/include/php5/Zend/zend_API.h:71:129: warning: excess elements in scalar initializer [enabled by default]
- #define ZEND_FENTRY(zend_name, name, arg_info, flags) { #zend_name, name, arg_info, (zend_uint) (sizeof(arg_info)/sizeof(struct _zend_arg_info)-1), flags },
- ^
- /usr/include/php5/Zend/zend_API.h:81:57: note: in expansion of macro 'ZEND_FENTRY'
- #define ZEND_NAMED_ME(zend_name, name, arg_info, flags) ZEND_FENTRY(zend_name, name, arg_info, flags)
- ^
- /usr/include/php5/Zend/zend_API.h:86:60: note: in expansion of macro 'ZEND_NAMED_ME'
- #define ZEND_ME_MAPPING(name, func_name, arg_types, flags) ZEND_NAMED_ME(name, ZEND_FN(func_name), arg_types, flags)
- ^
- /usr/include/php5/main/php.h:357:25: note: in expansion of macro 'ZEND_ME_MAPPING'
- #define PHP_ME_MAPPING ZEND_ME_MAPPING
- ^
- /opt/install/paradox-1.4.3/paradox.c:111:2: note: in expansion of macro 'PHP_ME_MAPPING'
- PHP_ME_MAPPING(retrieve_record, px_retrieve_record, NULL, 0)
- ^
- /usr/include/php5/Zend/zend_API.h:71:129: warning: (near initialization for 'paradox_funcs_db[11]') [enabled by default]
- #define ZEND_FENTRY(zend_name, name, arg_info, flags) { #zend_name, name, arg_info, (zend_uint) (sizeof(arg_info)/sizeof(struct _zend_arg_info)-1), flags },
- ^
- /usr/include/php5/Zend/zend_API.h:81:57: note: in expansion of macro 'ZEND_FENTRY'
- #define ZEND_NAMED_ME(zend_name, name, arg_info, flags) ZEND_FENTRY(zend_name, name, arg_info, flags)
- ^
- /usr/include/php5/Zend/zend_API.h:86:60: note: in expansion of macro 'ZEND_NAMED_ME'
- #define ZEND_ME_MAPPING(name, func_name, arg_types, flags) ZEND_NAMED_ME(name, ZEND_FN(func_name), arg_types, flags)
- ^
- /usr/include/php5/main/php.h:357:25: note: in expansion of macro 'ZEND_ME_MAPPING'
- #define PHP_ME_MAPPING ZEND_ME_MAPPING
- ^
- /opt/install/paradox-1.4.3/paradox.c:111:2: note: in expansion of macro 'PHP_ME_MAPPING'
- PHP_ME_MAPPING(retrieve_record, px_retrieve_record, NULL, 0)
- ^
- /opt/install/paradox-1.4.3/paradox.c:114:2: warning: braces around scalar initializer [enabled by default]
- PHP_ME_MAPPING(pack, px_pack, NULL, 0)
- ^
- /opt/install/paradox-1.4.3/paradox.c:114:2: warning: (near initialization for 'paradox_funcs_db[12]') [enabled by default]
- /opt/install/paradox-1.4.3/paradox.c:114:2: warning: initialization makes integer from pointer without a cast [enabled by default]
- /opt/install/paradox-1.4.3/paradox.c:114:2: warning: (near initialization for 'paradox_funcs_db[12]') [enabled by default]
- /opt/install/paradox-1.4.3/paradox.c:114:2: error: initializer element is not computable at load time
- /opt/install/paradox-1.4.3/paradox.c:114:2: error: (near initialization for 'paradox_funcs_db[12]')
- /opt/install/paradox-1.4.3/paradox.c:114:2: warning: excess elements in scalar initializer [enabled by default]
- /opt/install/paradox-1.4.3/paradox.c:114:2: warning: (near initialization for 'paradox_funcs_db[12]') [enabled by default]
- /opt/install/paradox-1.4.3/paradox.c:114:2: warning: excess elements in scalar initializer [enabled by default]
- /opt/install/paradox-1.4.3/paradox.c:114:2: warning: (near initialization for 'paradox_funcs_db[12]') [enabled by default]
- In file included from /usr/include/php5/main/php.h:39:0,
- from /opt/install/paradox-1.4.3/paradox.c:25:
- /usr/include/php5/Zend/zend_API.h:71:129: warning: excess elements in scalar initializer [enabled by default]
- #define ZEND_FENTRY(zend_name, name, arg_info, flags) { #zend_name, name, arg_info, (zend_uint) (sizeof(arg_info)/sizeof(struct _zend_arg_info)-1), flags },
- ^
- /usr/include/php5/Zend/zend_API.h:81:57: note: in expansion of macro 'ZEND_FENTRY'
- #define ZEND_NAMED_ME(zend_name, name, arg_info, flags) ZEND_FENTRY(zend_name, name, arg_info, flags)
- ^
- /usr/include/php5/Zend/zend_API.h:86:60: note: in expansion of macro 'ZEND_NAMED_ME'
- #define ZEND_ME_MAPPING(name, func_name, arg_types, flags) ZEND_NAMED_ME(name, ZEND_FN(func_name), arg_types, flags)
- ^
- /usr/include/php5/main/php.h:357:25: note: in expansion of macro 'ZEND_ME_MAPPING'
- #define PHP_ME_MAPPING ZEND_ME_MAPPING
- ^
- /opt/install/paradox-1.4.3/paradox.c:114:2: note: in expansion of macro 'PHP_ME_MAPPING'
- PHP_ME_MAPPING(pack, px_pack, NULL, 0)
- ^
- /usr/include/php5/Zend/zend_API.h:71:129: warning: (near initialization for 'paradox_funcs_db[12]') [enabled by default]
- #define ZEND_FENTRY(zend_name, name, arg_info, flags) { #zend_name, name, arg_info, (zend_uint) (sizeof(arg_info)/sizeof(struct _zend_arg_info)-1), flags },
- ^
- /usr/include/php5/Zend/zend_API.h:81:57: note: in expansion of macro 'ZEND_FENTRY'
- #define ZEND_NAMED_ME(zend_name, name, arg_info, flags) ZEND_FENTRY(zend_name, name, arg_info, flags)
- ^
- /usr/include/php5/Zend/zend_API.h:86:60: note: in expansion of macro 'ZEND_NAMED_ME'
- #define ZEND_ME_MAPPING(name, func_name, arg_types, flags) ZEND_NAMED_ME(name, ZEND_FN(func_name), arg_types, flags)
- ^
- /usr/include/php5/main/php.h:357:25: note: in expansion of macro 'ZEND_ME_MAPPING'
- #define PHP_ME_MAPPING ZEND_ME_MAPPING
- ^
- /opt/install/paradox-1.4.3/paradox.c:114:2: note: in expansion of macro 'PHP_ME_MAPPING'
- PHP_ME_MAPPING(pack, px_pack, NULL, 0)
- ^
- /usr/include/php5/Zend/zend_API.h:71:129: warning: excess elements in scalar initializer [enabled by default]
- #define ZEND_FENTRY(zend_name, name, arg_info, flags) { #zend_name, name, arg_info, (zend_uint) (sizeof(arg_info)/sizeof(struct _zend_arg_info)-1), flags },
- ^
- /usr/include/php5/Zend/zend_API.h:81:57: note: in expansion of macro 'ZEND_FENTRY'
- #define ZEND_NAMED_ME(zend_name, name, arg_info, flags) ZEND_FENTRY(zend_name, name, arg_info, flags)
- ^
- /usr/include/php5/Zend/zend_API.h:86:60: note: in expansion of macro 'ZEND_NAMED_ME'
- #define ZEND_ME_MAPPING(name, func_name, arg_types, flags) ZEND_NAMED_ME(name, ZEND_FN(func_name), arg_types, flags)
- ^
- /usr/include/php5/main/php.h:357:25: note: in expansion of macro 'ZEND_ME_MAPPING'
- #define PHP_ME_MAPPING ZEND_ME_MAPPING
- ^
- /opt/install/paradox-1.4.3/paradox.c:114:2: note: in expansion of macro 'PHP_ME_MAPPING'
- PHP_ME_MAPPING(pack, px_pack, NULL, 0)
- ^
- /usr/include/php5/Zend/zend_API.h:71:129: warning: (near initialization for 'paradox_funcs_db[12]') [enabled by default]
- #define ZEND_FENTRY(zend_name, name, arg_info, flags) { #zend_name, name, arg_info, (zend_uint) (sizeof(arg_info)/sizeof(struct _zend_arg_info)-1), flags },
- ^
- /usr/include/php5/Zend/zend_API.h:81:57: note: in expansion of macro 'ZEND_FENTRY'
- #define ZEND_NAMED_ME(zend_name, name, arg_info, flags) ZEND_FENTRY(zend_name, name, arg_info, flags)
- ^
- /usr/include/php5/Zend/zend_API.h:86:60: note: in expansion of macro 'ZEND_NAMED_ME'
- #define ZEND_ME_MAPPING(name, func_name, arg_types, flags) ZEND_NAMED_ME(name, ZEND_FN(func_name), arg_types, flags)
- ^
- /usr/include/php5/main/php.h:357:25: note: in expansion of macro 'ZEND_ME_MAPPING'
- #define PHP_ME_MAPPING ZEND_ME_MAPPING
- ^
- /opt/install/paradox-1.4.3/paradox.c:114:2: note: in expansion of macro 'PHP_ME_MAPPING'
- PHP_ME_MAPPING(pack, px_pack, NULL, 0)
- ^
- /opt/install/paradox-1.4.3/paradox.c:116:2: warning: braces around scalar initializer [enabled by default]
- PHP_ME_MAPPING(get_field, px_get_field, NULL, 0)
- ^
- /opt/install/paradox-1.4.3/paradox.c:116:2: warning: (near initialization for 'paradox_funcs_db[13]') [enabled by default]
- /opt/install/paradox-1.4.3/paradox.c:116:2: warning: initialization makes integer from pointer without a cast [enabled by default]
- /opt/install/paradox-1.4.3/paradox.c:116:2: warning: (near initialization for 'paradox_funcs_db[13]') [enabled by default]
- /opt/install/paradox-1.4.3/paradox.c:116:2: error: initializer element is not computable at load time
- /opt/install/paradox-1.4.3/paradox.c:116:2: error: (near initialization for 'paradox_funcs_db[13]')
- /opt/install/paradox-1.4.3/paradox.c:116:2: warning: excess elements in scalar initializer [enabled by default]
- /opt/install/paradox-1.4.3/paradox.c:116:2: warning: (near initialization for 'paradox_funcs_db[13]') [enabled by default]
- /opt/install/paradox-1.4.3/paradox.c:116:2: warning: excess elements in scalar initializer [enabled by default]
- /opt/install/paradox-1.4.3/paradox.c:116:2: warning: (near initialization for 'paradox_funcs_db[13]') [enabled by default]
- In file included from /usr/include/php5/main/php.h:39:0,
- from /opt/install/paradox-1.4.3/paradox.c:25:
- /usr/include/php5/Zend/zend_API.h:71:129: warning: excess elements in scalar initializer [enabled by default]
- #define ZEND_FENTRY(zend_name, name, arg_info, flags) { #zend_name, name, arg_info, (zend_uint) (sizeof(arg_info)/sizeof(struct _zend_arg_info)-1), flags },
- ^
- /usr/include/php5/Zend/zend_API.h:81:57: note: in expansion of macro 'ZEND_FENTRY'
- #define ZEND_NAMED_ME(zend_name, name, arg_info, flags) ZEND_FENTRY(zend_name, name, arg_info, flags)
- ^
- /usr/include/php5/Zend/zend_API.h:86:60: note: in expansion of macro 'ZEND_NAMED_ME'
- #define ZEND_ME_MAPPING(name, func_name, arg_types, flags) ZEND_NAMED_ME(name, ZEND_FN(func_name), arg_types, flags)
- ^
- /usr/include/php5/main/php.h:357:25: note: in expansion of macro 'ZEND_ME_MAPPING'
- #define PHP_ME_MAPPING ZEND_ME_MAPPING
- ^
- /opt/install/paradox-1.4.3/paradox.c:116:2: note: in expansion of macro 'PHP_ME_MAPPING'
- PHP_ME_MAPPING(get_field, px_get_field, NULL, 0)
- ^
- /usr/include/php5/Zend/zend_API.h:71:129: warning: (near initialization for 'paradox_funcs_db[13]') [enabled by default]
- #define ZEND_FENTRY(zend_name, name, arg_info, flags) { #zend_name, name, arg_info, (zend_uint) (sizeof(arg_info)/sizeof(struct _zend_arg_info)-1), flags },
- ^
- /usr/include/php5/Zend/zend_API.h:81:57: note: in expansion of macro 'ZEND_FENTRY'
- #define ZEND_NAMED_ME(zend_name, name, arg_info, flags) ZEND_FENTRY(zend_name, name, arg_info, flags)
- ^
- /usr/include/php5/Zend/zend_API.h:86:60: note: in expansion of macro 'ZEND_NAMED_ME'
- #define ZEND_ME_MAPPING(name, func_name, arg_types, flags) ZEND_NAMED_ME(name, ZEND_FN(func_name), arg_types, flags)
- ^
- /usr/include/php5/main/php.h:357:25: note: in expansion of macro 'ZEND_ME_MAPPING'
- #define PHP_ME_MAPPING ZEND_ME_MAPPING
- ^
- /opt/install/paradox-1.4.3/paradox.c:116:2: note: in expansion of macro 'PHP_ME_MAPPING'
- PHP_ME_MAPPING(get_field, px_get_field, NULL, 0)
- ^
- /usr/include/php5/Zend/zend_API.h:71:129: warning: excess elements in scalar initializer [enabled by default]
- #define ZEND_FENTRY(zend_name, name, arg_info, flags) { #zend_name, name, arg_info, (zend_uint) (sizeof(arg_info)/sizeof(struct _zend_arg_info)-1), flags },
- ^
- /usr/include/php5/Zend/zend_API.h:81:57: note: in expansion of macro 'ZEND_FENTRY'
- #define ZEND_NAMED_ME(zend_name, name, arg_info, flags) ZEND_FENTRY(zend_name, name, arg_info, flags)
- ^
- /usr/include/php5/Zend/zend_API.h:86:60: note: in expansion of macro 'ZEND_NAMED_ME'
- #define ZEND_ME_MAPPING(name, func_name, arg_types, flags) ZEND_NAMED_ME(name, ZEND_FN(func_name), arg_types, flags)
- ^
- /usr/include/php5/main/php.h:357:25: note: in expansion of macro 'ZEND_ME_MAPPING'
- #define PHP_ME_MAPPING ZEND_ME_MAPPING
- ^
- /opt/install/paradox-1.4.3/paradox.c:116:2: note: in expansion of macro 'PHP_ME_MAPPING'
- PHP_ME_MAPPING(get_field, px_get_field, NULL, 0)
- ^
- /usr/include/php5/Zend/zend_API.h:71:129: warning: (near initialization for 'paradox_funcs_db[13]') [enabled by default]
- #define ZEND_FENTRY(zend_name, name, arg_info, flags) { #zend_name, name, arg_info, (zend_uint) (sizeof(arg_info)/sizeof(struct _zend_arg_info)-1), flags },
- ^
- /usr/include/php5/Zend/zend_API.h:81:57: note: in expansion of macro 'ZEND_FENTRY'
- #define ZEND_NAMED_ME(zend_name, name, arg_info, flags) ZEND_FENTRY(zend_name, name, arg_info, flags)
- ^
- /usr/include/php5/Zend/zend_API.h:86:60: note: in expansion of macro 'ZEND_NAMED_ME'
- #define ZEND_ME_MAPPING(name, func_name, arg_types, flags) ZEND_NAMED_ME(name, ZEND_FN(func_name), arg_types, flags)
- ^
- /usr/include/php5/main/php.h:357:25: note: in expansion of macro 'ZEND_ME_MAPPING'
- #define PHP_ME_MAPPING ZEND_ME_MAPPING
- ^
- /opt/install/paradox-1.4.3/paradox.c:116:2: note: in expansion of macro 'PHP_ME_MAPPING'
- PHP_ME_MAPPING(get_field, px_get_field, NULL, 0)
- ^
- /opt/install/paradox-1.4.3/paradox.c:117:2: warning: braces around scalar initializer [enabled by default]
- PHP_ME_MAPPING(get_schema, px_get_schema, NULL, 0)
- ^
- /opt/install/paradox-1.4.3/paradox.c:117:2: warning: (near initialization for 'paradox_funcs_db[14]') [enabled by default]
- /opt/install/paradox-1.4.3/paradox.c:117:2: warning: initialization makes integer from pointer without a cast [enabled by default]
- /opt/install/paradox-1.4.3/paradox.c:117:2: warning: (near initialization for 'paradox_funcs_db[14]') [enabled by default]
- /opt/install/paradox-1.4.3/paradox.c:117:2: error: initializer element is not computable at load time
- /opt/install/paradox-1.4.3/paradox.c:117:2: error: (near initialization for 'paradox_funcs_db[14]')
- /opt/install/paradox-1.4.3/paradox.c:117:2: warning: excess elements in scalar initializer [enabled by default]
- /opt/install/paradox-1.4.3/paradox.c:117:2: warning: (near initialization for 'paradox_funcs_db[14]') [enabled by default]
- /opt/install/paradox-1.4.3/paradox.c:117:2: warning: excess elements in scalar initializer [enabled by default]
- /opt/install/paradox-1.4.3/paradox.c:117:2: warning: (near initialization for 'paradox_funcs_db[14]') [enabled by default]
- In file included from /usr/include/php5/main/php.h:39:0,
- from /opt/install/paradox-1.4.3/paradox.c:25:
- /usr/include/php5/Zend/zend_API.h:71:129: warning: excess elements in scalar initializer [enabled by default]
- #define ZEND_FENTRY(zend_name, name, arg_info, flags) { #zend_name, name, arg_info, (zend_uint) (sizeof(arg_info)/sizeof(struct _zend_arg_info)-1), flags },
- ^
- /usr/include/php5/Zend/zend_API.h:81:57: note: in expansion of macro 'ZEND_FENTRY'
- #define ZEND_NAMED_ME(zend_name, name, arg_info, flags) ZEND_FENTRY(zend_name, name, arg_info, flags)
- ^
- /usr/include/php5/Zend/zend_API.h:86:60: note: in expansion of macro 'ZEND_NAMED_ME'
- #define ZEND_ME_MAPPING(name, func_name, arg_types, flags) ZEND_NAMED_ME(name, ZEND_FN(func_name), arg_types, flags)
- ^
- /usr/include/php5/main/php.h:357:25: note: in expansion of macro 'ZEND_ME_MAPPING'
- #define PHP_ME_MAPPING ZEND_ME_MAPPING
- ^
- /opt/install/paradox-1.4.3/paradox.c:117:2: note: in expansion of macro 'PHP_ME_MAPPING'
- PHP_ME_MAPPING(get_schema, px_get_schema, NULL, 0)
- ^
- /usr/include/php5/Zend/zend_API.h:71:129: warning: (near initialization for 'paradox_funcs_db[14]') [enabled by default]
- #define ZEND_FENTRY(zend_name, name, arg_info, flags) { #zend_name, name, arg_info, (zend_uint) (sizeof(arg_info)/sizeof(struct _zend_arg_info)-1), flags },
- ^
- /usr/include/php5/Zend/zend_API.h:81:57: note: in expansion of macro 'ZEND_FENTRY'
- #define ZEND_NAMED_ME(zend_name, name, arg_info, flags) ZEND_FENTRY(zend_name, name, arg_info, flags)
- ^
- /usr/include/php5/Zend/zend_API.h:86:60: note: in expansion of macro 'ZEND_NAMED_ME'
- #define ZEND_ME_MAPPING(name, func_name, arg_types, flags) ZEND_NAMED_ME(name, ZEND_FN(func_name), arg_types, flags)
- ^
- /usr/include/php5/main/php.h:357:25: note: in expansion of macro 'ZEND_ME_MAPPING'
- #define PHP_ME_MAPPING ZEND_ME_MAPPING
- ^
- /opt/install/paradox-1.4.3/paradox.c:117:2: note: in expansion of macro 'PHP_ME_MAPPING'
- PHP_ME_MAPPING(get_schema, px_get_schema, NULL, 0)
- ^
- /usr/include/php5/Zend/zend_API.h:71:129: warning: excess elements in scalar initializer [enabled by default]
- #define ZEND_FENTRY(zend_name, name, arg_info, flags) { #zend_name, name, arg_info, (zend_uint) (sizeof(arg_info)/sizeof(struct _zend_arg_info)-1), flags },
- ^
- /usr/include/php5/Zend/zend_API.h:81:57: note: in expansion of macro 'ZEND_FENTRY'
- #define ZEND_NAMED_ME(zend_name, name, arg_info, flags) ZEND_FENTRY(zend_name, name, arg_info, flags)
- ^
- /usr/include/php5/Zend/zend_API.h:86:60: note: in expansion of macro 'ZEND_NAMED_ME'
- #define ZEND_ME_MAPPING(name, func_name, arg_types, flags) ZEND_NAMED_ME(name, ZEND_FN(func_name), arg_types, flags)
- ^
- /usr/include/php5/main/php.h:357:25: note: in expansion of macro 'ZEND_ME_MAPPING'
- #define PHP_ME_MAPPING ZEND_ME_MAPPING
- ^
- /opt/install/paradox-1.4.3/paradox.c:117:2: note: in expansion of macro 'PHP_ME_MAPPING'
- PHP_ME_MAPPING(get_schema, px_get_schema, NULL, 0)
- ^
- /usr/include/php5/Zend/zend_API.h:71:129: warning: (near initialization for 'paradox_funcs_db[14]') [enabled by default]
- #define ZEND_FENTRY(zend_name, name, arg_info, flags) { #zend_name, name, arg_info, (zend_uint) (sizeof(arg_info)/sizeof(struct _zend_arg_info)-1), flags },
- ^
- /usr/include/php5/Zend/zend_API.h:81:57: note: in expansion of macro 'ZEND_FENTRY'
- #define ZEND_NAMED_ME(zend_name, name, arg_info, flags) ZEND_FENTRY(zend_name, name, arg_info, flags)
- ^
- /usr/include/php5/Zend/zend_API.h:86:60: note: in expansion of macro 'ZEND_NAMED_ME'
- #define ZEND_ME_MAPPING(name, func_name, arg_types, flags) ZEND_NAMED_ME(name, ZEND_FN(func_name), arg_types, flags)
- ^
- /usr/include/php5/main/php.h:357:25: note: in expansion of macro 'ZEND_ME_MAPPING'
- #define PHP_ME_MAPPING ZEND_ME_MAPPING
- ^
- /opt/install/paradox-1.4.3/paradox.c:117:2: note: in expansion of macro 'PHP_ME_MAPPING'
- PHP_ME_MAPPING(get_schema, px_get_schema, NULL, 0)
- ^
- /opt/install/paradox-1.4.3/paradox.c:118:2: warning: braces around scalar initializer [enabled by default]
- PHP_ME_MAPPING(get_info, px_get_info, NULL, 0)
- ^
- /opt/install/paradox-1.4.3/paradox.c:118:2: warning: (near initialization for 'paradox_funcs_db[15]') [enabled by default]
- /opt/install/paradox-1.4.3/paradox.c:118:2: warning: initialization makes integer from pointer without a cast [enabled by default]
- /opt/install/paradox-1.4.3/paradox.c:118:2: warning: (near initialization for 'paradox_funcs_db[15]') [enabled by default]
- /opt/install/paradox-1.4.3/paradox.c:118:2: error: initializer element is not computable at load time
- /opt/install/paradox-1.4.3/paradox.c:118:2: error: (near initialization for 'paradox_funcs_db[15]')
- /opt/install/paradox-1.4.3/paradox.c:118:2: warning: excess elements in scalar initializer [enabled by default]
- /opt/install/paradox-1.4.3/paradox.c:118:2: warning: (near initialization for 'paradox_funcs_db[15]') [enabled by default]
- /opt/install/paradox-1.4.3/paradox.c:118:2: warning: excess elements in scalar initializer [enabled by default]
- /opt/install/paradox-1.4.3/paradox.c:118:2: warning: (near initialization for 'paradox_funcs_db[15]') [enabled by default]
- In file included from /usr/include/php5/main/php.h:39:0,
- from /opt/install/paradox-1.4.3/paradox.c:25:
- /usr/include/php5/Zend/zend_API.h:71:129: warning: excess elements in scalar initializer [enabled by default]
- #define ZEND_FENTRY(zend_name, name, arg_info, flags) { #zend_name, name, arg_info, (zend_uint) (sizeof(arg_info)/sizeof(struct _zend_arg_info)-1), flags },
- ^
- /usr/include/php5/Zend/zend_API.h:81:57: note: in expansion of macro 'ZEND_FENTRY'
- #define ZEND_NAMED_ME(zend_name, name, arg_info, flags) ZEND_FENTRY(zend_name, name, arg_info, flags)
- ^
- /usr/include/php5/Zend/zend_API.h:86:60: note: in expansion of macro 'ZEND_NAMED_ME'
- #define ZEND_ME_MAPPING(name, func_name, arg_types, flags) ZEND_NAMED_ME(name, ZEND_FN(func_name), arg_types, flags)
- ^
- /usr/include/php5/main/php.h:357:25: note: in expansion of macro 'ZEND_ME_MAPPING'
- #define PHP_ME_MAPPING ZEND_ME_MAPPING
- ^
- /opt/install/paradox-1.4.3/paradox.c:118:2: note: in expansion of macro 'PHP_ME_MAPPING'
- PHP_ME_MAPPING(get_info, px_get_info, NULL, 0)
- ^
- /usr/include/php5/Zend/zend_API.h:71:129: warning: (near initialization for 'paradox_funcs_db[15]') [enabled by default]
- #define ZEND_FENTRY(zend_name, name, arg_info, flags) { #zend_name, name, arg_info, (zend_uint) (sizeof(arg_info)/sizeof(struct _zend_arg_info)-1), flags },
- ^
- /usr/include/php5/Zend/zend_API.h:81:57: note: in expansion of macro 'ZEND_FENTRY'
- #define ZEND_NAMED_ME(zend_name, name, arg_info, flags) ZEND_FENTRY(zend_name, name, arg_info, flags)
- ^
- /usr/include/php5/Zend/zend_API.h:86:60: note: in expansion of macro 'ZEND_NAMED_ME'
- #define ZEND_ME_MAPPING(name, func_name, arg_types, flags) ZEND_NAMED_ME(name, ZEND_FN(func_name), arg_types, flags)
- ^
- /usr/include/php5/main/php.h:357:25: note: in expansion of macro 'ZEND_ME_MAPPING'
- #define PHP_ME_MAPPING ZEND_ME_MAPPING
- ^
- /opt/install/paradox-1.4.3/paradox.c:118:2: note: in expansion of macro 'PHP_ME_MAPPING'
- PHP_ME_MAPPING(get_info, px_get_info, NULL, 0)
- ^
- /usr/include/php5/Zend/zend_API.h:71:129: warning: excess elements in scalar initializer [enabled by default]
- #define ZEND_FENTRY(zend_name, name, arg_info, flags) { #zend_name, name, arg_info, (zend_uint) (sizeof(arg_info)/sizeof(struct _zend_arg_info)-1), flags },
- ^
- /usr/include/php5/Zend/zend_API.h:81:57: note: in expansion of macro 'ZEND_FENTRY'
- #define ZEND_NAMED_ME(zend_name, name, arg_info, flags) ZEND_FENTRY(zend_name, name, arg_info, flags)
- ^
- /usr/include/php5/Zend/zend_API.h:86:60: note: in expansion of macro 'ZEND_NAMED_ME'
- #define ZEND_ME_MAPPING(name, func_name, arg_types, flags) ZEND_NAMED_ME(name, ZEND_FN(func_name), arg_types, flags)
- ^
- /usr/include/php5/main/php.h:357:25: note: in expansion of macro 'ZEND_ME_MAPPING'
- #define PHP_ME_MAPPING ZEND_ME_MAPPING
- ^
- /opt/install/paradox-1.4.3/paradox.c:118:2: note: in expansion of macro 'PHP_ME_MAPPING'
- PHP_ME_MAPPING(get_info, px_get_info, NULL, 0)
- ^
- /usr/include/php5/Zend/zend_API.h:71:129: warning: (near initialization for 'paradox_funcs_db[15]') [enabled by default]
- #define ZEND_FENTRY(zend_name, name, arg_info, flags) { #zend_name, name, arg_info, (zend_uint) (sizeof(arg_info)/sizeof(struct _zend_arg_info)-1), flags },
- ^
- /usr/include/php5/Zend/zend_API.h:81:57: note: in expansion of macro 'ZEND_FENTRY'
- #define ZEND_NAMED_ME(zend_name, name, arg_info, flags) ZEND_FENTRY(zend_name, name, arg_info, flags)
- ^
- /usr/include/php5/Zend/zend_API.h:86:60: note: in expansion of macro 'ZEND_NAMED_ME'
- #define ZEND_ME_MAPPING(name, func_name, arg_types, flags) ZEND_NAMED_ME(name, ZEND_FN(func_name), arg_types, flags)
- ^
- /usr/include/php5/main/php.h:357:25: note: in expansion of macro 'ZEND_ME_MAPPING'
- #define PHP_ME_MAPPING ZEND_ME_MAPPING
- ^
- /opt/install/paradox-1.4.3/paradox.c:118:2: note: in expansion of macro 'PHP_ME_MAPPING'
- PHP_ME_MAPPING(get_info, px_get_info, NULL, 0)
- ^
- /opt/install/paradox-1.4.3/paradox.c:119:2: warning: braces around scalar initializer [enabled by default]
- PHP_ME_MAPPING(set_parameter, px_set_parameter, NULL, 0)
- ^
- /opt/install/paradox-1.4.3/paradox.c:119:2: warning: (near initialization for 'paradox_funcs_db[16]') [enabled by default]
- /opt/install/paradox-1.4.3/paradox.c:119:2: warning: initialization makes integer from pointer without a cast [enabled by default]
- /opt/install/paradox-1.4.3/paradox.c:119:2: warning: (near initialization for 'paradox_funcs_db[16]') [enabled by default]
- /opt/install/paradox-1.4.3/paradox.c:119:2: error: initializer element is not computable at load time
- /opt/install/paradox-1.4.3/paradox.c:119:2: error: (near initialization for 'paradox_funcs_db[16]')
- /opt/install/paradox-1.4.3/paradox.c:119:2: warning: excess elements in scalar initializer [enabled by default]
- /opt/install/paradox-1.4.3/paradox.c:119:2: warning: (near initialization for 'paradox_funcs_db[16]') [enabled by default]
- /opt/install/paradox-1.4.3/paradox.c:119:2: warning: excess elements in scalar initializer [enabled by default]
- /opt/install/paradox-1.4.3/paradox.c:119:2: warning: (near initialization for 'paradox_funcs_db[16]') [enabled by default]
- In file included from /usr/include/php5/main/php.h:39:0,
- from /opt/install/paradox-1.4.3/paradox.c:25:
- /usr/include/php5/Zend/zend_API.h:71:129: warning: excess elements in scalar initializer [enabled by default]
- #define ZEND_FENTRY(zend_name, name, arg_info, flags) { #zend_name, name, arg_info, (zend_uint) (sizeof(arg_info)/sizeof(struct _zend_arg_info)-1), flags },
- ^
- /usr/include/php5/Zend/zend_API.h:81:57: note: in expansion of macro 'ZEND_FENTRY'
- #define ZEND_NAMED_ME(zend_name, name, arg_info, flags) ZEND_FENTRY(zend_name, name, arg_info, flags)
- ^
- /usr/include/php5/Zend/zend_API.h:86:60: note: in expansion of macro 'ZEND_NAMED_ME'
- #define ZEND_ME_MAPPING(name, func_name, arg_types, flags) ZEND_NAMED_ME(name, ZEND_FN(func_name), arg_types, flags)
- ^
- /usr/include/php5/main/php.h:357:25: note: in expansion of macro 'ZEND_ME_MAPPING'
- #define PHP_ME_MAPPING ZEND_ME_MAPPING
- ^
- /opt/install/paradox-1.4.3/paradox.c:119:2: note: in expansion of macro 'PHP_ME_MAPPING'
- PHP_ME_MAPPING(set_parameter, px_set_parameter, NULL, 0)
- ^
- /usr/include/php5/Zend/zend_API.h:71:129: warning: (near initialization for 'paradox_funcs_db[16]') [enabled by default]
- #define ZEND_FENTRY(zend_name, name, arg_info, flags) { #zend_name, name, arg_info, (zend_uint) (sizeof(arg_info)/sizeof(struct _zend_arg_info)-1), flags },
- ^
- /usr/include/php5/Zend/zend_API.h:81:57: note: in expansion of macro 'ZEND_FENTRY'
- #define ZEND_NAMED_ME(zend_name, name, arg_info, flags) ZEND_FENTRY(zend_name, name, arg_info, flags)
- ^
- /usr/include/php5/Zend/zend_API.h:86:60: note: in expansion of macro 'ZEND_NAMED_ME'
- #define ZEND_ME_MAPPING(name, func_name, arg_types, flags) ZEND_NAMED_ME(name, ZEND_FN(func_name), arg_types, flags)
- ^
- /usr/include/php5/main/php.h:357:25: note: in expansion of macro 'ZEND_ME_MAPPING'
- #define PHP_ME_MAPPING ZEND_ME_MAPPING
- ^
- /opt/install/paradox-1.4.3/paradox.c:119:2: note: in expansion of macro 'PHP_ME_MAPPING'
- PHP_ME_MAPPING(set_parameter, px_set_parameter, NULL, 0)
- ^
- /usr/include/php5/Zend/zend_API.h:71:129: warning: excess elements in scalar initializer [enabled by default]
- #define ZEND_FENTRY(zend_name, name, arg_info, flags) { #zend_name, name, arg_info, (zend_uint) (sizeof(arg_info)/sizeof(struct _zend_arg_info)-1), flags },
- ^
- /usr/include/php5/Zend/zend_API.h:81:57: note: in expansion of macro 'ZEND_FENTRY'
- #define ZEND_NAMED_ME(zend_name, name, arg_info, flags) ZEND_FENTRY(zend_name, name, arg_info, flags)
- ^
- /usr/include/php5/Zend/zend_API.h:86:60: note: in expansion of macro 'ZEND_NAMED_ME'
- #define ZEND_ME_MAPPING(name, func_name, arg_types, flags) ZEND_NAMED_ME(name, ZEND_FN(func_name), arg_types, flags)
- ^
- /usr/include/php5/main/php.h:357:25: note: in expansion of macro 'ZEND_ME_MAPPING'
- #define PHP_ME_MAPPING ZEND_ME_MAPPING
- ^
- /opt/install/paradox-1.4.3/paradox.c:119:2: note: in expansion of macro 'PHP_ME_MAPPING'
- PHP_ME_MAPPING(set_parameter, px_set_parameter, NULL, 0)
- ^
- /usr/include/php5/Zend/zend_API.h:71:129: warning: (near initialization for 'paradox_funcs_db[16]') [enabled by default]
- #define ZEND_FENTRY(zend_name, name, arg_info, flags) { #zend_name, name, arg_info, (zend_uint) (sizeof(arg_info)/sizeof(struct _zend_arg_info)-1), flags },
- ^
- /usr/include/php5/Zend/zend_API.h:81:57: note: in expansion of macro 'ZEND_FENTRY'
- #define ZEND_NAMED_ME(zend_name, name, arg_info, flags) ZEND_FENTRY(zend_name, name, arg_info, flags)
- ^
- /usr/include/php5/Zend/zend_API.h:86:60: note: in expansion of macro 'ZEND_NAMED_ME'
- #define ZEND_ME_MAPPING(name, func_name, arg_types, flags) ZEND_NAMED_ME(name, ZEND_FN(func_name), arg_types, flags)
- ^
- /usr/include/php5/main/php.h:357:25: note: in expansion of macro 'ZEND_ME_MAPPING'
- #define PHP_ME_MAPPING ZEND_ME_MAPPING
- ^
- /opt/install/paradox-1.4.3/paradox.c:119:2: note: in expansion of macro 'PHP_ME_MAPPING'
- PHP_ME_MAPPING(set_parameter, px_set_parameter, NULL, 0)
- ^
- /opt/install/paradox-1.4.3/paradox.c:120:2: warning: braces around scalar initializer [enabled by default]
- PHP_ME_MAPPING(get_parameter, px_get_parameter, NULL, 0)
- ^
- /opt/install/paradox-1.4.3/paradox.c:120:2: warning: (near initialization for 'paradox_funcs_db[17]') [enabled by default]
- /opt/install/paradox-1.4.3/paradox.c:120:2: warning: initialization makes integer from pointer without a cast [enabled by default]
- /opt/install/paradox-1.4.3/paradox.c:120:2: warning: (near initialization for 'paradox_funcs_db[17]') [enabled by default]
- /opt/install/paradox-1.4.3/paradox.c:120:2: error: initializer element is not computable at load time
- /opt/install/paradox-1.4.3/paradox.c:120:2: error: (near initialization for 'paradox_funcs_db[17]')
- /opt/install/paradox-1.4.3/paradox.c:120:2: warning: excess elements in scalar initializer [enabled by default]
- /opt/install/paradox-1.4.3/paradox.c:120:2: warning: (near initialization for 'paradox_funcs_db[17]') [enabled by default]
- /opt/install/paradox-1.4.3/paradox.c:120:2: warning: excess elements in scalar initializer [enabled by default]
- /opt/install/paradox-1.4.3/paradox.c:120:2: warning: (near initialization for 'paradox_funcs_db[17]') [enabled by default]
- In file included from /usr/include/php5/main/php.h:39:0,
- from /opt/install/paradox-1.4.3/paradox.c:25:
- /usr/include/php5/Zend/zend_API.h:71:129: warning: excess elements in scalar initializer [enabled by default]
- #define ZEND_FENTRY(zend_name, name, arg_info, flags) { #zend_name, name, arg_info, (zend_uint) (sizeof(arg_info)/sizeof(struct _zend_arg_info)-1), flags },
- ^
- /usr/include/php5/Zend/zend_API.h:81:57: note: in expansion of macro 'ZEND_FENTRY'
- #define ZEND_NAMED_ME(zend_name, name, arg_info, flags) ZEND_FENTRY(zend_name, name, arg_info, flags)
- ^
- /usr/include/php5/Zend/zend_API.h:86:60: note: in expansion of macro 'ZEND_NAMED_ME'
- #define ZEND_ME_MAPPING(name, func_name, arg_types, flags) ZEND_NAMED_ME(name, ZEND_FN(func_name), arg_types, flags)
- ^
- /usr/include/php5/main/php.h:357:25: note: in expansion of macro 'ZEND_ME_MAPPING'
- #define PHP_ME_MAPPING ZEND_ME_MAPPING
- ^
- /opt/install/paradox-1.4.3/paradox.c:120:2: note: in expansion of macro 'PHP_ME_MAPPING'
- PHP_ME_MAPPING(get_parameter, px_get_parameter, NULL, 0)
- ^
- /usr/include/php5/Zend/zend_API.h:71:129: warning: (near initialization for 'paradox_funcs_db[17]') [enabled by default]
- #define ZEND_FENTRY(zend_name, name, arg_info, flags) { #zend_name, name, arg_info, (zend_uint) (sizeof(arg_info)/sizeof(struct _zend_arg_info)-1), flags },
- ^
- /usr/include/php5/Zend/zend_API.h:81:57: note: in expansion of macro 'ZEND_FENTRY'
- #define ZEND_NAMED_ME(zend_name, name, arg_info, flags) ZEND_FENTRY(zend_name, name, arg_info, flags)
- ^
- /usr/include/php5/Zend/zend_API.h:86:60: note: in expansion of macro 'ZEND_NAMED_ME'
- #define ZEND_ME_MAPPING(name, func_name, arg_types, flags) ZEND_NAMED_ME(name, ZEND_FN(func_name), arg_types, flags)
- ^
- /usr/include/php5/main/php.h:357:25: note: in expansion of macro 'ZEND_ME_MAPPING'
- #define PHP_ME_MAPPING ZEND_ME_MAPPING
- ^
- /opt/install/paradox-1.4.3/paradox.c:120:2: note: in expansion of macro 'PHP_ME_MAPPING'
- PHP_ME_MAPPING(get_parameter, px_get_parameter, NULL, 0)
- ^
- /usr/include/php5/Zend/zend_API.h:71:129: warning: excess elements in scalar initializer [enabled by default]
- #define ZEND_FENTRY(zend_name, name, arg_info, flags) { #zend_name, name, arg_info, (zend_uint) (sizeof(arg_info)/sizeof(struct _zend_arg_info)-1), flags },
- ^
- /usr/include/php5/Zend/zend_API.h:81:57: note: in expansion of macro 'ZEND_FENTRY'
- #define ZEND_NAMED_ME(zend_name, name, arg_info, flags) ZEND_FENTRY(zend_name, name, arg_info, flags)
- ^
- /usr/include/php5/Zend/zend_API.h:86:60: note: in expansion of macro 'ZEND_NAMED_ME'
- #define ZEND_ME_MAPPING(name, func_name, arg_types, flags) ZEND_NAMED_ME(name, ZEND_FN(func_name), arg_types, flags)
- ^
- /usr/include/php5/main/php.h:357:25: note: in expansion of macro 'ZEND_ME_MAPPING'
- #define PHP_ME_MAPPING ZEND_ME_MAPPING
- ^
- /opt/install/paradox-1.4.3/paradox.c:120:2: note: in expansion of macro 'PHP_ME_MAPPING'
- PHP_ME_MAPPING(get_parameter, px_get_parameter, NULL, 0)
- ^
- /usr/include/php5/Zend/zend_API.h:71:129: warning: (near initialization for 'paradox_funcs_db[17]') [enabled by default]
- #define ZEND_FENTRY(zend_name, name, arg_info, flags) { #zend_name, name, arg_info, (zend_uint) (sizeof(arg_info)/sizeof(struct _zend_arg_info)-1), flags },
- ^
- /usr/include/php5/Zend/zend_API.h:81:57: note: in expansion of macro 'ZEND_FENTRY'
- #define ZEND_NAMED_ME(zend_name, name, arg_info, flags) ZEND_FENTRY(zend_name, name, arg_info, flags)
- ^
- /usr/include/php5/Zend/zend_API.h:86:60: note: in expansion of macro 'ZEND_NAMED_ME'
- #define ZEND_ME_MAPPING(name, func_name, arg_types, flags) ZEND_NAMED_ME(name, ZEND_FN(func_name), arg_types, flags)
- ^
- /usr/include/php5/main/php.h:357:25: note: in expansion of macro 'ZEND_ME_MAPPING'
- #define PHP_ME_MAPPING ZEND_ME_MAPPING
- ^
- /opt/install/paradox-1.4.3/paradox.c:120:2: note: in expansion of macro 'PHP_ME_MAPPING'
- PHP_ME_MAPPING(get_parameter, px_get_parameter, NULL, 0)
- ^
- /opt/install/paradox-1.4.3/paradox.c:121:2: warning: braces around scalar initializer [enabled by default]
- PHP_ME_MAPPING(set_value, px_set_value, NULL, 0)
- ^
- /opt/install/paradox-1.4.3/paradox.c:121:2: warning: (near initialization for 'paradox_funcs_db[18]') [enabled by default]
- /opt/install/paradox-1.4.3/paradox.c:121:2: warning: initialization makes integer from pointer without a cast [enabled by default]
- /opt/install/paradox-1.4.3/paradox.c:121:2: warning: (near initialization for 'paradox_funcs_db[18]') [enabled by default]
- /opt/install/paradox-1.4.3/paradox.c:121:2: error: initializer element is not computable at load time
- /opt/install/paradox-1.4.3/paradox.c:121:2: error: (near initialization for 'paradox_funcs_db[18]')
- /opt/install/paradox-1.4.3/paradox.c:121:2: warning: excess elements in scalar initializer [enabled by default]
- /opt/install/paradox-1.4.3/paradox.c:121:2: warning: (near initialization for 'paradox_funcs_db[18]') [enabled by default]
- /opt/install/paradox-1.4.3/paradox.c:121:2: warning: excess elements in scalar initializer [enabled by default]
- /opt/install/paradox-1.4.3/paradox.c:121:2: warning: (near initialization for 'paradox_funcs_db[18]') [enabled by default]
- In file included from /usr/include/php5/main/php.h:39:0,
- from /opt/install/paradox-1.4.3/paradox.c:25:
- /usr/include/php5/Zend/zend_API.h:71:129: warning: excess elements in scalar initializer [enabled by default]
- #define ZEND_FENTRY(zend_name, name, arg_info, flags) { #zend_name, name, arg_info, (zend_uint) (sizeof(arg_info)/sizeof(struct _zend_arg_info)-1), flags },
- ^
- /usr/include/php5/Zend/zend_API.h:81:57: note: in expansion of macro 'ZEND_FENTRY'
- #define ZEND_NAMED_ME(zend_name, name, arg_info, flags) ZEND_FENTRY(zend_name, name, arg_info, flags)
- ^
- /usr/include/php5/Zend/zend_API.h:86:60: note: in expansion of macro 'ZEND_NAMED_ME'
- #define ZEND_ME_MAPPING(name, func_name, arg_types, flags) ZEND_NAMED_ME(name, ZEND_FN(func_name), arg_types, flags)
- ^
- /usr/include/php5/main/php.h:357:25: note: in expansion of macro 'ZEND_ME_MAPPING'
- #define PHP_ME_MAPPING ZEND_ME_MAPPING
- ^
- /opt/install/paradox-1.4.3/paradox.c:121:2: note: in expansion of macro 'PHP_ME_MAPPING'
- PHP_ME_MAPPING(set_value, px_set_value, NULL, 0)
- ^
- /usr/include/php5/Zend/zend_API.h:71:129: warning: (near initialization for 'paradox_funcs_db[18]') [enabled by default]
- #define ZEND_FENTRY(zend_name, name, arg_info, flags) { #zend_name, name, arg_info, (zend_uint) (sizeof(arg_info)/sizeof(struct _zend_arg_info)-1), flags },
- ^
- /usr/include/php5/Zend/zend_API.h:81:57: note: in expansion of macro 'ZEND_FENTRY'
- #define ZEND_NAMED_ME(zend_name, name, arg_info, flags) ZEND_FENTRY(zend_name, name, arg_info, flags)
- ^
- /usr/include/php5/Zend/zend_API.h:86:60: note: in expansion of macro 'ZEND_NAMED_ME'
- #define ZEND_ME_MAPPING(name, func_name, arg_types, flags) ZEND_NAMED_ME(name, ZEND_FN(func_name), arg_types, flags)
- ^
- /usr/include/php5/main/php.h:357:25: note: in expansion of macro 'ZEND_ME_MAPPING'
- #define PHP_ME_MAPPING ZEND_ME_MAPPING
- ^
- /opt/install/paradox-1.4.3/paradox.c:121:2: note: in expansion of macro 'PHP_ME_MAPPING'
- PHP_ME_MAPPING(set_value, px_set_value, NULL, 0)
- ^
- /usr/include/php5/Zend/zend_API.h:71:129: warning: excess elements in scalar initializer [enabled by default]
- #define ZEND_FENTRY(zend_name, name, arg_info, flags) { #zend_name, name, arg_info, (zend_uint) (sizeof(arg_info)/sizeof(struct _zend_arg_info)-1), flags },
- ^
- /usr/include/php5/Zend/zend_API.h:81:57: note: in expansion of macro 'ZEND_FENTRY'
- #define ZEND_NAMED_ME(zend_name, name, arg_info, flags) ZEND_FENTRY(zend_name, name, arg_info, flags)
- ^
- /usr/include/php5/Zend/zend_API.h:86:60: note: in expansion of macro 'ZEND_NAMED_ME'
- #define ZEND_ME_MAPPING(name, func_name, arg_types, flags) ZEND_NAMED_ME(name, ZEND_FN(func_name), arg_types, flags)
- ^
- /usr/include/php5/main/php.h:357:25: note: in expansion of macro 'ZEND_ME_MAPPING'
- #define PHP_ME_MAPPING ZEND_ME_MAPPING
- ^
- /opt/install/paradox-1.4.3/paradox.c:121:2: note: in expansion of macro 'PHP_ME_MAPPING'
- PHP_ME_MAPPING(set_value, px_set_value, NULL, 0)
- ^
- /usr/include/php5/Zend/zend_API.h:71:129: warning: (near initialization for 'paradox_funcs_db[18]') [enabled by default]
- #define ZEND_FENTRY(zend_name, name, arg_info, flags) { #zend_name, name, arg_info, (zend_uint) (sizeof(arg_info)/sizeof(struct _zend_arg_info)-1), flags },
- ^
- /usr/include/php5/Zend/zend_API.h:81:57: note: in expansion of macro 'ZEND_FENTRY'
- #define ZEND_NAMED_ME(zend_name, name, arg_info, flags) ZEND_FENTRY(zend_name, name, arg_info, flags)
- ^
- /usr/include/php5/Zend/zend_API.h:86:60: note: in expansion of macro 'ZEND_NAMED_ME'
- #define ZEND_ME_MAPPING(name, func_name, arg_types, flags) ZEND_NAMED_ME(name, ZEND_FN(func_name), arg_types, flags)
- ^
- /usr/include/php5/main/php.h:357:25: note: in expansion of macro 'ZEND_ME_MAPPING'
- #define PHP_ME_MAPPING ZEND_ME_MAPPING
- ^
- /opt/install/paradox-1.4.3/paradox.c:121:2: note: in expansion of macro 'PHP_ME_MAPPING'
- PHP_ME_MAPPING(set_value, px_set_value, NULL, 0)
- ^
- /opt/install/paradox-1.4.3/paradox.c:122:2: warning: braces around scalar initializer [enabled by default]
- PHP_ME_MAPPING(get_value, px_get_value, NULL, 0)
- ^
- /opt/install/paradox-1.4.3/paradox.c:122:2: warning: (near initialization for 'paradox_funcs_db[19]') [enabled by default]
- /opt/install/paradox-1.4.3/paradox.c:122:2: warning: initialization makes integer from pointer without a cast [enabled by default]
- /opt/install/paradox-1.4.3/paradox.c:122:2: warning: (near initialization for 'paradox_funcs_db[19]') [enabled by default]
- /opt/install/paradox-1.4.3/paradox.c:122:2: error: initializer element is not computable at load time
- /opt/install/paradox-1.4.3/paradox.c:122:2: error: (near initialization for 'paradox_funcs_db[19]')
- /opt/install/paradox-1.4.3/paradox.c:122:2: warning: excess elements in scalar initializer [enabled by default]
- /opt/install/paradox-1.4.3/paradox.c:122:2: warning: (near initialization for 'paradox_funcs_db[19]') [enabled by default]
- /opt/install/paradox-1.4.3/paradox.c:122:2: warning: excess elements in scalar initializer [enabled by default]
- /opt/install/paradox-1.4.3/paradox.c:122:2: warning: (near initialization for 'paradox_funcs_db[19]') [enabled by default]
- In file included from /usr/include/php5/main/php.h:39:0,
- from /opt/install/paradox-1.4.3/paradox.c:25:
- /usr/include/php5/Zend/zend_API.h:71:129: warning: excess elements in scalar initializer [enabled by default]
- #define ZEND_FENTRY(zend_name, name, arg_info, flags) { #zend_name, name, arg_info, (zend_uint) (sizeof(arg_info)/sizeof(struct _zend_arg_info)-1), flags },
- ^
- /usr/include/php5/Zend/zend_API.h:81:57: note: in expansion of macro 'ZEND_FENTRY'
- #define ZEND_NAMED_ME(zend_name, name, arg_info, flags) ZEND_FENTRY(zend_name, name, arg_info, flags)
- ^
- /usr/include/php5/Zend/zend_API.h:86:60: note: in expansion of macro 'ZEND_NAMED_ME'
- #define ZEND_ME_MAPPING(name, func_name, arg_types, flags) ZEND_NAMED_ME(name, ZEND_FN(func_name), arg_types, flags)
- ^
- /usr/include/php5/main/php.h:357:25: note: in expansion of macro 'ZEND_ME_MAPPING'
- #define PHP_ME_MAPPING ZEND_ME_MAPPING
- ^
- /opt/install/paradox-1.4.3/paradox.c:122:2: note: in expansion of macro 'PHP_ME_MAPPING'
- PHP_ME_MAPPING(get_value, px_get_value, NULL, 0)
- ^
- /usr/include/php5/Zend/zend_API.h:71:129: warning: (near initialization for 'paradox_funcs_db[19]') [enabled by default]
- #define ZEND_FENTRY(zend_name, name, arg_info, flags) { #zend_name, name, arg_info, (zend_uint) (sizeof(arg_info)/sizeof(struct _zend_arg_info)-1), flags },
- ^
- /usr/include/php5/Zend/zend_API.h:81:57: note: in expansion of macro 'ZEND_FENTRY'
- #define ZEND_NAMED_ME(zend_name, name, arg_info, flags) ZEND_FENTRY(zend_name, name, arg_info, flags)
- ^
- /usr/include/php5/Zend/zend_API.h:86:60: note: in expansion of macro 'ZEND_NAMED_ME'
- #define ZEND_ME_MAPPING(name, func_name, arg_types, flags) ZEND_NAMED_ME(name, ZEND_FN(func_name), arg_types, flags)
- ^
- /usr/include/php5/main/php.h:357:25: note: in expansion of macro 'ZEND_ME_MAPPING'
- #define PHP_ME_MAPPING ZEND_ME_MAPPING
- ^
- /opt/install/paradox-1.4.3/paradox.c:122:2: note: in expansion of macro 'PHP_ME_MAPPING'
- PHP_ME_MAPPING(get_value, px_get_value, NULL, 0)
- ^
- /usr/include/php5/Zend/zend_API.h:71:129: warning: excess elements in scalar initializer [enabled by default]
- #define ZEND_FENTRY(zend_name, name, arg_info, flags) { #zend_name, name, arg_info, (zend_uint) (sizeof(arg_info)/sizeof(struct _zend_arg_info)-1), flags },
- ^
- /usr/include/php5/Zend/zend_API.h:81:57: note: in expansion of macro 'ZEND_FENTRY'
- #define ZEND_NAMED_ME(zend_name, name, arg_info, flags) ZEND_FENTRY(zend_name, name, arg_info, flags)
- ^
- /usr/include/php5/Zend/zend_API.h:86:60: note: in expansion of macro 'ZEND_NAMED_ME'
- #define ZEND_ME_MAPPING(name, func_name, arg_types, flags) ZEND_NAMED_ME(name, ZEND_FN(func_name), arg_types, flags)
- ^
- /usr/include/php5/main/php.h:357:25: note: in expansion of macro 'ZEND_ME_MAPPING'
- #define PHP_ME_MAPPING ZEND_ME_MAPPING
- ^
- /opt/install/paradox-1.4.3/paradox.c:122:2: note: in expansion of macro 'PHP_ME_MAPPING'
- PHP_ME_MAPPING(get_value, px_get_value, NULL, 0)
- ^
- /usr/include/php5/Zend/zend_API.h:71:129: warning: (near initialization for 'paradox_funcs_db[19]') [enabled by default]
- #define ZEND_FENTRY(zend_name, name, arg_info, flags) { #zend_name, name, arg_info, (zend_uint) (sizeof(arg_info)/sizeof(struct _zend_arg_info)-1), flags },
- ^
- /usr/include/php5/Zend/zend_API.h:81:57: note: in expansion of macro 'ZEND_FENTRY'
- #define ZEND_NAMED_ME(zend_name, name, arg_info, flags) ZEND_FENTRY(zend_name, name, arg_info, flags)
- ^
- /usr/include/php5/Zend/zend_API.h:86:60: note: in expansion of macro 'ZEND_NAMED_ME'
- #define ZEND_ME_MAPPING(name, func_name, arg_types, flags) ZEND_NAMED_ME(name, ZEND_FN(func_name), arg_types, flags)
- ^
- /usr/include/php5/main/php.h:357:25: note: in expansion of macro 'ZEND_ME_MAPPING'
- #define PHP_ME_MAPPING ZEND_ME_MAPPING
- ^
- /opt/install/paradox-1.4.3/paradox.c:122:2: note: in expansion of macro 'PHP_ME_MAPPING'
- PHP_ME_MAPPING(get_value, px_get_value, NULL, 0)
- ^
- /opt/install/paradox-1.4.3/paradox.c:123:2: warning: braces around scalar initializer [enabled by default]
- PHP_ME_MAPPING(set_targetencoding, px_set_targetencoding, NULL, 0)
- ^
- /opt/install/paradox-1.4.3/paradox.c:123:2: warning: (near initialization for 'paradox_funcs_db[20]') [enabled by default]
- /opt/install/paradox-1.4.3/paradox.c:123:2: warning: initialization makes integer from pointer without a cast [enabled by default]
- /opt/install/paradox-1.4.3/paradox.c:123:2: warning: (near initialization for 'paradox_funcs_db[20]') [enabled by default]
- /opt/install/paradox-1.4.3/paradox.c:123:2: error: initializer element is not computable at load time
- /opt/install/paradox-1.4.3/paradox.c:123:2: error: (near initialization for 'paradox_funcs_db[20]')
- /opt/install/paradox-1.4.3/paradox.c:123:2: warning: excess elements in scalar initializer [enabled by default]
- /opt/install/paradox-1.4.3/paradox.c:123:2: warning: (near initialization for 'paradox_funcs_db[20]') [enabled by default]
- /opt/install/paradox-1.4.3/paradox.c:123:2: warning: excess elements in scalar initializer [enabled by default]
- /opt/install/paradox-1.4.3/paradox.c:123:2: warning: (near initialization for 'paradox_funcs_db[20]') [enabled by default]
- In file included from /usr/include/php5/main/php.h:39:0,
- from /opt/install/paradox-1.4.3/paradox.c:25:
- /usr/include/php5/Zend/zend_API.h:71:129: warning: excess elements in scalar initializer [enabled by default]
- #define ZEND_FENTRY(zend_name, name, arg_info, flags) { #zend_name, name, arg_info, (zend_uint) (sizeof(arg_info)/sizeof(struct _zend_arg_info)-1), flags },
- ^
- /usr/include/php5/Zend/zend_API.h:81:57: note: in expansion of macro 'ZEND_FENTRY'
- #define ZEND_NAMED_ME(zend_name, name, arg_info, flags) ZEND_FENTRY(zend_name, name, arg_info, flags)
- ^
- /usr/include/php5/Zend/zend_API.h:86:60: note: in expansion of macro 'ZEND_NAMED_ME'
- #define ZEND_ME_MAPPING(name, func_name, arg_types, flags) ZEND_NAMED_ME(name, ZEND_FN(func_name), arg_types, flags)
- ^
- /usr/include/php5/main/php.h:357:25: note: in expansion of macro 'ZEND_ME_MAPPING'
- #define PHP_ME_MAPPING ZEND_ME_MAPPING
- ^
- /opt/install/paradox-1.4.3/paradox.c:123:2: note: in expansion of macro 'PHP_ME_MAPPING'
- PHP_ME_MAPPING(set_targetencoding, px_set_targetencoding, NULL, 0)
- ^
- /usr/include/php5/Zend/zend_API.h:71:129: warning: (near initialization for 'paradox_funcs_db[20]') [enabled by default]
- #define ZEND_FENTRY(zend_name, name, arg_info, flags) { #zend_name, name, arg_info, (zend_uint) (sizeof(arg_info)/sizeof(struct _zend_arg_info)-1), flags },
- ^
- /usr/include/php5/Zend/zend_API.h:81:57: note: in expansion of macro 'ZEND_FENTRY'
- #define ZEND_NAMED_ME(zend_name, name, arg_info, flags) ZEND_FENTRY(zend_name, name, arg_info, flags)
- ^
- /usr/include/php5/Zend/zend_API.h:86:60: note: in expansion of macro 'ZEND_NAMED_ME'
- #define ZEND_ME_MAPPING(name, func_name, arg_types, flags) ZEND_NAMED_ME(name, ZEND_FN(func_name), arg_types, flags)
- ^
- /usr/include/php5/main/php.h:357:25: note: in expansion of macro 'ZEND_ME_MAPPING'
- #define PHP_ME_MAPPING ZEND_ME_MAPPING
- ^
- /opt/install/paradox-1.4.3/paradox.c:123:2: note: in expansion of macro 'PHP_ME_MAPPING'
- PHP_ME_MAPPING(set_targetencoding, px_set_targetencoding, NULL, 0)
- ^
- /usr/include/php5/Zend/zend_API.h:71:129: warning: excess elements in scalar initializer [enabled by default]
- #define ZEND_FENTRY(zend_name, name, arg_info, flags) { #zend_name, name, arg_info, (zend_uint) (sizeof(arg_info)/sizeof(struct _zend_arg_info)-1), flags },
- ^
- /usr/include/php5/Zend/zend_API.h:81:57: note: in expansion of macro 'ZEND_FENTRY'
- #define ZEND_NAMED_ME(zend_name, name, arg_info, flags) ZEND_FENTRY(zend_name, name, arg_info, flags)
- ^
- /usr/include/php5/Zend/zend_API.h:86:60: note: in expansion of macro 'ZEND_NAMED_ME'
- #define ZEND_ME_MAPPING(name, func_name, arg_types, flags) ZEND_NAMED_ME(name, ZEND_FN(func_name), arg_types, flags)
- ^
- /usr/include/php5/main/php.h:357:25: note: in expansion of macro 'ZEND_ME_MAPPING'
- #define PHP_ME_MAPPING ZEND_ME_MAPPING
- ^
- /opt/install/paradox-1.4.3/paradox.c:123:2: note: in expansion of macro 'PHP_ME_MAPPING'
- PHP_ME_MAPPING(set_targetencoding, px_set_targetencoding, NULL, 0)
- ^
- /usr/include/php5/Zend/zend_API.h:71:129: warning: (near initialization for 'paradox_funcs_db[20]') [enabled by default]
- #define ZEND_FENTRY(zend_name, name, arg_info, flags) { #zend_name, name, arg_info, (zend_uint) (sizeof(arg_info)/sizeof(struct _zend_arg_info)-1), flags },
- ^
- /usr/include/php5/Zend/zend_API.h:81:57: note: in expansion of macro 'ZEND_FENTRY'
- #define ZEND_NAMED_ME(zend_name, name, arg_info, flags) ZEND_FENTRY(zend_name, name, arg_info, flags)
- ^
- /usr/include/php5/Zend/zend_API.h:86:60: note: in expansion of macro 'ZEND_NAMED_ME'
- #define ZEND_ME_MAPPING(name, func_name, arg_types, flags) ZEND_NAMED_ME(name, ZEND_FN(func_name), arg_types, flags)
- ^
- /usr/include/php5/main/php.h:357:25: note: in expansion of macro 'ZEND_ME_MAPPING'
- #define PHP_ME_MAPPING ZEND_ME_MAPPING
- ^
- /opt/install/paradox-1.4.3/paradox.c:123:2: note: in expansion of macro 'PHP_ME_MAPPING'
- PHP_ME_MAPPING(set_targetencoding, px_set_targetencoding, NULL, 0)
- ^
- /opt/install/paradox-1.4.3/paradox.c:124:2: warning: braces around scalar initializer [enabled by default]
- PHP_ME_MAPPING(set_tablename, px_set_tablename, NULL, 0)
- ^
- /opt/install/paradox-1.4.3/paradox.c:124:2: warning: (near initialization for 'paradox_funcs_db[21]') [enabled by default]
- /opt/install/paradox-1.4.3/paradox.c:124:2: warning: initialization makes integer from pointer without a cast [enabled by default]
- /opt/install/paradox-1.4.3/paradox.c:124:2: warning: (near initialization for 'paradox_funcs_db[21]') [enabled by default]
- /opt/install/paradox-1.4.3/paradox.c:124:2: error: initializer element is not computable at load time
- /opt/install/paradox-1.4.3/paradox.c:124:2: error: (near initialization for 'paradox_funcs_db[21]')
- /opt/install/paradox-1.4.3/paradox.c:124:2: warning: excess elements in scalar initializer [enabled by default]
- /opt/install/paradox-1.4.3/paradox.c:124:2: warning: (near initialization for 'paradox_funcs_db[21]') [enabled by default]
- /opt/install/paradox-1.4.3/paradox.c:124:2: warning: excess elements in scalar initializer [enabled by default]
- /opt/install/paradox-1.4.3/paradox.c:124:2: warning: (near initialization for 'paradox_funcs_db[21]') [enabled by default]
- In file included from /usr/include/php5/main/php.h:39:0,
- from /opt/install/paradox-1.4.3/paradox.c:25:
- /usr/include/php5/Zend/zend_API.h:71:129: warning: excess elements in scalar initializer [enabled by default]
- #define ZEND_FENTRY(zend_name, name, arg_info, flags) { #zend_name, name, arg_info, (zend_uint) (sizeof(arg_info)/sizeof(struct _zend_arg_info)-1), flags },
- ^
- /usr/include/php5/Zend/zend_API.h:81:57: note: in expansion of macro 'ZEND_FENTRY'
- #define ZEND_NAMED_ME(zend_name, name, arg_info, flags) ZEND_FENTRY(zend_name, name, arg_info, flags)
- ^
- /usr/include/php5/Zend/zend_API.h:86:60: note: in expansion of macro 'ZEND_NAMED_ME'
- #define ZEND_ME_MAPPING(name, func_name, arg_types, flags) ZEND_NAMED_ME(name, ZEND_FN(func_name), arg_types, flags)
- ^
- /usr/include/php5/main/php.h:357:25: note: in expansion of macro 'ZEND_ME_MAPPING'
- #define PHP_ME_MAPPING ZEND_ME_MAPPING
- ^
- /opt/install/paradox-1.4.3/paradox.c:124:2: note: in expansion of macro 'PHP_ME_MAPPING'
- PHP_ME_MAPPING(set_tablename, px_set_tablename, NULL, 0)
- ^
- /usr/include/php5/Zend/zend_API.h:71:129: warning: (near initialization for 'paradox_funcs_db[21]') [enabled by default]
- #define ZEND_FENTRY(zend_name, name, arg_info, flags) { #zend_name, name, arg_info, (zend_uint) (sizeof(arg_info)/sizeof(struct _zend_arg_info)-1), flags },
- ^
- /usr/include/php5/Zend/zend_API.h:81:57: note: in expansion of macro 'ZEND_FENTRY'
- #define ZEND_NAMED_ME(zend_name, name, arg_info, flags) ZEND_FENTRY(zend_name, name, arg_info, flags)
- ^
- /usr/include/php5/Zend/zend_API.h:86:60: note: in expansion of macro 'ZEND_NAMED_ME'
- #define ZEND_ME_MAPPING(name, func_name, arg_types, flags) ZEND_NAMED_ME(name, ZEND_FN(func_name), arg_types, flags)
- ^
- /usr/include/php5/main/php.h:357:25: note: in expansion of macro 'ZEND_ME_MAPPING'
- #define PHP_ME_MAPPING ZEND_ME_MAPPING
- ^
- /opt/install/paradox-1.4.3/paradox.c:124:2: note: in expansion of macro 'PHP_ME_MAPPING'
- PHP_ME_MAPPING(set_tablename, px_set_tablename, NULL, 0)
- ^
- /usr/include/php5/Zend/zend_API.h:71:129: warning: excess elements in scalar initializer [enabled by default]
- #define ZEND_FENTRY(zend_name, name, arg_info, flags) { #zend_name, name, arg_info, (zend_uint) (sizeof(arg_info)/sizeof(struct _zend_arg_info)-1), flags },
- ^
- /usr/include/php5/Zend/zend_API.h:81:57: note: in expansion of macro 'ZEND_FENTRY'
- #define ZEND_NAMED_ME(zend_name, name, arg_info, flags) ZEND_FENTRY(zend_name, name, arg_info, flags)
- ^
- /usr/include/php5/Zend/zend_API.h:86:60: note: in expansion of macro 'ZEND_NAMED_ME'
- #define ZEND_ME_MAPPING(name, func_name, arg_types, flags) ZEND_NAMED_ME(name, ZEND_FN(func_name), arg_types, flags)
- ^
- /usr/include/php5/main/php.h:357:25: note: in expansion of macro 'ZEND_ME_MAPPING'
- #define PHP_ME_MAPPING ZEND_ME_MAPPING
- ^
- /opt/install/paradox-1.4.3/paradox.c:124:2: note: in expansion of macro 'PHP_ME_MAPPING'
- PHP_ME_MAPPING(set_tablename, px_set_tablename, NULL, 0)
- ^
- /usr/include/php5/Zend/zend_API.h:71:129: warning: (near initialization for 'paradox_funcs_db[21]') [enabled by default]
- #define ZEND_FENTRY(zend_name, name, arg_info, flags) { #zend_name, name, arg_info, (zend_uint) (sizeof(arg_info)/sizeof(struct _zend_arg_info)-1), flags },
- ^
- /usr/include/php5/Zend/zend_API.h:81:57: note: in expansion of macro 'ZEND_FENTRY'
- #define ZEND_NAMED_ME(zend_name, name, arg_info, flags) ZEND_FENTRY(zend_name, name, arg_info, flags)
- ^
- /usr/include/php5/Zend/zend_API.h:86:60: note: in expansion of macro 'ZEND_NAMED_ME'
- #define ZEND_ME_MAPPING(name, func_name, arg_types, flags) ZEND_NAMED_ME(name, ZEND_FN(func_name), arg_types, flags)
- ^
- /usr/include/php5/main/php.h:357:25: note: in expansion of macro 'ZEND_ME_MAPPING'
- #define PHP_ME_MAPPING ZEND_ME_MAPPING
- ^
- /opt/install/paradox-1.4.3/paradox.c:124:2: note: in expansion of macro 'PHP_ME_MAPPING'
- PHP_ME_MAPPING(set_tablename, px_set_tablename, NULL, 0)
- ^
- /opt/install/paradox-1.4.3/paradox.c:125:2: warning: braces around scalar initializer [enabled by default]
- PHP_ME_MAPPING(set_blob_file, px_set_blob_file, NULL, 0)
- ^
- /opt/install/paradox-1.4.3/paradox.c:125:2: warning: (near initialization for 'paradox_funcs_db[22]') [enabled by default]
- /opt/install/paradox-1.4.3/paradox.c:125:2: warning: initialization makes integer from pointer without a cast [enabled by default]
- /opt/install/paradox-1.4.3/paradox.c:125:2: warning: (near initialization for 'paradox_funcs_db[22]') [enabled by default]
- /opt/install/paradox-1.4.3/paradox.c:125:2: error: initializer element is not computable at load time
- /opt/install/paradox-1.4.3/paradox.c:125:2: error: (near initialization for 'paradox_funcs_db[22]')
- /opt/install/paradox-1.4.3/paradox.c:125:2: warning: excess elements in scalar initializer [enabled by default]
- /opt/install/paradox-1.4.3/paradox.c:125:2: warning: (near initialization for 'paradox_funcs_db[22]') [enabled by default]
- /opt/install/paradox-1.4.3/paradox.c:125:2: warning: excess elements in scalar initializer [enabled by default]
- /opt/install/paradox-1.4.3/paradox.c:125:2: warning: (near initialization for 'paradox_funcs_db[22]') [enabled by default]
- In file included from /usr/include/php5/main/php.h:39:0,
- from /opt/install/paradox-1.4.3/paradox.c:25:
- /usr/include/php5/Zend/zend_API.h:71:129: warning: excess elements in scalar initializer [enabled by default]
- #define ZEND_FENTRY(zend_name, name, arg_info, flags) { #zend_name, name, arg_info, (zend_uint) (sizeof(arg_info)/sizeof(struct _zend_arg_info)-1), flags },
- ^
- /usr/include/php5/Zend/zend_API.h:81:57: note: in expansion of macro 'ZEND_FENTRY'
- #define ZEND_NAMED_ME(zend_name, name, arg_info, flags) ZEND_FENTRY(zend_name, name, arg_info, flags)
- ^
- /usr/include/php5/Zend/zend_API.h:86:60: note: in expansion of macro 'ZEND_NAMED_ME'
- #define ZEND_ME_MAPPING(name, func_name, arg_types, flags) ZEND_NAMED_ME(name, ZEND_FN(func_name), arg_types, flags)
- ^
- /usr/include/php5/main/php.h:357:25: note: in expansion of macro 'ZEND_ME_MAPPING'
- #define PHP_ME_MAPPING ZEND_ME_MAPPING
- ^
- /opt/install/paradox-1.4.3/paradox.c:125:2: note: in expansion of macro 'PHP_ME_MAPPING'
- PHP_ME_MAPPING(set_blob_file, px_set_blob_file, NULL, 0)
- ^
- /usr/include/php5/Zend/zend_API.h:71:129: warning: (near initialization for 'paradox_funcs_db[22]') [enabled by default]
- #define ZEND_FENTRY(zend_name, name, arg_info, flags) { #zend_name, name, arg_info, (zend_uint) (sizeof(arg_info)/sizeof(struct _zend_arg_info)-1), flags },
- ^
- /usr/include/php5/Zend/zend_API.h:81:57: note: in expansion of macro 'ZEND_FENTRY'
- #define ZEND_NAMED_ME(zend_name, name, arg_info, flags) ZEND_FENTRY(zend_name, name, arg_info, flags)
- ^
- /usr/include/php5/Zend/zend_API.h:86:60: note: in expansion of macro 'ZEND_NAMED_ME'
- #define ZEND_ME_MAPPING(name, func_name, arg_types, flags) ZEND_NAMED_ME(name, ZEND_FN(func_name), arg_types, flags)
- ^
- /usr/include/php5/main/php.h:357:25: note: in expansion of macro 'ZEND_ME_MAPPING'
- #define PHP_ME_MAPPING ZEND_ME_MAPPING
- ^
- /opt/install/paradox-1.4.3/paradox.c:125:2: note: in expansion of macro 'PHP_ME_MAPPING'
- PHP_ME_MAPPING(set_blob_file, px_set_blob_file, NULL, 0)
- ^
- /usr/include/php5/Zend/zend_API.h:71:129: warning: excess elements in scalar initializer [enabled by default]
- #define ZEND_FENTRY(zend_name, name, arg_info, flags) { #zend_name, name, arg_info, (zend_uint) (sizeof(arg_info)/sizeof(struct _zend_arg_info)-1), flags },
- ^
- /usr/include/php5/Zend/zend_API.h:81:57: note: in expansion of macro 'ZEND_FENTRY'
- #define ZEND_NAMED_ME(zend_name, name, arg_info, flags) ZEND_FENTRY(zend_name, name, arg_info, flags)
- ^
- /usr/include/php5/Zend/zend_API.h:86:60: note: in expansion of macro 'ZEND_NAMED_ME'
- #define ZEND_ME_MAPPING(name, func_name, arg_types, flags) ZEND_NAMED_ME(name, ZEND_FN(func_name), arg_types, flags)
- ^
- /usr/include/php5/main/php.h:357:25: note: in expansion of macro 'ZEND_ME_MAPPING'
- #define PHP_ME_MAPPING ZEND_ME_MAPPING
- ^
- /opt/install/paradox-1.4.3/paradox.c:125:2: note: in expansion of macro 'PHP_ME_MAPPING'
- PHP_ME_MAPPING(set_blob_file, px_set_blob_file, NULL, 0)
- ^
- /usr/include/php5/Zend/zend_API.h:71:129: warning: (near initialization for 'paradox_funcs_db[22]') [enabled by default]
- #define ZEND_FENTRY(zend_name, name, arg_info, flags) { #zend_name, name, arg_info, (zend_uint) (sizeof(arg_info)/sizeof(struct _zend_arg_info)-1), flags },
- ^
- /usr/include/php5/Zend/zend_API.h:81:57: note: in expansion of macro 'ZEND_FENTRY'
- #define ZEND_NAMED_ME(zend_name, name, arg_info, flags) ZEND_FENTRY(zend_name, name, arg_info, flags)
- ^
- /usr/include/php5/Zend/zend_API.h:86:60: note: in expansion of macro 'ZEND_NAMED_ME'
- #define ZEND_ME_MAPPING(name, func_name, arg_types, flags) ZEND_NAMED_ME(name, ZEND_FN(func_name), arg_types, flags)
- ^
- /usr/include/php5/main/php.h:357:25: note: in expansion of macro 'ZEND_ME_MAPPING'
- #define PHP_ME_MAPPING ZEND_ME_MAPPING
- ^
- /opt/install/paradox-1.4.3/paradox.c:125:2: note: in expansion of macro 'PHP_ME_MAPPING'
- PHP_ME_MAPPING(set_blob_file, px_set_blob_file, NULL, 0)
- ^
- /opt/install/paradox-1.4.3/paradox.c:126:2: warning: braces around scalar initializer [enabled by default]
- PHP_ME_MAPPING(timestamp2string, px_timestamp2string, NULL, 0)
- ^
- /opt/install/paradox-1.4.3/paradox.c:126:2: warning: (near initialization for 'paradox_funcs_db[23]') [enabled by default]
- /opt/install/paradox-1.4.3/paradox.c:126:2: warning: initialization makes integer from pointer without a cast [enabled by default]
- /opt/install/paradox-1.4.3/paradox.c:126:2: warning: (near initialization for 'paradox_funcs_db[23]') [enabled by default]
- /opt/install/paradox-1.4.3/paradox.c:126:2: error: initializer element is not computable at load time
- /opt/install/paradox-1.4.3/paradox.c:126:2: error: (near initialization for 'paradox_funcs_db[23]')
- /opt/install/paradox-1.4.3/paradox.c:126:2: warning: excess elements in scalar initializer [enabled by default]
- /opt/install/paradox-1.4.3/paradox.c:126:2: warning: (near initialization for 'paradox_funcs_db[23]') [enabled by default]
- /opt/install/paradox-1.4.3/paradox.c:126:2: warning: excess elements in scalar initializer [enabled by default]
- /opt/install/paradox-1.4.3/paradox.c:126:2: warning: (near initialization for 'paradox_funcs_db[23]') [enabled by default]
- In file included from /usr/include/php5/main/php.h:39:0,
- from /opt/install/paradox-1.4.3/paradox.c:25:
- /usr/include/php5/Zend/zend_API.h:71:129: warning: excess elements in scalar initializer [enabled by default]
- #define ZEND_FENTRY(zend_name, name, arg_info, flags) { #zend_name, name, arg_info, (zend_uint) (sizeof(arg_info)/sizeof(struct _zend_arg_info)-1), flags },
- ^
- /usr/include/php5/Zend/zend_API.h:81:57: note: in expansion of macro 'ZEND_FENTRY'
- #define ZEND_NAMED_ME(zend_name, name, arg_info, flags) ZEND_FENTRY(zend_name, name, arg_info, flags)
- ^
- /usr/include/php5/Zend/zend_API.h:86:60: note: in expansion of macro 'ZEND_NAMED_ME'
- #define ZEND_ME_MAPPING(name, func_name, arg_types, flags) ZEND_NAMED_ME(name, ZEND_FN(func_name), arg_types, flags)
- ^
- /usr/include/php5/main/php.h:357:25: note: in expansion of macro 'ZEND_ME_MAPPING'
- #define PHP_ME_MAPPING ZEND_ME_MAPPING
- ^
- /opt/install/paradox-1.4.3/paradox.c:126:2: note: in expansion of macro 'PHP_ME_MAPPING'
- PHP_ME_MAPPING(timestamp2string, px_timestamp2string, NULL, 0)
- ^
- /usr/include/php5/Zend/zend_API.h:71:129: warning: (near initialization for 'paradox_funcs_db[23]') [enabled by default]
- #define ZEND_FENTRY(zend_name, name, arg_info, flags) { #zend_name, name, arg_info, (zend_uint) (sizeof(arg_info)/sizeof(struct _zend_arg_info)-1), flags },
- ^
- /usr/include/php5/Zend/zend_API.h:81:57: note: in expansion of macro 'ZEND_FENTRY'
- #define ZEND_NAMED_ME(zend_name, name, arg_info, flags) ZEND_FENTRY(zend_name, name, arg_info, flags)
- ^
- /usr/include/php5/Zend/zend_API.h:86:60: note: in expansion of macro 'ZEND_NAMED_ME'
- #define ZEND_ME_MAPPING(name, func_name, arg_types, flags) ZEND_NAMED_ME(name, ZEND_FN(func_name), arg_types, flags)
- ^
- /usr/include/php5/main/php.h:357:25: note: in expansion of macro 'ZEND_ME_MAPPING'
- #define PHP_ME_MAPPING ZEND_ME_MAPPING
- ^
- /opt/install/paradox-1.4.3/paradox.c:126:2: note: in expansion of macro 'PHP_ME_MAPPING'
- PHP_ME_MAPPING(timestamp2string, px_timestamp2string, NULL, 0)
- ^
- /usr/include/php5/Zend/zend_API.h:71:129: warning: excess elements in scalar initializer [enabled by default]
- #define ZEND_FENTRY(zend_name, name, arg_info, flags) { #zend_name, name, arg_info, (zend_uint) (sizeof(arg_info)/sizeof(struct _zend_arg_info)-1), flags },
- ^
- /usr/include/php5/Zend/zend_API.h:81:57: note: in expansion of macro 'ZEND_FENTRY'
- #define ZEND_NAMED_ME(zend_name, name, arg_info, flags) ZEND_FENTRY(zend_name, name, arg_info, flags)
- ^
- /usr/include/php5/Zend/zend_API.h:86:60: note: in expansion of macro 'ZEND_NAMED_ME'
- #define ZEND_ME_MAPPING(name, func_name, arg_types, flags) ZEND_NAMED_ME(name, ZEND_FN(func_name), arg_types, flags)
- ^
- /usr/include/php5/main/php.h:357:25: note: in expansion of macro 'ZEND_ME_MAPPING'
- #define PHP_ME_MAPPING ZEND_ME_MAPPING
- ^
- /opt/install/paradox-1.4.3/paradox.c:126:2: note: in expansion of macro 'PHP_ME_MAPPING'
- PHP_ME_MAPPING(timestamp2string, px_timestamp2string, NULL, 0)
- ^
- /usr/include/php5/Zend/zend_API.h:71:129: warning: (near initialization for 'paradox_funcs_db[23]') [enabled by default]
- #define ZEND_FENTRY(zend_name, name, arg_info, flags) { #zend_name, name, arg_info, (zend_uint) (sizeof(arg_info)/sizeof(struct _zend_arg_info)-1), flags },
- ^
- /usr/include/php5/Zend/zend_API.h:81:57: note: in expansion of macro 'ZEND_FENTRY'
- #define ZEND_NAMED_ME(zend_name, name, arg_info, flags) ZEND_FENTRY(zend_name, name, arg_info, flags)
- ^
- /usr/include/php5/Zend/zend_API.h:86:60: note: in expansion of macro 'ZEND_NAMED_ME'
- #define ZEND_ME_MAPPING(name, func_name, arg_types, flags) ZEND_NAMED_ME(name, ZEND_FN(func_name), arg_types, flags)
- ^
- /usr/include/php5/main/php.h:357:25: note: in expansion of macro 'ZEND_ME_MAPPING'
- #define PHP_ME_MAPPING ZEND_ME_MAPPING
- ^
- /opt/install/paradox-1.4.3/paradox.c:126:2: note: in expansion of macro 'PHP_ME_MAPPING'
- PHP_ME_MAPPING(timestamp2string, px_timestamp2string, NULL, 0)
- ^
- /opt/install/paradox-1.4.3/paradox.c:127:2: warning: braces around scalar initializer [enabled by default]
- PHP_ME_MAPPING(date2string, px_date2string, NULL, 0)
- ^
- /opt/install/paradox-1.4.3/paradox.c:127:2: warning: (near initialization for 'paradox_funcs_db[24]') [enabled by default]
- /opt/install/paradox-1.4.3/paradox.c:127:2: warning: initialization makes integer from pointer without a cast [enabled by default]
- /opt/install/paradox-1.4.3/paradox.c:127:2: warning: (near initialization for 'paradox_funcs_db[24]') [enabled by default]
- /opt/install/paradox-1.4.3/paradox.c:127:2: error: initializer element is not computable at load time
- /opt/install/paradox-1.4.3/paradox.c:127:2: error: (near initialization for 'paradox_funcs_db[24]')
- /opt/install/paradox-1.4.3/paradox.c:127:2: warning: excess elements in scalar initializer [enabled by default]
- /opt/install/paradox-1.4.3/paradox.c:127:2: warning: (near initialization for 'paradox_funcs_db[24]') [enabled by default]
- /opt/install/paradox-1.4.3/paradox.c:127:2: warning: excess elements in scalar initializer [enabled by default]
- /opt/install/paradox-1.4.3/paradox.c:127:2: warning: (near initialization for 'paradox_funcs_db[24]') [enabled by default]
- In file included from /usr/include/php5/main/php.h:39:0,
- from /opt/install/paradox-1.4.3/paradox.c:25:
- /usr/include/php5/Zend/zend_API.h:71:129: warning: excess elements in scalar initializer [enabled by default]
- #define ZEND_FENTRY(zend_name, name, arg_info, flags) { #zend_name, name, arg_info, (zend_uint) (sizeof(arg_info)/sizeof(struct _zend_arg_info)-1), flags },
- ^
- /usr/include/php5/Zend/zend_API.h:81:57: note: in expansion of macro 'ZEND_FENTRY'
- #define ZEND_NAMED_ME(zend_name, name, arg_info, flags) ZEND_FENTRY(zend_name, name, arg_info, flags)
- ^
- /usr/include/php5/Zend/zend_API.h:86:60: note: in expansion of macro 'ZEND_NAMED_ME'
- #define ZEND_ME_MAPPING(name, func_name, arg_types, flags) ZEND_NAMED_ME(name, ZEND_FN(func_name), arg_types, flags)
- ^
- /usr/include/php5/main/php.h:357:25: note: in expansion of macro 'ZEND_ME_MAPPING'
- #define PHP_ME_MAPPING ZEND_ME_MAPPING
- ^
- /opt/install/paradox-1.4.3/paradox.c:127:2: note: in expansion of macro 'PHP_ME_MAPPING'
- PHP_ME_MAPPING(date2string, px_date2string, NULL, 0)
- ^
- /usr/include/php5/Zend/zend_API.h:71:129: warning: (near initialization for 'paradox_funcs_db[24]') [enabled by default]
- #define ZEND_FENTRY(zend_name, name, arg_info, flags) { #zend_name, name, arg_info, (zend_uint) (sizeof(arg_info)/sizeof(struct _zend_arg_info)-1), flags },
- ^
- /usr/include/php5/Zend/zend_API.h:81:57: note: in expansion of macro 'ZEND_FENTRY'
- #define ZEND_NAMED_ME(zend_name, name, arg_info, flags) ZEND_FENTRY(zend_name, name, arg_info, flags)
- ^
- /usr/include/php5/Zend/zend_API.h:86:60: note: in expansion of macro 'ZEND_NAMED_ME'
- #define ZEND_ME_MAPPING(name, func_name, arg_types, flags) ZEND_NAMED_ME(name, ZEND_FN(func_name), arg_types, flags)
- ^
- /usr/include/php5/main/php.h:357:25: note: in expansion of macro 'ZEND_ME_MAPPING'
- #define PHP_ME_MAPPING ZEND_ME_MAPPING
- ^
- /opt/install/paradox-1.4.3/paradox.c:127:2: note: in expansion of macro 'PHP_ME_MAPPING'
- PHP_ME_MAPPING(date2string, px_date2string, NULL, 0)
- ^
- /usr/include/php5/Zend/zend_API.h:71:129: warning: excess elements in scalar initializer [enabled by default]
- #define ZEND_FENTRY(zend_name, name, arg_info, flags) { #zend_name, name, arg_info, (zend_uint) (sizeof(arg_info)/sizeof(struct _zend_arg_info)-1), flags },
- ^
- /usr/include/php5/Zend/zend_API.h:81:57: note: in expansion of macro 'ZEND_FENTRY'
- #define ZEND_NAMED_ME(zend_name, name, arg_info, flags) ZEND_FENTRY(zend_name, name, arg_info, flags)
- ^
- /usr/include/php5/Zend/zend_API.h:86:60: note: in expansion of macro 'ZEND_NAMED_ME'
- #define ZEND_ME_MAPPING(name, func_name, arg_types, flags) ZEND_NAMED_ME(name, ZEND_FN(func_name), arg_types, flags)
- ^
- /usr/include/php5/main/php.h:357:25: note: in expansion of macro 'ZEND_ME_MAPPING'
- #define PHP_ME_MAPPING ZEND_ME_MAPPING
- ^
- /opt/install/paradox-1.4.3/paradox.c:127:2: note: in expansion of macro 'PHP_ME_MAPPING'
- PHP_ME_MAPPING(date2string, px_date2string, NULL, 0)
- ^
- /usr/include/php5/Zend/zend_API.h:71:129: warning: (near initialization for 'paradox_funcs_db[24]') [enabled by default]
- #define ZEND_FENTRY(zend_name, name, arg_info, flags) { #zend_name, name, arg_info, (zend_uint) (sizeof(arg_info)/sizeof(struct _zend_arg_info)-1), flags },
- ^
- /usr/include/php5/Zend/zend_API.h:81:57: note: in expansion of macro 'ZEND_FENTRY'
- #define ZEND_NAMED_ME(zend_name, name, arg_info, flags) ZEND_FENTRY(zend_name, name, arg_info, flags)
- ^
- /usr/include/php5/Zend/zend_API.h:86:60: note: in expansion of macro 'ZEND_NAMED_ME'
- #define ZEND_ME_MAPPING(name, func_name, arg_types, flags) ZEND_NAMED_ME(name, ZEND_FN(func_name), arg_types, flags)
- ^
- /usr/include/php5/main/php.h:357:25: note: in expansion of macro 'ZEND_ME_MAPPING'
- #define PHP_ME_MAPPING ZEND_ME_MAPPING
- ^
- /opt/install/paradox-1.4.3/paradox.c:127:2: note: in expansion of macro 'PHP_ME_MAPPING'
- PHP_ME_MAPPING(date2string, px_date2string, NULL, 0)
- ^
- /opt/install/paradox-1.4.3/paradox.c:128:2: warning: braces around scalar initializer [enabled by default]
- {NULL, NULL, NULL}
- ^
- /opt/install/paradox-1.4.3/paradox.c:128:2: warning: (near initialization for 'paradox_funcs_db[25]') [enabled by default]
- /opt/install/paradox-1.4.3/paradox.c:128:2: warning: initialization makes integer from pointer without a cast [enabled by default]
- /opt/install/paradox-1.4.3/paradox.c:128:2: warning: (near initialization for 'paradox_funcs_db[25]') [enabled by default]
- /opt/install/paradox-1.4.3/paradox.c:128:2: warning: excess elements in scalar initializer [enabled by default]
- /opt/install/paradox-1.4.3/paradox.c:128:2: warning: (near initialization for 'paradox_funcs_db[25]') [enabled by default]
- /opt/install/paradox-1.4.3/paradox.c:128:2: warning: excess elements in scalar initializer [enabled by default]
- /opt/install/paradox-1.4.3/paradox.c:128:2: warning: (near initialization for 'paradox_funcs_db[25]') [enabled by default]
- /opt/install/paradox-1.4.3/paradox.c:138:2: warning: initialization from incompatible pointer type [enabled by default]
- paradox_functions,
- ^
- /opt/install/paradox-1.4.3/paradox.c:138:2: warning: (near initialization for 'paradox_module_entry.functions') [enabled by default]
- /opt/install/paradox-1.4.3/paradox.c: In function 'px_custom_errorhandler':
- /opt/install/paradox-1.4.3/paradox.c:179:4: warning: format not a string literal and no format arguments [-Wformat-security]
- php_error_docref(NULL TSRMLS_CC, E_ERROR, shortmsg);
- ^
- /opt/install/paradox-1.4.3/paradox.c:182:4: warning: format not a string literal and no format arguments [-Wformat-security]
- php_error_docref(NULL TSRMLS_CC, E_WARNING, shortmsg);
- ^
- /opt/install/paradox-1.4.3/paradox.c: In function 'paradox_object_new':
- /opt/install/paradox-1.4.3/paradox.c:286:54: error: 'zend_class_entry' has no member named 'default_properties'
- zend_hash_copy(intern->zo.properties, &class_type->default_properties, (copy_ctor_func_t) zval_add_ref, (void *) &tmp, sizeof(zval *));
- ^
- /opt/install/paradox-1.4.3/paradox.c:286:5: warning: passing argument 2 of 'zend_hash_copy' from incompatible pointer type [enabled by default]
- zend_hash_copy(intern->zo.properties, &class_type->default_properties, (copy_ctor_func_t) zval_add_ref, (void *) &tmp, sizeof(zval *));
- ^
- In file included from /usr/include/php5/Zend/zend.h:286:0,
- from /usr/include/php5/main/php.h:35,
- from /opt/install/paradox-1.4.3/paradox.c:25:
- /usr/include/php5/Zend/zend_hash.h:217:15: note: expected 'struct HashTable *' but argument is of type 'int (*)[1]'
- ZEND_API void zend_hash_copy(HashTable *target, HashTable *source, copy_ctor_func_t pCopyConstructor, void *tmp, uint size);
- ^
- In file included from /usr/include/php5/main/php.h:39:0,
- from /opt/install/paradox-1.4.3/paradox.c:25:
- /opt/install/paradox-1.4.3/paradox.c: In function 'zm_startup_paradox':
- /usr/include/php5/Zend/zend_API.h:212:51: warning: assignment from incompatible pointer type [enabled by default]
- class_container.info.internal.builtin_functions = functions; \
- ^
- /usr/include/php5/Zend/zend_API.h:178:3: note: in expansion of macro 'INIT_CLASS_ENTRY_INIT_METHODS'
- INIT_CLASS_ENTRY_INIT_METHODS(class_container, functions, handle_fcall, handle_propget, handle_propset, handle_propunset, handle_propisset) \
- ^
- /usr/include/php5/Zend/zend_API.h:216:2: note: in expansion of macro 'INIT_OVERLOADED_CLASS_ENTRY_EX'
- INIT_OVERLOADED_CLASS_ENTRY_EX(class_container, class_name, sizeof(class_name)-1, functions, handle_fcall, handle_propget, handle_propset, NULL, NULL)
- ^
- /usr/include/php5/Zend/zend_API.h:164:2: note: in expansion of macro 'INIT_OVERLOADED_CLASS_ENTRY'
- INIT_OVERLOADED_CLASS_ENTRY(class_container, class_name, functions, NULL, NULL, NULL)
- ^
- /opt/install/paradox-1.4.3/php_paradox.h:50:3: note: in expansion of macro 'INIT_CLASS_ENTRY'
- INIT_CLASS_ENTRY(ce, "paradox_" # name, paradox_funcs_ ## name); \
- ^
- /opt/install/paradox-1.4.3/paradox.c:309:2: note: in expansion of macro 'REGISTER_PARADOX_CLASS'
- REGISTER_PARADOX_CLASS(db, NULL);
- ^
- make: *** [paradox.lo] Error 1
- ubuntu@ip-172-31-45-59:/opt/install/paradox-1.4.3$
Advertisement
Add Comment
Please, Sign In to add comment
Advertisement