Want more features on Pastebin? Sign Up, it's FREE!
Guest

grub-customizer fails

By: a guest on Jan 18th, 2014  |  syntax: None  |  size: 2.08 KB  |  views: 56  |  expires: Never
download  |  raw  |  embed  |  report abuse  |  print
Text below is selected. Please press Ctrl+C to copy to your clipboard. (⌘+C on Mac)
  1. :: Starting full aur upgrade...
  2.  
  3. Aur Targets    (1): grub-customizer
  4.  
  5. Proceed with installation? [Y/n]
  6.  
  7. Edit grub-customizer PKGBUILD with $EDITOR? [Y/n] n
  8. Edit grub-customizer.install with $EDITOR? [Y/n] n
  9. ==> Making package: grub-customizer 4.0.2-2 (Sat Jan 18 18:49:13 EST 2014)
  10. ==> Checking runtime dependencies...
  11. ==> Checking buildtime dependencies...
  12. ==> Retrieving sources...
  13.   -> Found grub-customizer_4.0.2.tar.gz
  14.   -> Found grub.cfg
  15. ==> Validating source files with md5sums...
  16.     grub-customizer_4.0.2.tar.gz ... Passed
  17.     grub.cfg ... Passed
  18. ==> Extracting sources...
  19.   -> Extracting grub-customizer_4.0.2.tar.gz with bsdtar
  20. ==> Removing existing pkg/ directory...
  21. ==> Entering fakeroot environment...
  22. ==> Starting package()...
  23. ==> Starting make...
  24. -- checking for module 'gtkmm-3.0'
  25. --   package 'gtkmm-3.0' not found
  26. -- Configuring done
  27. -- Generating done
  28. -- Build files have been written to: /tmp/packerbuild-1000/grub-customizer/grub-customizer/src/grub-customizer-4.0.2
  29. [  1%] Building CXX object CMakeFiles/grub-customizer.dir/src/Model/DeviceMap.cpp.o
  30. In file included from /tmp/packerbuild-1000/grub-customizer/grub-customizer/src/grub-customizer-4.0.2/src/Model/DeviceMap.h:23:0,
  31.                  from /tmp/packerbuild-1000/grub-customizer/grub-customizer/src/grub-customizer-4.0.2/src/Model/DeviceMap.cpp:19:
  32. /tmp/packerbuild-1000/grub-customizer/grub-customizer/src/grub-customizer-4.0.2/src/Model/../lib/regex.h:24:18: fatal error: glib.h: No such file or directory
  33.  #include <glib.h>
  34.                   ^
  35. compilation terminated.
  36. CMakeFiles/grub-customizer.dir/build.make:448: recipe for target 'CMakeFiles/grub-customizer.dir/src/Model/DeviceMap.cpp.o' failed
  37. make[2]: *** [CMakeFiles/grub-customizer.dir/src/Model/DeviceMap.cpp.o] Error 1
  38. CMakeFiles/Makefile2:63: recipe for target 'CMakeFiles/grub-customizer.dir/all' failed
  39. make[1]: *** [CMakeFiles/grub-customizer.dir/all] Error 2
  40. Makefile:116: recipe for target 'all' failed
  41. make: *** [all] Error 2
  42. ==> ERROR: A failure occurred in package().
  43.     Aborting...
  44. The build failed.
  45.  local database is up to date
clone this paste RAW Paste Data