Guest User

Untitled

a guest
Jun 12th, 2010
205
0
Never
Not a member of Pastebin yet? Sign Up, it unlocks many cool features!
text 1.85 KB | None | 0 0
  1. In file included from ../../src/tbb/tbb_version.h:36,
  2. from ../../src/tbb/tbb_misc.cpp:155:
  3. ./version_string.tmp:3:1: warning: missing terminating " character
  4. In file included from ../../src/tbb/tbb_version.h:36,
  5. from ../../src/tbb/tbb_misc.cpp:155:
  6. ./version_string.tmp:4: error: stray â\â in program
  7. ./version_string.tmp:5:27: error: too many decimal points in number
  8. ./version_string.tmp:4: error: stray â#â in program
  9. ./version_string.tmp:4: error: stray â\â in program
  10. ./version_string.tmp:4: error: stray â\â in program
  11. ./version_string.tmp:6:32: error: too many decimal points in number
  12. ./version_string.tmp:4: error: stray â\â in program
  13. ./version_string.tmp:7:21: error: too many decimal points in number
  14. ./version_string.tmp:4: error: stray â\â in program
  15. ./version_string.tmp:4: error: stray â\â in program
  16. ./version_string.tmp:4: error: stray â\â in program
  17. ./version_string.tmp:9:35: error: too many decimal points in number
  18. ./version_string.tmp:4: error: stray â\â in program
  19. ./version_string.tmp:10:241: warning: missing terminating " character
  20. ./version_string.tmp:4: error: missing terminating " character
  21. ../../src/tbb/tbb_misc.cpp:158: error: missing terminating " character
  22. In file included from ../../src/tbb/tbb_version.h:36,
  23. from ../../src/tbb/tbb_misc.cpp:155:
  24. ./version_string.tmp:4: error: expected unqualified-id before string constant
  25. ../../src/tbb/tbb_misc.cpp: In function âvoid tbb::internal::PrintVersion()â:
  26. ../../src/tbb/tbb_misc.cpp:164: error: âVersionStringâ was not declared in this scope
  27. make[1]: *** [tbb_misc.o] Error 1
  28. make[1]: Leaving directory `/tmp/yaourt-tmp-greenfish/aur-intel-tbb/intel-tbb/src/tbb30_20100310oss/build/linux_intel64_gcc_cc4.4.3_libc2.11.1_kernel2.6.32_debug'
  29. make: *** [tbb] Error 2
  30. ==> ERROR: Build Failed.
  31. Aborting...
  32. Error: Makepkg was unable to build intel-tbb package.
Advertisement
Add Comment
Please, Sign In to add comment