Pastebin launched a little side project called VERYVIRAL.com, check it out ;-) Want more features on Pastebin? Sign Up, it's FREE!
Guest

Untitled

By: a guest on Nov 7th, 2013  |  syntax: None  |  size: 5.39 KB  |  views: 7  |  expires: Never
download  |  raw  |  embed  |  report abuse  |  print
Text below is selected. Please press Ctrl+C to copy to your clipboard. (⌘+C on Mac)
  1. | Error 2013-11-07 11:26:57,151 [localhost-startStop-1] ERROR context.GrailsContextLoader  - Error initializing the application: org/springframework/beans/factory/NoUniqueBeanDefinitionException
  2. Message: org/springframework/beans/factory/NoUniqueBeanDefinitionException
  3.     Line | Method
  4. ->> 2521 | privateGetDeclaredMethods in java.lang.Class
  5. - - - - - - - - - - - - - - - - - - - - - - - - - - - - - - - - - - - -
  6. |   1845 | getDeclaredMethods        in     ''
  7. |    262 | run . . . . . . . . . . . in java.util.concurrent.FutureTask
  8. |   1145 | runWorker                 in java.util.concurrent.ThreadPoolExecutor
  9. |    615 | run . . . . . . . . . . . in java.util.concurrent.ThreadPoolExecutor$Worker
  10. ^    724 | run                       in java.lang.Thread
  11.  
  12. Caused by ClassNotFoundException: org.springframework.beans.factory.NoUniqueBeanDefinitionException
  13. ->>  175 | findClass                 in org.codehaus.groovy.tools.RootLoader
  14. - - - - - - - - - - - - - - - - - - - - - - - - - - - - - - - - - - - -
  15. |    424 | loadClass                 in java.lang.ClassLoader
  16. |    147 | loadClass . . . . . . . . in org.codehaus.groovy.tools.RootLoader
  17. |    357 | loadClass                 in java.lang.ClassLoader
  18. |   2521 | privateGetDeclaredMethods in java.lang.Class
  19. |   1845 | getDeclaredMethods        in     ''
  20. |    262 | run . . . . . . . . . . . in java.util.concurrent.FutureTask
  21. |   1145 | runWorker                 in java.util.concurrent.ThreadPoolExecutor
  22. |    615 | run . . . . . . . . . . . in java.util.concurrent.ThreadPoolExecutor$Worker
  23. ^    724 | run                       in java.lang.Thread
  24. | Error 2013-11-07 11:26:57,156 [localhost-startStop-1] ERROR context.GrailsContextLoader  - Error initializing Grails: org/springframework/beans/factory/NoUniqueBeanDefinitionException
  25. Message: org/springframework/beans/factory/NoUniqueBeanDefinitionException
  26.     Line | Method
  27. ->> 2521 | privateGetDeclaredMethods in java.lang.Class
  28. - - - - - - - - - - - - - - - - - - - - - - - - - - - - - - - - - - - -
  29. |   1845 | getDeclaredMethods        in     ''
  30. |    262 | run . . . . . . . . . . . in java.util.concurrent.FutureTask
  31. |   1145 | runWorker                 in java.util.concurrent.ThreadPoolExecutor
  32. |    615 | run . . . . . . . . . . . in java.util.concurrent.ThreadPoolExecutor$Worker
  33. ^    724 | run                       in java.lang.Thread
  34.  
  35. Caused by ClassNotFoundException: org.springframework.beans.factory.NoUniqueBeanDefinitionException
  36. ->>  175 | findClass                 in org.codehaus.groovy.tools.RootLoader
  37. - - - - - - - - - - - - - - - - - - - - - - - - - - - - - - - - - - - -
  38. |    424 | loadClass                 in java.lang.ClassLoader
  39. |    147 | loadClass . . . . . . . . in org.codehaus.groovy.tools.RootLoader
  40. |    357 | loadClass                 in java.lang.ClassLoader
  41. |   2521 | privateGetDeclaredMethods in java.lang.Class
  42. |   1845 | getDeclaredMethods        in     ''
  43. |    262 | run . . . . . . . . . . . in java.util.concurrent.FutureTask
  44. |   1145 | runWorker                 in java.util.concurrent.ThreadPoolExecutor
  45. |    615 | run . . . . . . . . . . . in java.util.concurrent.ThreadPoolExecutor$Worker
  46. ^    724 | run                       in java.lang.Thread
  47. | Error 2013-11-07 11:26:57,158 [localhost-startStop-1] ERROR [localhost].[/finance]  - Exception sending context initialized event to listener instance of class org.codehaus.groovy.grails.web.context.GrailsContextLoaderListener
  48. Message: Error executing bootstraps; nested exception is java.lang.NoClassDefFoundError: org/springframework/beans/factory/NoUniqueBeanDefinitionException
  49.     Line | Method
  50. ->>  262 | run       in java.util.concurrent.FutureTask
  51. - - - - - - - - - - - - - - - - - - - - - - - - - - - - - - - - - - - -
  52. |   1145 | runWorker in java.util.concurrent.ThreadPoolExecutor
  53. |    615 | run . . . in java.util.concurrent.ThreadPoolExecutor$Worker
  54. ^    724 | run       in java.lang.Thread
  55.  
  56. Caused by NoClassDefFoundError: org/springframework/beans/factory/NoUniqueBeanDefinitionException
  57. ->> 2521 | privateGetDeclaredMethods in java.lang.Class
  58. - - - - - - - - - - - - - - - - - - - - - - - - - - - - - - - - - - - -
  59. |   1845 | getDeclaredMethods in     ''
  60. |    262 | run . . . in java.util.concurrent.FutureTask
  61. |   1145 | runWorker in java.util.concurrent.ThreadPoolExecutor
  62. |    615 | run . . . in java.util.concurrent.ThreadPoolExecutor$Worker
  63. ^    724 | run       in java.lang.Thread
  64.  
  65. Caused by ClassNotFoundException: org.springframework.beans.factory.NoUniqueBeanDefinitionException
  66. ->>  175 | findClass in org.codehaus.groovy.tools.RootLoader
  67. - - - - - - - - - - - - - - - - - - - - - - - - - - - - - - - - - - - -
  68. |    424 | loadClass in java.lang.ClassLoader
  69. |    147 | loadClass in org.codehaus.groovy.tools.RootLoader
  70. |    357 | loadClass in java.lang.ClassLoader
  71. |   2521 | privateGetDeclaredMethods in java.lang.Class
  72. |   1845 | getDeclaredMethods in     ''
  73. |    262 | run . . . in java.util.concurrent.FutureTask
  74. |   1145 | runWorker in java.util.concurrent.ThreadPoolExecutor
  75. |    615 | run . . . in java.util.concurrent.ThreadPoolExecutor$Worker
  76. ^    724 | run       in java.lang.Thread
  77. | Error 2013-11-07 11:26:57,160 [localhost-startStop-1] ERROR core.StandardContext  - Error listenerStart
  78. | Error 2013-11-07 11:26:57,161 [localhost-startStop-1] ERROR core.StandardContext  - Context [/finance] startup failed due to previous errors
  79. | Server running. Browse to http://localhost:8080/finance
clone this paste RAW Paste Data