Pastebin launched a little side project called VERYVIRAL.com, check it out ;-) Want more features on Pastebin? Sign Up, it's FREE!
Guest

Untitled

By: a guest on Feb 3rd, 2011  |  syntax: HTML  |  size: 6.78 KB  |  views: 271  |  expires: Never
download  |  raw  |  embed  |  report abuse  |  print
Text below is selected. Please press Ctrl+C to copy to your clipboard. (⌘+C on Mac)
  1. $ make
  2. [100%] Building C object src/CMakeFiles/main.dir/main.c.o
  3. /home/avp/soft/build/graphics/photo/gimp-plugins/laso/gimp-laso-devel/src/main.c:11:26: error: libgimp/gimp.h: No such file or directory
  4. /home/avp/soft/build/graphics/photo/gimp-plugins/laso/gimp-laso-devel/src/main.c:12:28: error: libgimp/gimpui.h: No such file or directory
  5. In file included from /home/avp/soft/build/graphics/photo/gimp-plugins/laso/gimp-laso-devel/src/main.c:18:
  6. /home/avp/soft/build/graphics/photo/gimp-plugins/laso/gimp-laso-devel/src/main.h:17: error: expected specifier-qualifier-list before 'gint'
  7. /home/avp/soft/build/graphics/photo/gimp-plugins/laso/gimp-laso-devel/src/main.h:35: error: expected specifier-qualifier-list before 'gint32'
  8. /home/avp/soft/build/graphics/photo/gimp-plugins/laso/gimp-laso-devel/src/main.h:40: error: expected specifier-qualifier-list before 'gint32'
  9. /home/avp/soft/build/graphics/photo/gimp-plugins/laso/gimp-laso-devel/src/main.h:45: error: expected specifier-qualifier-list before 'gboolean'
  10. In file included from /home/avp/soft/build/graphics/photo/gimp-plugins/laso/gimp-laso-devel/src/main.c:20:
  11. /home/avp/soft/build/graphics/photo/gimp-plugins/laso/gimp-laso-devel/src/interface.h:16: error: expected '=', ',', ';', 'asm' or '__attribute__' before 'dialog'
  12. In file included from /home/avp/soft/build/graphics/photo/gimp-plugins/laso/gimp-laso-devel/src/main.c:21:
  13. /home/avp/soft/build/graphics/photo/gimp-plugins/laso/gimp-laso-devel/src/render.h:17: error: expected ')' before 'image_ID'
  14. /home/avp/soft/build/graphics/photo/gimp-plugins/laso/gimp-laso-devel/src/main.c:41: error: expected ';', ',' or ')' before '*' token
  15. /home/avp/soft/build/graphics/photo/gimp-plugins/laso/gimp-laso-devel/src/main.c:52: warning: excess elements in struct initializer
  16. /home/avp/soft/build/graphics/photo/gimp-plugins/laso/gimp-laso-devel/src/main.c:52: warning: (near initialization for 'default_vals')
  17. /home/avp/soft/build/graphics/photo/gimp-plugins/laso/gimp-laso-devel/src/main.c:53: warning: excess elements in struct initializer
  18. /home/avp/soft/build/graphics/photo/gimp-plugins/laso/gimp-laso-devel/src/main.c:53: warning: (near initialization for 'default_vals')
  19. /home/avp/soft/build/graphics/photo/gimp-plugins/laso/gimp-laso-devel/src/main.c:54: warning: excess elements in struct initializer
  20. /home/avp/soft/build/graphics/photo/gimp-plugins/laso/gimp-laso-devel/src/main.c:54: warning: (near initialization for 'default_vals')
  21. /home/avp/soft/build/graphics/photo/gimp-plugins/laso/gimp-laso-devel/src/main.c:55: warning: excess elements in struct initializer
  22. /home/avp/soft/build/graphics/photo/gimp-plugins/laso/gimp-laso-devel/src/main.c:55: warning: (near initialization for 'default_vals')
  23. /home/avp/soft/build/graphics/photo/gimp-plugins/laso/gimp-laso-devel/src/main.c:56: warning: excess elements in struct initializer
  24. /home/avp/soft/build/graphics/photo/gimp-plugins/laso/gimp-laso-devel/src/main.c:56: warning: (near initialization for 'default_vals')
  25. /home/avp/soft/build/graphics/photo/gimp-plugins/laso/gimp-laso-devel/src/main.c:57: warning: excess elements in struct initializer
  26. /home/avp/soft/build/graphics/photo/gimp-plugins/laso/gimp-laso-devel/src/main.c:57: warning: (near initialization for 'default_vals')
  27. /home/avp/soft/build/graphics/photo/gimp-plugins/laso/gimp-laso-devel/src/main.c:58: warning: excess elements in struct initializer
  28. /home/avp/soft/build/graphics/photo/gimp-plugins/laso/gimp-laso-devel/src/main.c:58: warning: (near initialization for 'default_vals')
  29. /home/avp/soft/build/graphics/photo/gimp-plugins/laso/gimp-laso-devel/src/main.c:59: warning: excess elements in struct initializer
  30. /home/avp/soft/build/graphics/photo/gimp-plugins/laso/gimp-laso-devel/src/main.c:59: warning: (near initialization for 'default_vals')
  31. /home/avp/soft/build/graphics/photo/gimp-plugins/laso/gimp-laso-devel/src/main.c:60: warning: excess elements in struct initializer
  32. /home/avp/soft/build/graphics/photo/gimp-plugins/laso/gimp-laso-devel/src/main.c:60: warning: (near initialization for 'default_vals')
  33. /home/avp/soft/build/graphics/photo/gimp-plugins/laso/gimp-laso-devel/src/main.c:61: warning: excess elements in struct initializer
  34. /home/avp/soft/build/graphics/photo/gimp-plugins/laso/gimp-laso-devel/src/main.c:61: warning: (near initialization for 'default_vals')
  35. /home/avp/soft/build/graphics/photo/gimp-plugins/laso/gimp-laso-devel/src/main.c:62: warning: excess elements in struct initializer
  36. /home/avp/soft/build/graphics/photo/gimp-plugins/laso/gimp-laso-devel/src/main.c:62: warning: (near initialization for 'default_vals')
  37. /home/avp/soft/build/graphics/photo/gimp-plugins/laso/gimp-laso-devel/src/main.c:63: warning: excess elements in struct initializer
  38. /home/avp/soft/build/graphics/photo/gimp-plugins/laso/gimp-laso-devel/src/main.c:63: warning: (near initialization for 'default_vals')
  39. /home/avp/soft/build/graphics/photo/gimp-plugins/laso/gimp-laso-devel/src/main.c:64: warning: excess elements in struct initializer
  40. /home/avp/soft/build/graphics/photo/gimp-plugins/laso/gimp-laso-devel/src/main.c:64: warning: (near initialization for 'default_vals')
  41. /home/avp/soft/build/graphics/photo/gimp-plugins/laso/gimp-laso-devel/src/main.c:70: warning: excess elements in struct initializer
  42. /home/avp/soft/build/graphics/photo/gimp-plugins/laso/gimp-laso-devel/src/main.c:70: warning: (near initialization for 'default_image_vals')
  43. /home/avp/soft/build/graphics/photo/gimp-plugins/laso/gimp-laso-devel/src/main.c:75: warning: excess elements in struct initializer
  44. /home/avp/soft/build/graphics/photo/gimp-plugins/laso/gimp-laso-devel/src/main.c:75: warning: (near initialization for 'default_drawable_vals')
  45. /home/avp/soft/build/graphics/photo/gimp-plugins/laso/gimp-laso-devel/src/main.c:79: error: 'TRUE' undeclared here (not in a function)
  46. /home/avp/soft/build/graphics/photo/gimp-plugins/laso/gimp-laso-devel/src/main.c:80: warning: excess elements in struct initializer
  47. /home/avp/soft/build/graphics/photo/gimp-plugins/laso/gimp-laso-devel/src/main.c:80: warning: (near initialization for 'default_ui_vals')
  48. /home/avp/soft/build/graphics/photo/gimp-plugins/laso/gimp-laso-devel/src/main.c:88: error: expected '=', ',', ';', 'asm' or '__attribute__' before 'PLUG_IN_INFO'
  49. /home/avp/soft/build/graphics/photo/gimp-plugins/laso/gimp-laso-devel/src/main.c: In function 'MAIN':
  50. /home/avp/soft/build/graphics/photo/gimp-plugins/laso/gimp-laso-devel/src/main.c:100: error: expected '=', ',', ';', 'asm' or '__attribute__' before '{' token
  51. /home/avp/soft/build/graphics/photo/gimp-plugins/laso/gimp-laso-devel/src/main.c:173: error: expected ';', ',' or ')' before '*' token
  52. /home/avp/soft/build/graphics/photo/gimp-plugins/laso/gimp-laso-devel/src/main.c:289: error: expected '{' at end of input
  53. make[2]: *** [src/CMakeFiles/main.dir/main.c.o] Error 1
  54. make[1]: *** [src/CMakeFiles/main.dir/all] Error 2
  55. make: *** [all] Error 2
clone this paste RAW Paste Data