Want more features on Pastebin? Sign Up, it's FREE!
Guest

Untitled

By: a guest on Sep 20th, 2012  |  syntax: None  |  size: 216.48 KB  |  views: 72  |  expires: Never
download  |  raw  |  embed  |  report abuse  |  print
Text below is selected. Please press Ctrl+C to copy to your clipboard. (⌘+C on Mac)
  1. [2012-09-20 15:21:15] make
  2.     /usr/bin/gcc -g -O2  -fno-common -pipe -fno-common    -DRUBY_EXPORT  -I. -I. -I/opt/X11/include -D_XOPEN_SOURCE -D_DARWIN_C_SOURCE   -c array.c
  3.     WARNING: While resolving call to function 'inspect_ary' arguments were dropped!
  4.     /usr/bin/gcc -g -O2  -fno-common -pipe -fno-common    -DRUBY_EXPORT  -I. -I. -I/opt/X11/include -D_XOPEN_SOURCE -D_DARWIN_C_SOURCE   -c bignum.c
  5.     /usr/bin/gcc -g -O2  -fno-common -pipe -fno-common    -DRUBY_EXPORT  -I. -I. -I/opt/X11/include -D_XOPEN_SOURCE -D_DARWIN_C_SOURCE   -c class.c
  6.     /usr/bin/gcc -g -O2  -fno-common -pipe -fno-common    -DRUBY_EXPORT  -I. -I. -I/opt/X11/include -D_XOPEN_SOURCE -D_DARWIN_C_SOURCE   -c compar.c
  7.     /usr/bin/gcc -g -O2  -fno-common -pipe -fno-common    -DRUBY_EXPORT  -I. -I. -I/opt/X11/include -D_XOPEN_SOURCE -D_DARWIN_C_SOURCE   -c dir.c
  8.     /usr/bin/gcc -g -O2  -fno-common -pipe -fno-common    -DRUBY_EXPORT  -I. -I. -I/opt/X11/include -D_XOPEN_SOURCE -D_DARWIN_C_SOURCE   -c dln.c
  9.     /usr/bin/gcc -g -O2  -fno-common -pipe -fno-common    -DRUBY_EXPORT  -I. -I. -I/opt/X11/include -D_XOPEN_SOURCE -D_DARWIN_C_SOURCE   -c enum.c
  10.     /usr/bin/gcc -g -O2  -fno-common -pipe -fno-common    -DRUBY_EXPORT  -I. -I. -I/opt/X11/include -D_XOPEN_SOURCE -D_DARWIN_C_SOURCE   -c enumerator.c
  11.     /usr/bin/gcc -g -O2  -fno-common -pipe -fno-common    -DRUBY_EXPORT  -I. -I. -I/opt/X11/include -D_XOPEN_SOURCE -D_DARWIN_C_SOURCE   -c error.c
  12.     /usr/bin/gcc -g -O2  -fno-common -pipe -fno-common    -DRUBY_EXPORT  -I. -I. -I/opt/X11/include -D_XOPEN_SOURCE -D_DARWIN_C_SOURCE   -c eval.c
  13.     eval.c: In function ‘rb_eval_string_wrap’:
  14.     eval.c:1754: warning: assignment discards qualifiers from pointer target type
  15.     eval.c: In function ‘rb_eval_cmd’:
  16.     eval.c:1895: warning: assignment discards qualifiers from pointer target type
  17.     eval.c: In function ‘call_trace_func’:
  18.     eval.c:2746: warning: assignment discards qualifiers from pointer target type
  19.     eval.c: In function ‘rb_raise_jump’:
  20.     eval.c:4780: warning: assignment discards qualifiers from pointer target type
  21.     eval.c: In function ‘method_missing’:
  22.     eval.c:5746: warning: assignment discards qualifiers from pointer target type
  23.     eval.c: In function ‘rb_call0’:
  24.     eval.c:5904: warning: assignment discards qualifiers from pointer target type
  25.     eval.c: In function ‘rb_f_eval’:
  26.     eval.c:6706: warning: assignment discards qualifiers from pointer target type
  27.     eval.c: In function ‘exec_under’:
  28.     eval.c:6730: warning: assignment discards qualifiers from pointer target type
  29.     eval.c: In function ‘rb_load’:
  30.     eval.c:7046: warning: assignment discards qualifiers from pointer target type
  31.     eval.c: In function ‘call_end_proc’:
  32.     eval.c:8081: warning: assignment discards qualifiers from pointer target type
  33.     eval.c: In function ‘rb_f_END’:
  34.     eval.c:8094: warning: assignment discards qualifiers from pointer target type
  35.     eval.c: In function ‘mproc’:
  36.     eval.c:9870: warning: assignment discards qualifiers from pointer target type
  37.     /usr/bin/gcc -g -O2  -fno-common -pipe -fno-common    -DRUBY_EXPORT  -I. -I. -I/opt/X11/include -D_XOPEN_SOURCE -D_DARWIN_C_SOURCE   -c file.c
  38.     /usr/bin/gcc -g -O2  -fno-common -pipe -fno-common    -DRUBY_EXPORT  -I. -I. -I/opt/X11/include -D_XOPEN_SOURCE -D_DARWIN_C_SOURCE   -c gc.c
  39.     /usr/bin/gcc -g -O2  -fno-common -pipe -fno-common    -DRUBY_EXPORT  -I. -I. -I/opt/X11/include -D_XOPEN_SOURCE -D_DARWIN_C_SOURCE   -c hash.c
  40.     /usr/bin/gcc -g -O2  -fno-common -pipe -fno-common    -DRUBY_EXPORT  -I. -I. -I/opt/X11/include -D_XOPEN_SOURCE -D_DARWIN_C_SOURCE   -c inits.c
  41.     /usr/bin/gcc -g -O2  -fno-common -pipe -fno-common    -DRUBY_EXPORT  -I. -I. -I/opt/X11/include -D_XOPEN_SOURCE -D_DARWIN_C_SOURCE   -c io.c
  42.     /usr/bin/gcc -g -O2  -fno-common -pipe -fno-common    -DRUBY_EXPORT  -I. -I. -I/opt/X11/include -D_XOPEN_SOURCE -D_DARWIN_C_SOURCE   -c marshal.c
  43.     /usr/bin/gcc -g -O2  -fno-common -pipe -fno-common    -DRUBY_EXPORT  -I. -I. -I/opt/X11/include -D_XOPEN_SOURCE -D_DARWIN_C_SOURCE   -c math.c
  44.     /usr/bin/gcc -g -O2  -fno-common -pipe -fno-common    -DRUBY_EXPORT  -I. -I. -I/opt/X11/include -D_XOPEN_SOURCE -D_DARWIN_C_SOURCE   -c numeric.c
  45.     /usr/bin/gcc -g -O2  -fno-common -pipe -fno-common    -DRUBY_EXPORT  -I. -I. -I/opt/X11/include -D_XOPEN_SOURCE -D_DARWIN_C_SOURCE   -c object.c
  46.     /usr/bin/gcc -g -O2  -fno-common -pipe -fno-common    -DRUBY_EXPORT  -I. -I. -I/opt/X11/include -D_XOPEN_SOURCE -D_DARWIN_C_SOURCE   -c pack.c
  47.     /usr/bin/gcc -g -O2  -fno-common -pipe -fno-common    -DRUBY_EXPORT  -I. -I. -I/opt/X11/include -D_XOPEN_SOURCE -D_DARWIN_C_SOURCE   -c parse.c
  48.     /usr/bin/gcc -g -O2  -fno-common -pipe -fno-common    -DRUBY_EXPORT  -I. -I. -I/opt/X11/include -D_XOPEN_SOURCE -D_DARWIN_C_SOURCE   -c process.c
  49.     /usr/bin/gcc -g -O2  -fno-common -pipe -fno-common    -DRUBY_EXPORT  -I. -I. -I/opt/X11/include -D_XOPEN_SOURCE -D_DARWIN_C_SOURCE   -c prec.c
  50.     /usr/bin/gcc -g -O2  -fno-common -pipe -fno-common    -DRUBY_EXPORT  -I. -I. -I/opt/X11/include -D_XOPEN_SOURCE -D_DARWIN_C_SOURCE   -c random.c
  51.     random.c: In function ‘make_seed_value’:
  52.     random.c:306: warning: assignment from incompatible pointer type
  53.     /usr/bin/gcc -g -O2  -fno-common -pipe -fno-common    -DRUBY_EXPORT  -I. -I. -I/opt/X11/include -D_XOPEN_SOURCE -D_DARWIN_C_SOURCE   -c range.c
  54.     /usr/bin/gcc -g -O2  -fno-common -pipe -fno-common    -DRUBY_EXPORT  -I. -I. -I/opt/X11/include -D_XOPEN_SOURCE -D_DARWIN_C_SOURCE   -c re.c
  55.     /usr/bin/gcc -g -O2  -fno-common -pipe -fno-common    -DRUBY_EXPORT  -I. -I. -I/opt/X11/include -D_XOPEN_SOURCE -D_DARWIN_C_SOURCE   -c regex.c
  56.     regex.c: In function ‘ruby_re_compile_pattern’:
  57.     regex.c:1367: warning: format ‘%d’ expects type ‘int’, but argument 7 has type ‘long int’
  58.     regex.c:2031: warning: format ‘%d’ expects type ‘int’, but argument 6 has type ‘long int’
  59.     /usr/bin/gcc -g -O2  -fno-common -pipe -fno-common    -DRUBY_EXPORT  -I. -I. -I/opt/X11/include -D_XOPEN_SOURCE -D_DARWIN_C_SOURCE   -c ruby.c
  60.     /usr/bin/gcc -g -O2  -fno-common -pipe -fno-common    -DRUBY_EXPORT  -I. -I. -I/opt/X11/include -D_XOPEN_SOURCE -D_DARWIN_C_SOURCE   -c signal.c
  61.     /usr/bin/gcc -g -O2  -fno-common -pipe -fno-common    -DRUBY_EXPORT  -I. -I. -I/opt/X11/include -D_XOPEN_SOURCE -D_DARWIN_C_SOURCE   -c sprintf.c
  62.     /usr/bin/gcc -g -O2  -fno-common -pipe -fno-common    -DRUBY_EXPORT  -I. -I. -I/opt/X11/include -D_XOPEN_SOURCE -D_DARWIN_C_SOURCE   -c st.c
  63.     /usr/bin/gcc -g -O2  -fno-common -pipe -fno-common    -DRUBY_EXPORT  -I. -I. -I/opt/X11/include -D_XOPEN_SOURCE -D_DARWIN_C_SOURCE   -c string.c
  64.     /usr/bin/gcc -g -O2  -fno-common -pipe -fno-common    -DRUBY_EXPORT  -I. -I. -I/opt/X11/include -D_XOPEN_SOURCE -D_DARWIN_C_SOURCE   -c struct.c
  65.     /usr/bin/gcc -g -O2  -fno-common -pipe -fno-common    -DRUBY_EXPORT  -I. -I. -I/opt/X11/include -D_XOPEN_SOURCE -D_DARWIN_C_SOURCE   -c time.c
  66.     /usr/bin/gcc -g -O2  -fno-common -pipe -fno-common    -DRUBY_EXPORT  -I. -I. -I/opt/X11/include -D_XOPEN_SOURCE -D_DARWIN_C_SOURCE   -c util.c
  67.     /usr/bin/gcc -g -O2  -fno-common -pipe -fno-common    -DRUBY_EXPORT  -I. -I. -I/opt/X11/include -D_XOPEN_SOURCE -D_DARWIN_C_SOURCE   -c variable.c
  68.     /usr/bin/gcc -g -O2  -fno-common -pipe -fno-common    -DRUBY_EXPORT  -I. -I. -I/opt/X11/include -D_XOPEN_SOURCE -D_DARWIN_C_SOURCE   -c version.c
  69.     /usr/bin/gcc -g -O2  -fno-common -pipe -fno-common    -DRUBY_EXPORT  -I. -I. -I/opt/X11/include -D_XOPEN_SOURCE -D_DARWIN_C_SOURCE   -c dmyext.c
  70.     ar rcu libruby-static.a array.o bignum.o class.o compar.o dir.o dln.o enum.o enumerator.o error.o eval.o file.o gc.o hash.o inits.o io.o marshal.o math.o numeric.o object.o pack.o parse.o process.o prec.o random.o range.o re.o regex.o ruby.o signal.o sprintf.o st.o string.o struct.o time.o util.o variable.o version.o  dmyext.o
  71.     /usr/bin/gcc -g -O2  -fno-common -pipe -fno-common    -DRUBY_EXPORT  -I. -I. -I/opt/X11/include -D_XOPEN_SOURCE -D_DARWIN_C_SOURCE   -c main.c
  72.     /usr/bin/gcc -g -O2  -fno-common -pipe -fno-common    -DRUBY_EXPORT  -I. -I. -I/opt/X11/include -D_XOPEN_SOURCE -D_DARWIN_C_SOURCE   -c dmydln.c
  73.     /usr/bin/gcc -g -O2  -fno-common -pipe -fno-common    -DRUBY_EXPORT  -L.    main.o dmydln.o libruby-static.a -ldl -lobjc   -o miniruby
  74.     rbconfig.rb updated
  75.     cc -dynamiclib -undefined suppress -flat_namespace -install_name /Users/serg/.rvm/rubies/ruby-1.8.7-p370/lib/libruby.dylib -current_version 1.8.7 -compatibility_version 1.8   array.o bignum.o class.o compar.o dir.o dln.o enum.o enumerator.o error.o eval.o file.o gc.o hash.o inits.o io.o marshal.o math.o numeric.o object.o pack.o parse.o process.o prec.o random.o range.o re.o regex.o ruby.o signal.o sprintf.o st.o string.o struct.o time.o util.o variable.o version.o  dmyext.o  -o libruby.1.8.7.dylib
  76.     compiling Win32API
  77.     compiling bigdecimal
  78.     mkdir -p ../../.ext/i686-darwin12.2.0
  79.     /usr/bin/gcc -I. -I../.. -I../../. -I../.././ext/bigdecimal -DBASE=1000000000UL -DBASE_FIG=9 -I/opt/X11/include -D_XOPEN_SOURCE -D_DARWIN_C_SOURCE   -fno-common -g -O2  -fno-common -pipe -fno-common   -c bigdecimal.c
  80.     cc -dynamic -bundle -undefined suppress -flat_namespace -o ../../.ext/i686-darwin12.2.0/bigdecimal.bundle bigdecimal.o -L. -L../.. -L.     -lruby  -ldl -lobjc  
  81.     mkdir -p ../../.ext/common/bigdecimal
  82.     cp ../.././ext/bigdecimal/lib/bigdecimal/jacobian.rb ../../.ext/common/bigdecimal
  83.     cp ../.././ext/bigdecimal/lib/bigdecimal/ludcmp.rb ../../.ext/common/bigdecimal
  84.     cp ../.././ext/bigdecimal/lib/bigdecimal/math.rb ../../.ext/common/bigdecimal
  85.     cp ../.././ext/bigdecimal/lib/bigdecimal/newton.rb ../../.ext/common/bigdecimal
  86.     cp ../.././ext/bigdecimal/lib/bigdecimal/util.rb ../../.ext/common/bigdecimal
  87.     compiling curses
  88.     /usr/bin/gcc -I. -I../.. -I../../. -I../.././ext/curses -DHAVE_NCURSES_H -DHAVE_BEEP -DHAVE_BKGD -DHAVE_BKGDSET -DHAVE_CURS_SET -DHAVE_DELETELN -DHAVE_DOUPDATE -DHAVE_FLASH -DHAVE_GETBKGD -DHAVE_GETNSTR -DHAVE_ISENDWIN -DHAVE_KEYNAME -DHAVE_KEYPAD -DHAVE_RESIZETERM -DHAVE_SCRL -DHAVE_SETSCRREG -DHAVE_UNGETCH -DHAVE_WATTROFF -DHAVE_WATTRON -DHAVE_WATTRSET -DHAVE_WBKGD -DHAVE_WBKGDSET -DHAVE_WDELETELN -DHAVE_WGETNSTR -DHAVE_WRESIZE -DHAVE_WSCRL -DHAVE_WSETSCRREG -DHAVE_DEF_PROG_MODE -DHAVE_RESET_PROG_MODE -DHAVE_TIMEOUT -DHAVE_WTIMEOUT -DHAVE_NODELAY -DHAVE_INIT_COLOR -DHAVE_WCOLOR_SET -D_XOPEN_SOURCE_EXTENDED -I/opt/X11/include -D_XOPEN_SOURCE -D_DARWIN_C_SOURCE  -I/opt/X11/include -fno-common -g -O2  -fno-common -pipe -fno-common   -c curses.c
  89.     cc -dynamic -bundle -undefined suppress -flat_namespace -o ../../.ext/i686-darwin12.2.0/curses.bundle curses.o -L. -L../.. -L.     -lruby -lncurses -ltermcap  -ldl -lobjc  
  90.     compiling dbm
  91.     /usr/bin/gcc -I. -I../.. -I../../. -I../.././ext/dbm -DHAVE_DBM_OPEN -DHAVE_TYPE_DBM -DHAVE_DBM_CLEARERR -DDBM_HDR="<ndbm.h>" -DHAVE_SYS_CDEFS_H -I/opt/X11/include -D_XOPEN_SOURCE -D_DARWIN_C_SOURCE  -I/opt/X11/include -fno-common -g -O2  -fno-common -pipe -fno-common   -c dbm.c
  92.     cc -dynamic -bundle -undefined suppress -flat_namespace -o ../../.ext/i686-darwin12.2.0/dbm.bundle dbm.o -L. -L../.. -L.     -lruby  -ldl -lobjc  
  93.     compiling digest
  94.     /usr/bin/gcc -I. -I../.. -I../../. -I../.././ext/digest -I/opt/X11/include -D_XOPEN_SOURCE -D_DARWIN_C_SOURCE   -fno-common -g -O2  -fno-common -pipe -fno-common   -c digest.c
  95.     digest.c: In function ‘rb_digest_instance_inspect’:
  96.     digest.c:280: warning: assignment discards qualifiers from pointer target type
  97.     cc -dynamic -bundle -undefined suppress -flat_namespace -o ../../.ext/i686-darwin12.2.0/digest.bundle digest.o -L. -L../.. -L.     -lruby  -ldl -lobjc  
  98.     cp ../.././ext/digest/lib/digest.rb ../../.ext/common
  99.     cp ../.././ext/digest/lib/md5.rb ../../.ext/common
  100.     cp ../.././ext/digest/lib/sha1.rb ../../.ext/common
  101.     cp ../.././ext/digest/digest.h ../../.ext/i686-darwin12.2.0
  102.     compiling digest/bubblebabble
  103.     mkdir -p ../../../.ext/i686-darwin12.2.0/digest
  104.     /usr/bin/gcc -I. -I../../.. -I../../../. -I../../.././ext/digest/bubblebabble -I../../.././ext/digest/bubblebabble/.. -DHAVE_CONFIG_H -I/opt/X11/include -D_XOPEN_SOURCE -D_DARWIN_C_SOURCE   -fno-common -g -O2  -fno-common -pipe -fno-common   -c bubblebabble.c
  105.     cc -dynamic -bundle -undefined suppress -flat_namespace -o ../../../.ext/i686-darwin12.2.0/digest/bubblebabble.bundle bubblebabble.o -L. -L../../.. -L.     -lruby  -ldl -lobjc  
  106.     compiling digest/md5
  107.     /usr/bin/gcc -I. -I../../.. -I../../../. -I../../.././ext/digest/md5 -I../../.././ext/digest/md5/.. -DHAVE_CONFIG_H -DHAVE_OPENSSL_MD5_H -DHAVE_SYS_CDEFS_H -DHAVE_INTTYPES_H -DHAVE_UNISTD_H -I/opt/X11/include -D_XOPEN_SOURCE -D_DARWIN_C_SOURCE  -I/opt/X11/include -fno-common -g -O2  -fno-common -pipe -fno-common   -c md5init.c
  108.     md5init.c:16: warning: ‘MD5_Init’ is deprecated (declared at /usr/include/openssl/md5.h:113)
  109.     md5init.c:17: warning: ‘MD5_Update’ is deprecated (declared at /usr/include/openssl/md5.h:114)
  110.     /usr/bin/gcc -I. -I../../.. -I../../../. -I../../.././ext/digest/md5 -I../../.././ext/digest/md5/.. -DHAVE_CONFIG_H -DHAVE_OPENSSL_MD5_H -DHAVE_SYS_CDEFS_H -DHAVE_INTTYPES_H -DHAVE_UNISTD_H -I/opt/X11/include -D_XOPEN_SOURCE -D_DARWIN_C_SOURCE  -I/opt/X11/include -fno-common -g -O2  -fno-common -pipe -fno-common   -c md5ossl.c
  111.     md5ossl.c: In function ‘MD5_Finish’:
  112.     md5ossl.c:8: warning: ‘MD5_Final’ is deprecated (declared at /usr/include/openssl/md5.h:115)
  113.     cc -dynamic -bundle -undefined suppress -flat_namespace -o ../../../.ext/i686-darwin12.2.0/digest/md5.bundle md5init.o md5ossl.o -L. -L../../.. -L.     -lruby -lcrypto  -ldl -lobjc  
  114.     compiling digest/rmd160
  115.     /usr/bin/gcc -I. -I../../.. -I../../../. -I../../.././ext/digest/rmd160 -I../../.././ext/digest/rmd160/.. -DNDEBUG -DHAVE_CONFIG_H -DHAVE_OPENSSL_RIPEMD_H -DHAVE_SYS_CDEFS_H -DHAVE_INTTYPES_H -DHAVE_UNISTD_H -I/opt/X11/include -D_XOPEN_SOURCE -D_DARWIN_C_SOURCE  -I/opt/X11/include -fno-common -g -O2  -fno-common -pipe -fno-common   -c rmd160init.c
  116.     rmd160init.c:16: warning: ‘RIPEMD160_Init’ is deprecated (declared at /usr/include/openssl/ripemd.h:98)
  117.     rmd160init.c:17: warning: ‘RIPEMD160_Update’ is deprecated (declared at /usr/include/openssl/ripemd.h:99)
  118.     /usr/bin/gcc -I. -I../../.. -I../../../. -I../../.././ext/digest/rmd160 -I../../.././ext/digest/rmd160/.. -DNDEBUG -DHAVE_CONFIG_H -DHAVE_OPENSSL_RIPEMD_H -DHAVE_SYS_CDEFS_H -DHAVE_INTTYPES_H -DHAVE_UNISTD_H -I/opt/X11/include -D_XOPEN_SOURCE -D_DARWIN_C_SOURCE  -I/opt/X11/include -fno-common -g -O2  -fno-common -pipe -fno-common   -c rmd160ossl.c
  119.     rmd160ossl.c: In function ‘RMD160_Finish’:
  120.     rmd160ossl.c:7: warning: ‘RIPEMD160_Final’ is deprecated (declared at /usr/include/openssl/ripemd.h:100)
  121.     cc -dynamic -bundle -undefined suppress -flat_namespace -o ../../../.ext/i686-darwin12.2.0/digest/rmd160.bundle rmd160init.o rmd160ossl.o -L. -L../../.. -L.     -lruby -lcrypto  -ldl -lobjc  
  122.     compiling digest/sha1
  123.     /usr/bin/gcc -I. -I../../.. -I../../../. -I../../.././ext/digest/sha1 -I../../.././ext/digest/sha1/.. -DHAVE_CONFIG_H -DHAVE_OPENSSL_SHA_H -DHAVE_SYS_CDEFS_H -DHAVE_INTTYPES_H -DHAVE_UNISTD_H -I/opt/X11/include -D_XOPEN_SOURCE -D_DARWIN_C_SOURCE  -I/opt/X11/include -fno-common -g -O2  -fno-common -pipe -fno-common   -c sha1init.c
  124.     sha1init.c:16: warning: ‘SHA1_Init’ is deprecated (declared at /usr/include/openssl/sha.h:121)
  125.     sha1init.c:17: warning: ‘SHA1_Update’ is deprecated (declared at /usr/include/openssl/sha.h:122)
  126.     /usr/bin/gcc -I. -I../../.. -I../../../. -I../../.././ext/digest/sha1 -I../../.././ext/digest/sha1/.. -DHAVE_CONFIG_H -DHAVE_OPENSSL_SHA_H -DHAVE_SYS_CDEFS_H -DHAVE_INTTYPES_H -DHAVE_UNISTD_H -I/opt/X11/include -D_XOPEN_SOURCE -D_DARWIN_C_SOURCE  -I/opt/X11/include -fno-common -g -O2  -fno-common -pipe -fno-common   -c sha1ossl.c
  127.     sha1ossl.c: In function ‘SHA1_Finish’:
  128.     sha1ossl.c:9: warning: ‘SHA1_Final’ is deprecated (declared at /usr/include/openssl/sha.h:123)
  129.     cc -dynamic -bundle -undefined suppress -flat_namespace -o ../../../.ext/i686-darwin12.2.0/digest/sha1.bundle sha1init.o sha1ossl.o -L. -L../../.. -L.     -lruby -lcrypto  -ldl -lobjc  
  130.     compiling digest/sha2
  131.     /usr/bin/gcc -I. -I../../.. -I../../../. -I../../.././ext/digest/sha2 -I../../.././ext/digest/sha2/.. -DHAVE_CONFIG_H -DHAVE_SYS_CDEFS_H -DHAVE_INTTYPES_H -DHAVE_UNISTD_H -DHAVE_TYPE_UINT64_T -I/opt/X11/include -D_XOPEN_SOURCE -D_DARWIN_C_SOURCE   -fno-common -g -O2  -fno-common -pipe -fno-common   -c sha2.c
  132.     /usr/bin/gcc -I. -I../../.. -I../../../. -I../../.././ext/digest/sha2 -I../../.././ext/digest/sha2/.. -DHAVE_CONFIG_H -DHAVE_SYS_CDEFS_H -DHAVE_INTTYPES_H -DHAVE_UNISTD_H -DHAVE_TYPE_UINT64_T -I/opt/X11/include -D_XOPEN_SOURCE -D_DARWIN_C_SOURCE   -fno-common -g -O2  -fno-common -pipe -fno-common   -c sha2init.c
  133.     cc -dynamic -bundle -undefined suppress -flat_namespace -o ../../../.ext/i686-darwin12.2.0/digest/sha2.bundle sha2.o sha2init.o -L. -L../../.. -L.     -lruby  -ldl -lobjc  
  134.     mkdir -p ../../../.ext/common/digest
  135.     cp ../../.././ext/digest/sha2/lib/sha2.rb ../../../.ext/common/digest
  136.     compiling dl
  137.     Generating callback.func
  138.     Generating cbtable.func
  139.     /usr/bin/gcc -I. -I../.. -I../../. -I../.././ext/dl -DHAVE_DLFCN_H -DHAVE_DLOPEN -DHAVE_DLCLOSE -DHAVE_DLSYM -DHAVE_DLERROR -I/opt/X11/include -D_XOPEN_SOURCE -D_DARWIN_C_SOURCE  -I/opt/X11/include -I. -fno-common -g -O2  -fno-common -pipe -fno-common  -fno-defer-pop -fno-omit-frame-pointer  -c dl.c
  140.     /usr/bin/gcc -I. -I../.. -I../../. -I../.././ext/dl -DHAVE_DLFCN_H -DHAVE_DLOPEN -DHAVE_DLCLOSE -DHAVE_DLSYM -DHAVE_DLERROR -I/opt/X11/include -D_XOPEN_SOURCE -D_DARWIN_C_SOURCE  -I/opt/X11/include -I. -fno-common -g -O2  -fno-common -pipe -fno-common  -fno-defer-pop -fno-omit-frame-pointer  -c handle.c
  141.     /usr/bin/gcc -I. -I../.. -I../../. -I../.././ext/dl -DHAVE_DLFCN_H -DHAVE_DLOPEN -DHAVE_DLCLOSE -DHAVE_DLSYM -DHAVE_DLERROR -I/opt/X11/include -D_XOPEN_SOURCE -D_DARWIN_C_SOURCE  -I/opt/X11/include -I. -fno-common -g -O2  -fno-common -pipe -fno-common  -fno-defer-pop -fno-omit-frame-pointer  -c ptr.c
  142.     ptr.c: In function ‘rb_dlptr_inspect’:
  143.     ptr.c:461: warning: format ‘%lx’ expects type ‘long unsigned int’, but argument 7 has type ‘struct ptr_data *’
  144.     ptr.c:461: warning: format ‘%lx’ expects type ‘long unsigned int’, but argument 8 has type ‘void *’
  145.     Generating call.func
  146.       void
  147.       char
  148.       short
  149.       int
  150.       long
  151.       float
  152.       double
  153.     /usr/bin/gcc -I. -I../.. -I../../. -I../.././ext/dl -DHAVE_DLFCN_H -DHAVE_DLOPEN -DHAVE_DLCLOSE -DHAVE_DLSYM -DHAVE_DLERROR -I/opt/X11/include -D_XOPEN_SOURCE -D_DARWIN_C_SOURCE  -I/opt/X11/include -I. -fno-common -g -O2  -fno-common -pipe -fno-common  -fno-defer-pop -fno-omit-frame-pointer  -c sym.c
  154.     sym.c: In function ‘rb_dlsym_inspect’:
  155.     sym.c:270: warning: format ‘%lx’ expects type ‘long unsigned int’, but argument 6 has type ‘struct sym_data *’
  156.     sym.c:270: warning: format ‘%lx’ expects type ‘long unsigned int’, but argument 7 has type ‘void *’
  157.     cc -dynamic -bundle -undefined suppress -flat_namespace -o ../../.ext/i686-darwin12.2.0/dl.bundle dl.o handle.o ptr.o sym.o -L. -L../.. -L.     -lruby -ldl  -ldl -lobjc  
  158.     mkdir -p ../../.ext/common/dl
  159.     cp ../.././ext/dl/lib/dl/import.rb ../../.ext/common/dl
  160.     cp ../.././ext/dl/lib/dl/struct.rb ../../.ext/common/dl
  161.     cp ../.././ext/dl/lib/dl/types.rb ../../.ext/common/dl
  162.     cp ../.././ext/dl/lib/dl/win32.rb ../../.ext/common/dl
  163.     cp dlconfig.h ../../.ext/i686-darwin12.2.0
  164.     cp ../.././ext/dl/dl.h ../../.ext/i686-darwin12.2.0
  165.     compiling etc
  166.     /usr/bin/gcc -I. -I../.. -I../../. -I../.././ext/etc -DHAVE_GETLOGIN -DHAVE_GETPWENT -DHAVE_GETGRENT -DHAVE_ST_PW_GECOS -DHAVE_ST_PW_CHANGE -DHAVE_ST_PW_CLASS -DHAVE_ST_PW_EXPIRE -DHAVE_ST_PW_PASSWD -DHAVE_ST_GR_PASSWD -DHAVE_TYPE_UID_T -DPW_UID2VAL=UINT2NUM -DPW_VAL2UID=NUM2UINT -DHAVE_TYPE_GID_T -DPW_GID2VAL=UINT2NUM -DPW_VAL2GID=NUM2UINT -I/opt/X11/include -D_XOPEN_SOURCE -D_DARWIN_C_SOURCE  -I/opt/X11/include -fno-common -g -O2  -fno-common -pipe -fno-common   -c etc.c
  167.     cc -dynamic -bundle -undefined suppress -flat_namespace -o ../../.ext/i686-darwin12.2.0/etc.bundle etc.o -L. -L../.. -L.     -lruby  -ldl -lobjc  
  168.     compiling fcntl
  169.     /usr/bin/gcc -I. -I../.. -I../../. -I../.././ext/fcntl -I/opt/X11/include -D_XOPEN_SOURCE -D_DARWIN_C_SOURCE   -fno-common -g -O2  -fno-common -pipe -fno-common   -c fcntl.c
  170.     cc -dynamic -bundle -undefined suppress -flat_namespace -o ../../.ext/i686-darwin12.2.0/fcntl.bundle fcntl.o -L. -L../.. -L.     -lruby  -ldl -lobjc  
  171.     compiling gdbm
  172.     compiling iconv
  173.     /usr/bin/gcc -I. -I../.. -I../../. -I../.././ext/iconv -I/opt/X11/include -D_XOPEN_SOURCE -D_DARWIN_C_SOURCE  -I/opt/X11/include -fno-common -g -O2  -fno-common -pipe -fno-common   -c iconv.c
  174.     cc -dynamic -bundle -undefined suppress -flat_namespace -o ../../.ext/i686-darwin12.2.0/iconv.bundle iconv.o -L. -L../.. -L.     -lruby -liconv  -ldl -lobjc  
  175.     compiling io/wait
  176.     mkdir -p ../../../.ext/i686-darwin12.2.0/io
  177.     /usr/bin/gcc -I. -I../../.. -I../../../. -I../../.././ext/io/wait -DFIONREAD_HEADER="<sys/ioctl.h>" -I/opt/X11/include -D_XOPEN_SOURCE -D_DARWIN_C_SOURCE   -fno-common -g -O2  -fno-common -pipe -fno-common   -c wait.c
  178.     cc -dynamic -bundle -undefined suppress -flat_namespace -o ../../../.ext/i686-darwin12.2.0/io/wait.bundle wait.o -L. -L../../.. -L.     -lruby  -ldl -lobjc  
  179.     mkdir -p ../../../.ext/common/io
  180.     cp ../../.././ext/io/wait/lib/nonblock.rb ../../../.ext/common/io
  181.     compiling nkf
  182.     /usr/bin/gcc -I. -I../.. -I../../. -I../.././ext/nkf -I/opt/X11/include -D_XOPEN_SOURCE -D_DARWIN_C_SOURCE   -fno-common -g -O2  -fno-common -pipe -fno-common   -c nkf.c
  183.     cc -dynamic -bundle -undefined suppress -flat_namespace -o ../../.ext/i686-darwin12.2.0/nkf.bundle nkf.o -L. -L../.. -L.     -lruby  -ldl -lobjc  
  184.     cp ../.././ext/nkf/lib/kconv.rb ../../.ext/common
  185.     compiling openssl
  186.     /usr/bin/gcc -I. -I../.. -I../../. -I../.././ext/openssl -DRUBY_EXTCONF_H=\"extconf.h\" -I/opt/X11/include -D_XOPEN_SOURCE -D_DARWIN_C_SOURCE  -I/opt/X11/include -fno-common -g -O2  -fno-common -pipe -fno-common   -c openssl_missing.c
  187.     openssl_missing.c: In function ‘HMAC_CTX_copy’:
  188.     openssl_missing.c:31: warning: ‘EVP_MD_CTX_copy’ is deprecated (declared at /usr/include/openssl/evp.h:562)
  189.     openssl_missing.c:32: warning: ‘EVP_MD_CTX_copy’ is deprecated (declared at /usr/include/openssl/evp.h:562)
  190.     openssl_missing.c:33: warning: ‘EVP_MD_CTX_copy’ is deprecated (declared at /usr/include/openssl/evp.h:562)
  191.     openssl_missing.c: In function ‘X509_STORE_set_ex_data’:
  192.     openssl_missing.c:42: warning: ‘CRYPTO_set_ex_data’ is deprecated (declared at /usr/include/openssl/crypto.h:407)
  193.     openssl_missing.c: In function ‘X509_STORE_get_ex_data’:
  194.     openssl_missing.c:47: warning: ‘CRYPTO_get_ex_data’ is deprecated (declared at /usr/include/openssl/crypto.h:408)
  195.     openssl_missing.c: In function ‘EVP_CIPHER_CTX_copy’:
  196.     openssl_missing.c:125: warning: ‘ENGINE_add’ is deprecated (declared at /usr/include/openssl/engine.h:320)
  197.     openssl_missing.c:127: warning: ‘CRYPTO_malloc’ is deprecated (declared at /usr/include/openssl/crypto.h:478)
  198.     /usr/bin/gcc -I. -I../.. -I../../. -I../.././ext/openssl -DRUBY_EXTCONF_H=\"extconf.h\" -I/opt/X11/include -D_XOPEN_SOURCE -D_DARWIN_C_SOURCE  -I/opt/X11/include -fno-common -g -O2  -fno-common -pipe -fno-common   -c ossl.c
  199.     ossl.c: In function ‘string2hex’:
  200.     ossl.c:32: warning: ‘CRYPTO_malloc’ is deprecated (declared at /usr/include/openssl/crypto.h:478)
  201.     ossl.c: In function ‘ossl_x509_ary2sk0’:
  202.     ossl.c:59: warning: ‘sk_new_null’ is deprecated (declared at /usr/include/openssl/stack.h:87)
  203.     ossl.c:65: warning: ‘sk_pop_free’ is deprecated (declared at /usr/include/openssl/stack.h:89)
  204.     ossl.c:69: warning: ‘sk_push’ is deprecated (declared at /usr/include/openssl/stack.h:95)
  205.     ossl.c: In function ‘ossl_x509_sk2ary’:
  206.     ossl.c:118: warning: ‘sk_num’ is deprecated (declared at /usr/include/openssl/stack.h:81)
  207.     ossl.c:118: warning: ‘sk_value’ is deprecated (declared at /usr/include/openssl/stack.h:82)
  208.     ossl.c: In function ‘ossl_x509crl_sk2ary’:
  209.     ossl.c:119: warning: ‘sk_num’ is deprecated (declared at /usr/include/openssl/stack.h:81)
  210.     ossl.c:119: warning: ‘sk_value’ is deprecated (declared at /usr/include/openssl/stack.h:82)
  211.     ossl.c: In function ‘ossl_buf2str’:
  212.     ossl.c:135: warning: ‘CRYPTO_free’ is deprecated (declared at /usr/include/openssl/crypto.h:480)
  213.     ossl.c: In function ‘ossl_pem_passwd_cb’:
  214.     ossl.c:162: warning: ‘PEM_def_callback’ is deprecated (declared at /usr/include/openssl/pem.h:634)
  215.     ossl.c: In function ‘ossl_verify_cb’:
  216.     ossl.c:207: warning: ‘X509_STORE_CTX_get_ex_data’ is deprecated (declared at /usr/include/openssl/x509_vfy.h:450)
  217.     ossl.c:224: warning: ‘X509_STORE_CTX_set_error’ is deprecated (declared at /usr/include/openssl/x509_vfy.h:452)
  218.     ossl.c:228: warning: ‘X509_STORE_CTX_get_error’ is deprecated (declared at /usr/include/openssl/x509_vfy.h:451)
  219.     ossl.c:229: warning: ‘X509_STORE_CTX_set_error’ is deprecated (declared at /usr/include/openssl/x509_vfy.h:452)
  220.     ossl.c: In function ‘ossl_make_error’:
  221.     ossl.c:284: warning: ‘ERR_peek_last_error’ is deprecated (declared at /usr/include/openssl/err.h:274)
  222.     ossl.c:293: warning: ‘ERR_error_string’ is deprecated (declared at /usr/include/openssl/err.h:279)
  223.     ossl.c:295: warning: ‘ERR_reason_error_string’ is deprecated (declared at /usr/include/openssl/err.h:283)
  224.     ossl.c:299: warning: ‘ERR_get_error’ is deprecated (declared at /usr/include/openssl/err.h:266)
  225.     ossl.c:300: warning: ‘ERR_error_string’ is deprecated (declared at /usr/include/openssl/err.h:279)
  226.     ossl.c:303: warning: ‘ERR_clear_error’ is deprecated (declared at /usr/include/openssl/err.h:278)
  227.     ossl.c: In function ‘ossl_get_errors’:
  228.     ossl.c:346: warning: ‘ERR_get_error’ is deprecated (declared at /usr/include/openssl/err.h:266)
  229.     ossl.c:347: warning: ‘ERR_error_string’ is deprecated (declared at /usr/include/openssl/err.h:279)
  230.     ossl.c: In function ‘ossl_debug_set’:
  231.     ossl.c:399: warning: ‘CRYPTO_mem_ctrl’ is deprecated (declared at /usr/include/openssl/crypto.h:354)
  232.     ossl.c:402: warning: ‘CRYPTO_mem_ctrl’ is deprecated (declared at /usr/include/openssl/crypto.h:354)
  233.     ossl.c: In function ‘Init_openssl’:
  234.     ossl.c:427: warning: ‘SSL_library_init’ is deprecated (declared at /usr/include/openssl/ssl.h:1553)
  235.     ossl.c:428: warning: ‘OPENSSL_add_all_algorithms_noconf’ is deprecated (declared at /usr/include/openssl/evp.h:828)
  236.     ossl.c:429: warning: ‘ERR_load_crypto_strings’ is deprecated (declared at /usr/include/openssl/err.h:296)
  237.     ossl.c:430: warning: ‘SSL_load_error_strings’ is deprecated (declared at /usr/include/openssl/ssl.h:1416)
  238.     ossl.c:467: warning: ‘X509_STORE_CTX_get_ex_new_index’ is deprecated (declared at /usr/include/openssl/x509_vfy.h:448)
  239.     /usr/bin/gcc -I. -I../.. -I../../. -I../.././ext/openssl -DRUBY_EXTCONF_H=\"extconf.h\" -I/opt/X11/include -D_XOPEN_SOURCE -D_DARWIN_C_SOURCE  -I/opt/X11/include -fno-common -g -O2  -fno-common -pipe -fno-common   -c ossl_asn1.c
  240.     ossl_asn1.c: In function ‘asn1integer_to_num’:
  241.     ossl_asn1.c:103: warning: ‘ASN1_INTEGER_to_BN’ is deprecated (declared at /usr/include/openssl/asn1.h:901)
  242.     ossl_asn1.c:116: warning: ‘BN_free’ is deprecated (declared at /usr/include/openssl/bn.h:468)
  243.     ossl_asn1.c: In function ‘num_to_asn1integer’:
  244.     ossl_asn1.c:148: warning: ‘BN_to_ASN1_INTEGER’ is deprecated (declared at /usr/include/openssl/asn1.h:900)
  245.     ossl_asn1.c: In function ‘obj_to_asn1bstr’:
  246.     ossl_asn1.c:221: warning: ‘ASN1_BIT_STRING_set’ is deprecated (declared at /usr/include/openssl/asn1.h:807)
  247.     ossl_asn1.c: In function ‘obj_to_asn1str’:
  248.     ossl_asn1.c:234: warning: ‘ASN1_STRING_new’ is deprecated (declared at /usr/include/openssl/asn1.h:788)
  249.     ossl_asn1.c:236: warning: ‘ASN1_STRING_set’ is deprecated (declared at /usr/include/openssl/asn1.h:795)
  250.     ossl_asn1.c: In function ‘obj_to_asn1obj’:
  251.     ossl_asn1.c:260: warning: ‘OBJ_txt2obj’ is deprecated (declared at /usr/include/openssl/objects.h:1010)
  252.     ossl_asn1.c:261: warning: ‘OBJ_txt2obj’ is deprecated (declared at /usr/include/openssl/objects.h:1010)
  253.     ossl_asn1.c: In function ‘obj_to_asn1utime’:
  254.     ossl_asn1.c:274: warning: ‘ASN1_UTCTIME_set’ is deprecated (declared at /usr/include/openssl/asn1.h:834)
  255.     ossl_asn1.c: In function ‘obj_to_asn1gtime’:
  256.     ossl_asn1.c:287: warning: ‘ASN1_GENERALIZEDTIME_set’ is deprecated (declared at /usr/include/openssl/asn1.h:842)
  257.     ossl_asn1.c: In function ‘obj_to_asn1derstr’:
  258.     ossl_asn1.c:300: warning: ‘ASN1_STRING_new’ is deprecated (declared at /usr/include/openssl/asn1.h:788)
  259.     ossl_asn1.c:302: warning: ‘ASN1_STRING_set’ is deprecated (declared at /usr/include/openssl/asn1.h:795)
  260.     ossl_asn1.c: In function ‘decode_bool’:
  261.     ossl_asn1.c:317: warning: ‘d2i_ASN1_BOOLEAN’ is deprecated (declared at /usr/include/openssl/asn1.h:820)
  262.     ossl_asn1.c:317: warning: passing argument 2 of ‘d2i_ASN1_BOOLEAN’ from incompatible pointer type
  263.     ossl_asn1.c: In function ‘decode_int’:
  264.     ossl_asn1.c:332: warning: passing argument 2 of ‘d2i_ASN1_INTEGER’ from incompatible pointer type
  265.     ossl_asn1.c: In function ‘decode_enum’:
  266.     ossl_asn1.c:372: warning: passing argument 2 of ‘d2i_ASN1_ENUMERATED’ from incompatible pointer type
  267.     ossl_asn1.c: In function ‘decode_null’:
  268.     ossl_asn1.c:389: warning: passing argument 2 of ‘d2i_ASN1_NULL’ from incompatible pointer type
  269.     ossl_asn1.c: In function ‘decode_obj’:
  270.     ossl_asn1.c:406: warning: ‘d2i_ASN1_OBJECT’ is deprecated (declared at /usr/include/openssl/asn1.h:781)
  271.     ossl_asn1.c:406: warning: passing argument 2 of ‘d2i_ASN1_OBJECT’ from incompatible pointer type
  272.     ossl_asn1.c:408: warning: ‘OBJ_obj2nid’ is deprecated (declared at /usr/include/openssl/objects.h:1009)
  273.     ossl_asn1.c:409: warning: ‘ASN1_OBJECT_free’ is deprecated (declared at /usr/include/openssl/asn1.h:776)
  274.     ossl_asn1.c:410: warning: ‘OBJ_nid2sn’ is deprecated (declared at /usr/include/openssl/objects.h:1008)
  275.     ossl_asn1.c:413: warning: ‘BIO_new’ is deprecated (declared at /usr/include/openssl/bio.h:581)
  276.     ossl_asn1.c:413: warning: ‘BIO_s_mem’ is deprecated (declared at /usr/include/openssl/bio.h:616)
  277.     ossl_asn1.c:414: warning: ‘ASN1_OBJECT_free’ is deprecated (declared at /usr/include/openssl/asn1.h:776)
  278.     ossl_asn1.c:417: warning: ‘i2a_ASN1_OBJECT’ is deprecated (declared at /usr/include/openssl/asn1.h:888)
  279.     ossl_asn1.c:418: warning: ‘ASN1_OBJECT_free’ is deprecated (declared at /usr/include/openssl/asn1.h:776)
  280.     ossl_asn1.c: In function ‘decode_time’:
  281.     ossl_asn1.c:434: warning: passing argument 2 of ‘d2i_ASN1_TIME’ from incompatible pointer type
  282.     ossl_asn1.c: In function ‘ossl_asn1_get_asn1type’:
  283.     ossl_asn1.c:533: warning: ‘ASN1_STRING_free’ is deprecated (declared at /usr/include/openssl/asn1.h:789)
  284.     ossl_asn1.c:537: warning: ‘ASN1_OBJECT_free’ is deprecated (declared at /usr/include/openssl/asn1.h:776)
  285.     ossl_asn1.c:550: warning: ‘ASN1_STRING_free’ is deprecated (declared at /usr/include/openssl/asn1.h:789)
  286.     ossl_asn1.c:555: warning: ‘CRYPTO_malloc’ is deprecated (declared at /usr/include/openssl/crypto.h:478)
  287.     ossl_asn1.c:560: warning: ‘ASN1_TYPE_set’ is deprecated (declared at /usr/include/openssl/asn1.h:772)
  288.     ossl_asn1.c: In function ‘ossl_asn1data_to_der’:
  289.     ossl_asn1.c:701: warning: ‘ASN1_object_size’ is deprecated (declared at /usr/include/openssl/asn1.h:932)
  290.     ossl_asn1.c:705: warning: ‘ASN1_put_object’ is deprecated (declared at /usr/include/openssl/asn1.h:930)
  291.     ossl_asn1.c: In function ‘ossl_asn1_decode0’:
  292.     ossl_asn1.c:726: warning: ‘ASN1_get_object’ is deprecated (declared at /usr/include/openssl/asn1.h:926)
  293.     ossl_asn1.c:726: warning: passing argument 1 of ‘ASN1_get_object’ from incompatible pointer type
  294.     ossl_asn1.c: In function ‘ossl_asn1prim_to_der’:
  295.     ossl_asn1.c:936: warning: ‘ASN1_object_size’ is deprecated (declared at /usr/include/openssl/asn1.h:932)
  296.     ossl_asn1.c:937: warning: ‘CRYPTO_malloc’ is deprecated (declared at /usr/include/openssl/crypto.h:478)
  297.     ossl_asn1.c:945: warning: ‘ASN1_put_object’ is deprecated (declared at /usr/include/openssl/asn1.h:930)
  298.     ossl_asn1.c: In function ‘ossl_asn1cons_to_der’:
  299.     ossl_asn1.c:973: warning: ‘ASN1_object_size’ is deprecated (declared at /usr/include/openssl/asn1.h:932)
  300.     ossl_asn1.c:974: warning: ‘ASN1_object_size’ is deprecated (declared at /usr/include/openssl/asn1.h:932)
  301.     ossl_asn1.c:978: warning: ‘ASN1_put_object’ is deprecated (declared at /usr/include/openssl/asn1.h:930)
  302.     ossl_asn1.c:981: warning: ‘ASN1_put_object’ is deprecated (declared at /usr/include/openssl/asn1.h:930)
  303.     ossl_asn1.c:982: warning: ‘ASN1_put_object’ is deprecated (declared at /usr/include/openssl/asn1.h:930)
  304.     ossl_asn1.c:984: warning: ‘ASN1_put_object’ is deprecated (declared at /usr/include/openssl/asn1.h:930)
  305.     ossl_asn1.c: In function ‘ossl_asn1obj_s_register’:
  306.     ossl_asn1.c:1007: warning: ‘OBJ_create’ is deprecated (declared at /usr/include/openssl/objects.h:1023)
  307.     ossl_asn1.c: In function ‘ossl_asn1obj_get_sn’:
  308.     ossl_asn1.c:1020: warning: ‘OBJ_txt2nid’ is deprecated (declared at /usr/include/openssl/objects.h:1012)
  309.     ossl_asn1.c:1021: warning: ‘OBJ_nid2sn’ is deprecated (declared at /usr/include/openssl/objects.h:1008)
  310.     ossl_asn1.c: In function ‘ossl_asn1obj_get_ln’:
  311.     ossl_asn1.c:1033: warning: ‘OBJ_txt2nid’ is deprecated (declared at /usr/include/openssl/objects.h:1012)
  312.     ossl_asn1.c:1034: warning: ‘OBJ_nid2ln’ is deprecated (declared at /usr/include/openssl/objects.h:1007)
  313.     ossl_asn1.c: In function ‘ossl_asn1obj_get_oid’:
  314.     ossl_asn1.c:1048: warning: ‘OBJ_obj2txt’ is deprecated (declared at /usr/include/openssl/objects.h:1011)
  315.     ossl_asn1.c:1049: warning: ‘ASN1_OBJECT_free’ is deprecated (declared at /usr/include/openssl/asn1.h:776)
  316.     /usr/bin/gcc -I. -I../.. -I../../. -I../.././ext/openssl -DRUBY_EXTCONF_H=\"extconf.h\" -I/opt/X11/include -D_XOPEN_SOURCE -D_DARWIN_C_SOURCE  -I/opt/X11/include -fno-common -g -O2  -fno-common -pipe -fno-common   -c ossl_bio.c
  317.     ossl_bio.c: In function ‘ossl_obj2bio’:
  318.     ossl_bio.c:35: warning: ‘BIO_new_fp’ is deprecated (declared at /usr/include/openssl/bio.h:575)
  319.     ossl_bio.c:42: warning: ‘BIO_new_mem_buf’ is deprecated (declared at /usr/include/openssl/bio.h:617)
  320.     ossl_bio.c: In function ‘ossl_membio2str0’:
  321.     ossl_bio.c:63: warning: ‘BIO_ctrl’ is deprecated (declared at /usr/include/openssl/bio.h:590)
  322.     ossl_bio.c: In function ‘ossl_membio2str’:
  323.     ossl_bio.c:82: warning: ‘BIO_free’ is deprecated (declared at /usr/include/openssl/bio.h:583)
  324.     /usr/bin/gcc -I. -I../.. -I../../. -I../.././ext/openssl -DRUBY_EXTCONF_H=\"extconf.h\" -I/opt/X11/include -D_XOPEN_SOURCE -D_DARWIN_C_SOURCE  -I/opt/X11/include -fno-common -g -O2  -fno-common -pipe -fno-common   -c ossl_bn.c
  325.     ossl_bn.c: In function ‘ossl_bn_new’:
  326.     ossl_bn.c:48: warning: ‘BN_dup’ is deprecated (declared at /usr/include/openssl/bn.h:501)
  327.     ossl_bn.c:48: warning: ‘BN_new’ is deprecated (declared at /usr/include/openssl/bn.h:417)
  328.     ossl_bn.c:52: warning: ‘BN_clear_free’ is deprecated (declared at /usr/include/openssl/bn.h:419)
  329.     ossl_bn.c: In function ‘GetBNPtr’:
  330.     ossl_bn.c:68: warning: ‘BN_dec2bn’ is deprecated (declared at /usr/include/openssl/bn.h:508)
  331.     ossl_bn.c:71: warning: ‘BN_clear_free’ is deprecated (declared at /usr/include/openssl/bn.h:419)
  332.     ossl_bn.c: In function ‘ossl_bn_alloc’:
  333.     ossl_bn.c:95: warning: ‘BN_new’ is deprecated (declared at /usr/include/openssl/bn.h:417)
  334.     ossl_bn.c:98: warning: ‘BN_clear_free’ is deprecated (declared at /usr/include/openssl/bn.h:419)
  335.     ossl_bn.c: In function ‘ossl_bn_initialize’:
  336.     ossl_bn.c:126: warning: ‘BN_copy’ is deprecated (declared at /usr/include/openssl/bn.h:420)
  337.     ossl_bn.c:134: warning: ‘BN_mpi2bn’ is deprecated (declared at /usr/include/openssl/bn.h:424)
  338.     ossl_bn.c:139: warning: ‘BN_bin2bn’ is deprecated (declared at /usr/include/openssl/bn.h:422)
  339.     ossl_bn.c:144: warning: ‘BN_dec2bn’ is deprecated (declared at /usr/include/openssl/bn.h:508)
  340.     ossl_bn.c:149: warning: ‘BN_hex2bn’ is deprecated (declared at /usr/include/openssl/bn.h:507)
  341.     ossl_bn.c: In function ‘ossl_bn_to_s’:
  342.     ossl_bn.c:186: warning: ‘BN_bn2mpi’ is deprecated (declared at /usr/include/openssl/bn.h:425)
  343.     ossl_bn.c:188: warning: ‘BN_bn2mpi’ is deprecated (declared at /usr/include/openssl/bn.h:425)
  344.     ossl_bn.c:192: warning: ‘BN_num_bits’ is deprecated (declared at /usr/include/openssl/bn.h:415)
  345.     ossl_bn.c:194: warning: ‘BN_bn2bin’ is deprecated (declared at /usr/include/openssl/bn.h:423)
  346.     ossl_bn.c:198: warning: ‘BN_bn2dec’ is deprecated (declared at /usr/include/openssl/bn.h:506)
  347.     ossl_bn.c:202: warning: ‘BN_bn2hex’ is deprecated (declared at /usr/include/openssl/bn.h:505)
  348.     ossl_bn.c: In function ‘ossl_bn_to_i’:
  349.     ossl_bn.c:225: warning: ‘BN_bn2dec’ is deprecated (declared at /usr/include/openssl/bn.h:506)
  350.     ossl_bn.c:229: warning: ‘CRYPTO_free’ is deprecated (declared at /usr/include/openssl/crypto.h:480)
  351.     ossl_bn.c: In function ‘ossl_bn_sqr’:
  352.     ossl_bn.c:301: warning: ‘BN_new’ is deprecated (declared at /usr/include/openssl/bn.h:417)
  353.     ossl_bn.c:301: warning: ‘BN_sqr’ is deprecated (declared at /usr/include/openssl/bn.h:431)
  354.     ossl_bn.c:301: warning: ‘BN_free’ is deprecated (declared at /usr/include/openssl/bn.h:468)
  355.     ossl_bn.c:301: warning: ‘BN_clear_free’ is deprecated (declared at /usr/include/openssl/bn.h:419)
  356.     ossl_bn.c: In function ‘ossl_bn_add’:
  357.     ossl_bn.c:325: warning: ‘BN_new’ is deprecated (declared at /usr/include/openssl/bn.h:417)
  358.     ossl_bn.c:325: warning: ‘BN_add’ is deprecated (declared at /usr/include/openssl/bn.h:429)
  359.     ossl_bn.c:325: warning: ‘BN_free’ is deprecated (declared at /usr/include/openssl/bn.h:468)
  360.     ossl_bn.c:325: warning: ‘BN_clear_free’ is deprecated (declared at /usr/include/openssl/bn.h:419)
  361.     ossl_bn.c: In function ‘ossl_bn_sub’:
  362.     ossl_bn.c:326: warning: ‘BN_new’ is deprecated (declared at /usr/include/openssl/bn.h:417)
  363.     ossl_bn.c:326: warning: ‘BN_sub’ is deprecated (declared at /usr/include/openssl/bn.h:426)
  364.     ossl_bn.c:326: warning: ‘BN_free’ is deprecated (declared at /usr/include/openssl/bn.h:468)
  365.     ossl_bn.c:326: warning: ‘BN_clear_free’ is deprecated (declared at /usr/include/openssl/bn.h:419)
  366.     ossl_bn.c: In function ‘ossl_bn_mul’:
  367.     ossl_bn.c:350: warning: ‘BN_new’ is deprecated (declared at /usr/include/openssl/bn.h:417)
  368.     ossl_bn.c:350: warning: ‘BN_mul’ is deprecated (declared at /usr/include/openssl/bn.h:430)
  369.     ossl_bn.c:350: warning: ‘BN_free’ is deprecated (declared at /usr/include/openssl/bn.h:468)
  370.     ossl_bn.c:350: warning: ‘BN_clear_free’ is deprecated (declared at /usr/include/openssl/bn.h:419)
  371.     ossl_bn.c: In function ‘ossl_bn_mod’:
  372.     ossl_bn.c:351: warning: ‘BN_new’ is deprecated (declared at /usr/include/openssl/bn.h:417)
  373.     ossl_bn.c:351: warning: ‘BN_div’ is deprecated (declared at /usr/include/openssl/bn.h:444)
  374.     ossl_bn.c:351: warning: ‘BN_free’ is deprecated (declared at /usr/include/openssl/bn.h:468)
  375.     ossl_bn.c:351: warning: ‘BN_clear_free’ is deprecated (declared at /usr/include/openssl/bn.h:419)
  376.     ossl_bn.c: In function ‘ossl_bn_exp’:
  377.     ossl_bn.c:352: warning: ‘BN_new’ is deprecated (declared at /usr/include/openssl/bn.h:417)
  378.     ossl_bn.c:352: warning: ‘BN_exp’ is deprecated (declared at /usr/include/openssl/bn.h:472)
  379.     ossl_bn.c:352: warning: ‘BN_free’ is deprecated (declared at /usr/include/openssl/bn.h:468)
  380.     ossl_bn.c:352: warning: ‘BN_clear_free’ is deprecated (declared at /usr/include/openssl/bn.h:419)
  381.     ossl_bn.c: In function ‘ossl_bn_gcd’:
  382.     ossl_bn.c:353: warning: ‘BN_new’ is deprecated (declared at /usr/include/openssl/bn.h:417)
  383.     ossl_bn.c:353: warning: ‘BN_gcd’ is deprecated (declared at /usr/include/openssl/bn.h:509)
  384.     ossl_bn.c:353: warning: ‘BN_free’ is deprecated (declared at /usr/include/openssl/bn.h:468)
  385.     ossl_bn.c:353: warning: ‘BN_clear_free’ is deprecated (declared at /usr/include/openssl/bn.h:419)
  386.     ossl_bn.c: In function ‘ossl_bn_mod_sqr’:
  387.     ossl_bn.c:354: warning: ‘BN_new’ is deprecated (declared at /usr/include/openssl/bn.h:417)
  388.     ossl_bn.c:354: warning: ‘BN_mod_sqr’ is deprecated (declared at /usr/include/openssl/bn.h:453)
  389.     ossl_bn.c:354: warning: ‘BN_free’ is deprecated (declared at /usr/include/openssl/bn.h:468)
  390.     ossl_bn.c:354: warning: ‘BN_clear_free’ is deprecated (declared at /usr/include/openssl/bn.h:419)
  391.     ossl_bn.c: In function ‘ossl_bn_mod_inverse’:
  392.     ossl_bn.c:355: warning: ‘BN_new’ is deprecated (declared at /usr/include/openssl/bn.h:417)
  393.     ossl_bn.c:355: warning: ‘BN_mod_inverse’ is deprecated (declared at /usr/include/openssl/bn.h:512)
  394.     ossl_bn.c:355: warning: ‘BN_free’ is deprecated (declared at /usr/include/openssl/bn.h:468)
  395.     ossl_bn.c:355: warning: ‘BN_clear_free’ is deprecated (declared at /usr/include/openssl/bn.h:419)
  396.     ossl_bn.c: In function ‘ossl_bn_div’:
  397.     ossl_bn.c:369: warning: ‘BN_new’ is deprecated (declared at /usr/include/openssl/bn.h:417)
  398.     ossl_bn.c:372: warning: ‘BN_new’ is deprecated (declared at /usr/include/openssl/bn.h:417)
  399.     ossl_bn.c:373: warning: ‘BN_free’ is deprecated (declared at /usr/include/openssl/bn.h:468)
  400.     ossl_bn.c:376: warning: ‘BN_div’ is deprecated (declared at /usr/include/openssl/bn.h:444)
  401.     ossl_bn.c:377: warning: ‘BN_free’ is deprecated (declared at /usr/include/openssl/bn.h:468)
  402.     ossl_bn.c:378: warning: ‘BN_free’ is deprecated (declared at /usr/include/openssl/bn.h:468)
  403.     ossl_bn.c:381: warning: ‘BN_clear_free’ is deprecated (declared at /usr/include/openssl/bn.h:419)
  404.     ossl_bn.c:382: warning: ‘BN_clear_free’ is deprecated (declared at /usr/include/openssl/bn.h:419)
  405.     ossl_bn.c: In function ‘ossl_bn_mod_add’:
  406.     ossl_bn.c:410: warning: ‘BN_new’ is deprecated (declared at /usr/include/openssl/bn.h:417)
  407.     ossl_bn.c:410: warning: ‘BN_mod_add’ is deprecated (declared at /usr/include/openssl/bn.h:447)
  408.     ossl_bn.c:410: warning: ‘BN_free’ is deprecated (declared at /usr/include/openssl/bn.h:468)
  409.     ossl_bn.c:410: warning: ‘BN_clear_free’ is deprecated (declared at /usr/include/openssl/bn.h:419)
  410.     ossl_bn.c: In function ‘ossl_bn_mod_sub’:
  411.     ossl_bn.c:411: warning: ‘BN_new’ is deprecated (declared at /usr/include/openssl/bn.h:417)
  412.     ossl_bn.c:411: warning: ‘BN_mod_sub’ is deprecated (declared at /usr/include/openssl/bn.h:449)
  413.     ossl_bn.c:411: warning: ‘BN_free’ is deprecated (declared at /usr/include/openssl/bn.h:468)
  414.     ossl_bn.c:411: warning: ‘BN_clear_free’ is deprecated (declared at /usr/include/openssl/bn.h:419)
  415.     ossl_bn.c: In function ‘ossl_bn_mod_mul’:
  416.     ossl_bn.c:412: warning: ‘BN_new’ is deprecated (declared at /usr/include/openssl/bn.h:417)
  417.     ossl_bn.c:412: warning: ‘BN_mod_mul’ is deprecated (declared at /usr/include/openssl/bn.h:452)
  418.     ossl_bn.c:412: warning: ‘BN_free’ is deprecated (declared at /usr/include/openssl/bn.h:468)
  419.     ossl_bn.c:412: warning: ‘BN_clear_free’ is deprecated (declared at /usr/include/openssl/bn.h:419)
  420.     ossl_bn.c: In function ‘ossl_bn_mod_exp’:
  421.     ossl_bn.c:413: warning: ‘BN_new’ is deprecated (declared at /usr/include/openssl/bn.h:417)
  422.     ossl_bn.c:413: warning: ‘BN_mod_exp’ is deprecated (declared at /usr/include/openssl/bn.h:475)
  423.     ossl_bn.c:413: warning: ‘BN_free’ is deprecated (declared at /usr/include/openssl/bn.h:468)
  424.     ossl_bn.c:413: warning: ‘BN_clear_free’ is deprecated (declared at /usr/include/openssl/bn.h:419)
  425.     ossl_bn.c: In function ‘ossl_bn_set_bit’:
  426.     ossl_bn.c:431: warning: ‘BN_set_bit’ is deprecated (declared at /usr/include/openssl/bn.h:503)
  427.     ossl_bn.c: In function ‘ossl_bn_clear_bit’:
  428.     ossl_bn.c:432: warning: ‘BN_clear_bit’ is deprecated (declared at /usr/include/openssl/bn.h:504)
  429.     ossl_bn.c: In function ‘ossl_bn_mask_bits’:
  430.     ossl_bn.c:433: warning: ‘BN_mask_bits’ is deprecated (declared at /usr/include/openssl/bn.h:488)
  431.     ossl_bn.c: In function ‘ossl_bn_is_bit_set’:
  432.     ossl_bn.c:447: warning: ‘BN_is_bit_set’ is deprecated (declared at /usr/include/openssl/bn.h:469)
  433.     ossl_bn.c: In function ‘ossl_bn_lshift’:
  434.     ossl_bn.c:477: warning: ‘BN_new’ is deprecated (declared at /usr/include/openssl/bn.h:417)
  435.     ossl_bn.c:477: warning: ‘BN_lshift’ is deprecated (declared at /usr/include/openssl/bn.h:470)
  436.     ossl_bn.c:477: warning: ‘BN_free’ is deprecated (declared at /usr/include/openssl/bn.h:468)
  437.     ossl_bn.c:477: warning: ‘BN_clear_free’ is deprecated (declared at /usr/include/openssl/bn.h:419)
  438.     ossl_bn.c: In function ‘ossl_bn_rshift’:
  439.     ossl_bn.c:478: warning: ‘BN_new’ is deprecated (declared at /usr/include/openssl/bn.h:417)
  440.     ossl_bn.c:478: warning: ‘BN_rshift’ is deprecated (declared at /usr/include/openssl/bn.h:498)
  441.     ossl_bn.c:478: warning: ‘BN_free’ is deprecated (declared at /usr/include/openssl/bn.h:468)
  442.     ossl_bn.c:478: warning: ‘BN_clear_free’ is deprecated (declared at /usr/include/openssl/bn.h:419)
  443.     ossl_bn.c: In function ‘ossl_bn_self_lshift’:
  444.     ossl_bn.c:497: warning: ‘BN_lshift’ is deprecated (declared at /usr/include/openssl/bn.h:470)
  445.     ossl_bn.c: In function ‘ossl_bn_self_rshift’:
  446.     ossl_bn.c:498: warning: ‘BN_rshift’ is deprecated (declared at /usr/include/openssl/bn.h:498)
  447.     ossl_bn.c: In function ‘ossl_bn_s_rand’:
  448.     ossl_bn.c:531: warning: ‘BN_new’ is deprecated (declared at /usr/include/openssl/bn.h:417)
  449.     ossl_bn.c:531: warning: ‘BN_rand’ is deprecated (declared at /usr/include/openssl/bn.h:411)
  450.     ossl_bn.c:531: warning: ‘BN_free’ is deprecated (declared at /usr/include/openssl/bn.h:468)
  451.     ossl_bn.c:531: warning: ‘BN_clear_free’ is deprecated (declared at /usr/include/openssl/bn.h:419)
  452.     ossl_bn.c: In function ‘ossl_bn_s_pseudo_rand’:
  453.     ossl_bn.c:532: warning: ‘BN_new’ is deprecated (declared at /usr/include/openssl/bn.h:417)
  454.     ossl_bn.c:532: warning: ‘BN_pseudo_rand’ is deprecated (declared at /usr/include/openssl/bn.h:412)
  455.     ossl_bn.c:532: warning: ‘BN_free’ is deprecated (declared at /usr/include/openssl/bn.h:468)
  456.     ossl_bn.c:532: warning: ‘BN_clear_free’ is deprecated (declared at /usr/include/openssl/bn.h:419)
  457.     ossl_bn.c: In function ‘ossl_bn_s_rand_range’:
  458.     ossl_bn.c:555: warning: ‘BN_new’ is deprecated (declared at /usr/include/openssl/bn.h:417)
  459.     ossl_bn.c:555: warning: ‘BN_rand_range’ is deprecated (declared at /usr/include/openssl/bn.h:413)
  460.     ossl_bn.c:555: warning: ‘BN_free’ is deprecated (declared at /usr/include/openssl/bn.h:468)
  461.     ossl_bn.c:555: warning: ‘BN_clear_free’ is deprecated (declared at /usr/include/openssl/bn.h:419)
  462.     ossl_bn.c: In function ‘ossl_bn_s_pseudo_rand_range’:
  463.     ossl_bn.c:556: warning: ‘BN_new’ is deprecated (declared at /usr/include/openssl/bn.h:417)
  464.     ossl_bn.c:556: warning: ‘BN_pseudo_rand_range’ is deprecated (declared at /usr/include/openssl/bn.h:414)
  465.     ossl_bn.c:556: warning: ‘BN_free’ is deprecated (declared at /usr/include/openssl/bn.h:468)
  466.     ossl_bn.c:556: warning: ‘BN_clear_free’ is deprecated (declared at /usr/include/openssl/bn.h:419)
  467.     ossl_bn.c: In function ‘ossl_bn_s_generate_prime’:
  468.     ossl_bn.c:586: warning: ‘BN_new’ is deprecated (declared at /usr/include/openssl/bn.h:417)
  469.     ossl_bn.c:589: warning: ‘BN_generate_prime’ is deprecated (declared at /usr/include/openssl/bn.h:520)
  470.     ossl_bn.c:590: warning: ‘BN_free’ is deprecated (declared at /usr/include/openssl/bn.h:468)
  471.     ossl_bn.c:593: warning: ‘BN_clear_free’ is deprecated (declared at /usr/include/openssl/bn.h:419)
  472.     ossl_bn.c: In function ‘ossl_bn_num_bytes’:
  473.     ossl_bn.c:611: warning: ‘BN_num_bits’ is deprecated (declared at /usr/include/openssl/bn.h:415)
  474.     ossl_bn.c: In function ‘ossl_bn_num_bits’:
  475.     ossl_bn.c:612: warning: ‘BN_num_bits’ is deprecated (declared at /usr/include/openssl/bn.h:415)
  476.     ossl_bn.c: In function ‘ossl_bn_copy’:
  477.     ossl_bn.c:626: warning: ‘BN_copy’ is deprecated (declared at /usr/include/openssl/bn.h:420)
  478.     ossl_bn.c: In function ‘ossl_bn_cmp’:
  479.     ossl_bn.c:645: warning: ‘BN_cmp’ is deprecated (declared at /usr/include/openssl/bn.h:467)
  480.     ossl_bn.c: In function ‘ossl_bn_ucmp’:
  481.     ossl_bn.c:646: warning: ‘BN_ucmp’ is deprecated (declared at /usr/include/openssl/bn.h:502)
  482.     ossl_bn.c: In function ‘ossl_bn_is_prime’:
  483.     ossl_bn.c:676: warning: ‘BN_is_prime’ is deprecated (declared at /usr/include/openssl/bn.h:523)
  484.     ossl_bn.c: In function ‘ossl_bn_is_prime_fasttest’:
  485.     ossl_bn.c:715: warning: ‘BN_is_prime_fasttest’ is deprecated (declared at /usr/include/openssl/bn.h:526)
  486.     ossl_bn.c: In function ‘Init_ossl_bn’:
  487.     ossl_bn.c:738: warning: ‘BN_CTX_new’ is deprecated (declared at /usr/include/openssl/bn.h:403)
  488.     /usr/bin/gcc -I. -I../.. -I../../. -I../.././ext/openssl -DRUBY_EXTCONF_H=\"extconf.h\" -I/opt/X11/include -D_XOPEN_SOURCE -D_DARWIN_C_SOURCE  -I/opt/X11/include -fno-common -g -O2  -fno-common -pipe -fno-common   -c ossl_cipher.c
  489.     ossl_cipher.c: In function ‘GetCipherPtr’:
  490.     ossl_cipher.c:44: warning: ‘EVP_CIPHER_CTX_cipher’ is deprecated (declared at /usr/include/openssl/evp.h:499)
  491.     ossl_cipher.c: In function ‘ossl_cipher_new’:
  492.     ossl_cipher.c:55: warning: ‘EVP_CIPHER_CTX_init’ is deprecated (declared at /usr/include/openssl/evp.h:636)
  493.     ossl_cipher.c:56: warning: ‘EVP_CipherInit_ex’ is deprecated (declared at /usr/include/openssl/evp.h:601)
  494.     ossl_cipher.c: In function ‘ossl_cipher_free’:
  495.     ossl_cipher.c:69: warning: ‘EVP_CIPHER_CTX_cleanup’ is deprecated (declared at /usr/include/openssl/evp.h:637)
  496.     ossl_cipher.c: In function ‘ossl_cipher_alloc’:
  497.     ossl_cipher.c:81: warning: ‘EVP_CIPHER_CTX_init’ is deprecated (declared at /usr/include/openssl/evp.h:636)
  498.     ossl_cipher.c: In function ‘ossl_cipher_initialize’:
  499.     ossl_cipher.c:103: warning: ‘EVP_get_cipherbyname’ is deprecated (declared at /usr/include/openssl/evp.h:848)
  500.     ossl_cipher.c:106: warning: ‘EVP_CipherInit_ex’ is deprecated (declared at /usr/include/openssl/evp.h:601)
  501.     ossl_cipher.c: In function ‘ossl_s_ciphers’:
  502.     ossl_cipher.c:149: warning: ‘OBJ_NAME_do_all_sorted’ is deprecated (declared at /usr/include/openssl/objects.h:1003)
  503.     ossl_cipher.c: In function ‘ossl_cipher_reset’:
  504.     ossl_cipher.c:171: warning: ‘EVP_CipherInit_ex’ is deprecated (declared at /usr/include/openssl/evp.h:601)
  505.     ossl_cipher.c: In function ‘ossl_cipher_init’:
  506.     ossl_cipher.c:191: warning: initialization discards qualifiers from pointer target type
  507.     ossl_cipher.c:206: warning: ‘EVP_BytesToKey’ is deprecated (declared at /usr/include/openssl/evp.h:572)
  508.     ossl_cipher.c:206: warning: ‘EVP_CIPHER_CTX_cipher’ is deprecated (declared at /usr/include/openssl/evp.h:499)
  509.     ossl_cipher.c:206: warning: ‘EVP_md5’ is deprecated (declared at /usr/include/openssl/evp.h:662)
  510.     ossl_cipher.c:214: warning: ‘EVP_CipherInit_ex’ is deprecated (declared at /usr/include/openssl/evp.h:601)
  511.     ossl_cipher.c: In function ‘ossl_cipher_pkcs5_keyivgen’:
  512.     ossl_cipher.c:287: warning: ‘EVP_md5’ is deprecated (declared at /usr/include/openssl/evp.h:662)
  513.     ossl_cipher.c:289: warning: ‘EVP_BytesToKey’ is deprecated (declared at /usr/include/openssl/evp.h:572)
  514.     ossl_cipher.c:289: warning: ‘EVP_CIPHER_CTX_cipher’ is deprecated (declared at /usr/include/openssl/evp.h:499)
  515.     ossl_cipher.c:291: warning: ‘EVP_CipherInit_ex’ is deprecated (declared at /usr/include/openssl/evp.h:601)
  516.     ossl_cipher.c:293: warning: ‘OPENSSL_cleanse’ is deprecated (declared at /usr/include/openssl/crypto.h:486)
  517.     ossl_cipher.c:294: warning: ‘OPENSSL_cleanse’ is deprecated (declared at /usr/include/openssl/crypto.h:486)
  518.     ossl_cipher.c: In function ‘ossl_cipher_update_deprecated’:
  519.     ossl_cipher.c:314: warning: assignment discards qualifiers from pointer target type
  520.     ossl_cipher.c: In function ‘ossl_cipher_update’:
  521.     ossl_cipher.c:343: warning: ‘EVP_CIPHER_CTX_block_size’ is deprecated (declared at /usr/include/openssl/evp.h:501)
  522.     ossl_cipher.c:352: warning: ‘EVP_CipherUpdate’ is deprecated (declared at /usr/include/openssl/evp.h:603)
  523.     ossl_cipher.c: In function ‘ossl_cipher_final’:
  524.     ossl_cipher.c:376: warning: ‘EVP_CIPHER_CTX_block_size’ is deprecated (declared at /usr/include/openssl/evp.h:501)
  525.     ossl_cipher.c:377: warning: ‘EVP_CipherFinal_ex’ is deprecated (declared at /usr/include/openssl/evp.h:605)
  526.     ossl_cipher.c: In function ‘ossl_cipher_name’:
  527.     ossl_cipher.c:398: warning: ‘OBJ_nid2sn’ is deprecated (declared at /usr/include/openssl/objects.h:1008)
  528.     ossl_cipher.c:398: warning: ‘EVP_CIPHER_nid’ is deprecated (declared at /usr/include/openssl/evp.h:491)
  529.     ossl_cipher.c:398: warning: ‘EVP_CIPHER_CTX_cipher’ is deprecated (declared at /usr/include/openssl/evp.h:499)
  530.     ossl_cipher.c: In function ‘ossl_cipher_set_key’:
  531.     ossl_cipher.c:417: warning: ‘EVP_CIPHER_CTX_key_length’ is deprecated (declared at /usr/include/openssl/evp.h:502)
  532.     ossl_cipher.c:420: warning: ‘EVP_CipherInit_ex’ is deprecated (declared at /usr/include/openssl/evp.h:601)
  533.     ossl_cipher.c: In function ‘ossl_cipher_set_iv’:
  534.     ossl_cipher.c:442: warning: ‘EVP_CIPHER_CTX_iv_length’ is deprecated (declared at /usr/include/openssl/evp.h:503)
  535.     ossl_cipher.c:445: warning: ‘EVP_CipherInit_ex’ is deprecated (declared at /usr/include/openssl/evp.h:601)
  536.     ossl_cipher.c: In function ‘ossl_cipher_set_key_length’:
  537.     ossl_cipher.c:470: warning: ‘EVP_CIPHER_CTX_set_key_length’ is deprecated (declared at /usr/include/openssl/evp.h:640)
  538.     ossl_cipher.c: In function ‘ossl_cipher_set_padding’:
  539.     ossl_cipher.c:494: warning: ‘EVP_CIPHER_CTX_set_padding’ is deprecated (declared at /usr/include/openssl/evp.h:641)
  540.     ossl_cipher.c: In function ‘ossl_cipher_key_length’:
  541.     ossl_cipher.c:510: warning: ‘EVP_CIPHER_key_length’ is deprecated (declared at /usr/include/openssl/evp.h:494)
  542.     ossl_cipher.c:510: warning: ‘EVP_CIPHER_CTX_cipher’ is deprecated (declared at /usr/include/openssl/evp.h:499)
  543.     ossl_cipher.c: In function ‘ossl_cipher_iv_length’:
  544.     ossl_cipher.c:511: warning: ‘EVP_CIPHER_iv_length’ is deprecated (declared at /usr/include/openssl/evp.h:495)
  545.     ossl_cipher.c:511: warning: ‘EVP_CIPHER_CTX_cipher’ is deprecated (declared at /usr/include/openssl/evp.h:499)
  546.     ossl_cipher.c: In function ‘ossl_cipher_block_size’:
  547.     ossl_cipher.c:512: warning: ‘EVP_CIPHER_block_size’ is deprecated (declared at /usr/include/openssl/evp.h:493)
  548.     ossl_cipher.c:512: warning: ‘EVP_CIPHER_CTX_cipher’ is deprecated (declared at /usr/include/openssl/evp.h:499)
  549.     /usr/bin/gcc -I. -I../.. -I../../. -I../.././ext/openssl -DRUBY_EXTCONF_H=\"extconf.h\" -I/opt/X11/include -D_XOPEN_SOURCE -D_DARWIN_C_SOURCE  -I/opt/X11/include -fno-common -g -O2  -fno-common -pipe -fno-common   -c ossl_config.c
  550.     ossl_config.c: In function ‘GetConfigPtr’:
  551.     ossl_config.c:43: warning: ‘NCONF_new’ is deprecated (declared at /usr/include/openssl/conf.h:148)
  552.     ossl_config.c:45: warning: ‘BIO_free’ is deprecated (declared at /usr/include/openssl/bio.h:583)
  553.     ossl_config.c:48: warning: ‘NCONF_load_bio’ is deprecated (declared at /usr/include/openssl/conf.h:161)
  554.     ossl_config.c:49: warning: ‘BIO_free’ is deprecated (declared at /usr/include/openssl/bio.h:583)
  555.     ossl_config.c:50: warning: ‘NCONF_free’ is deprecated (declared at /usr/include/openssl/conf.h:154)
  556.     ossl_config.c:55: warning: ‘BIO_free’ is deprecated (declared at /usr/include/openssl/bio.h:583)
  557.     ossl_config.c: In function ‘Init_ossl_config’:
  558.     ossl_config.c:70: warning: ‘CONF_get1_default_config_file’ is deprecated (declared at /usr/include/openssl/conf.h:198)
  559.     ossl_config.c:73: warning: ‘CRYPTO_free’ is deprecated (declared at /usr/include/openssl/crypto.h:480)
  560.     /usr/bin/gcc -I. -I../.. -I../../. -I../.././ext/openssl -DRUBY_EXTCONF_H=\"extconf.h\" -I/opt/X11/include -D_XOPEN_SOURCE -D_DARWIN_C_SOURCE  -I/opt/X11/include -fno-common -g -O2  -fno-common -pipe -fno-common   -c ossl_digest.c
  561.     ossl_digest.c: In function ‘GetDigestPtr’:
  562.     ossl_digest.c:43: warning: ‘EVP_get_digestbyname’ is deprecated (declared at /usr/include/openssl/evp.h:849)
  563.     ossl_digest.c:51: warning: ‘EVP_MD_CTX_md’ is deprecated (declared at /usr/include/openssl/evp.h:486)
  564.     ossl_digest.c: In function ‘ossl_digest_new’:
  565.     ossl_digest.c:65: warning: ‘EVP_DigestInit_ex’ is deprecated (declared at /usr/include/openssl/evp.h:555)
  566.     ossl_digest.c: In function ‘ossl_digest_alloc’:
  567.     ossl_digest.c:81: warning: ‘EVP_MD_CTX_create’ is deprecated (declared at /usr/include/openssl/evp.h:549)
  568.     ossl_digest.c:84: warning: ‘EVP_MD_CTX_destroy’ is deprecated (declared at /usr/include/openssl/evp.h:550)
  569.     ossl_digest.c: In function ‘ossl_digest_initialize’:
  570.     ossl_digest.c:109: warning: ‘EVP_DigestInit_ex’ is deprecated (declared at /usr/include/openssl/evp.h:555)
  571.     ossl_digest.c: In function ‘ossl_digest_copy’:
  572.     ossl_digest.c:128: warning: ‘EVP_MD_CTX_copy’ is deprecated (declared at /usr/include/openssl/evp.h:562)
  573.     ossl_digest.c: In function ‘ossl_digest_reset’:
  574.     ossl_digest.c:145: warning: ‘EVP_DigestInit_ex’ is deprecated (declared at /usr/include/openssl/evp.h:555)
  575.     ossl_digest.c:145: warning: ‘EVP_MD_CTX_md’ is deprecated (declared at /usr/include/openssl/evp.h:486)
  576.     ossl_digest.c: In function ‘ossl_digest_update’:
  577.     ossl_digest.c:164: warning: ‘EVP_DigestUpdate’ is deprecated (declared at /usr/include/openssl/evp.h:557)
  578.     ossl_digest.c: In function ‘ossl_digest_finish’:
  579.     ossl_digest.c:185: warning: ‘EVP_MD_size’ is deprecated (declared at /usr/include/openssl/evp.h:483)
  580.     ossl_digest.c:185: warning: ‘EVP_MD_CTX_md’ is deprecated (declared at /usr/include/openssl/evp.h:486)
  581.     ossl_digest.c:188: warning: ‘EVP_MD_size’ is deprecated (declared at /usr/include/openssl/evp.h:483)
  582.     ossl_digest.c:188: warning: ‘EVP_MD_CTX_md’ is deprecated (declared at /usr/include/openssl/evp.h:486)
  583.     ossl_digest.c:191: warning: ‘EVP_DigestFinal_ex’ is deprecated (declared at /usr/include/openssl/evp.h:558)
  584.     ossl_digest.c: In function ‘ossl_digest_name’:
  585.     ossl_digest.c:208: warning: ‘OBJ_nid2sn’ is deprecated (declared at /usr/include/openssl/objects.h:1008)
  586.     ossl_digest.c:208: warning: ‘EVP_MD_type’ is deprecated (declared at /usr/include/openssl/evp.h:479)
  587.     ossl_digest.c:208: warning: ‘EVP_MD_CTX_md’ is deprecated (declared at /usr/include/openssl/evp.h:486)
  588.     ossl_digest.c: In function ‘ossl_digest_size’:
  589.     ossl_digest.c:224: warning: ‘EVP_MD_size’ is deprecated (declared at /usr/include/openssl/evp.h:483)
  590.     ossl_digest.c:224: warning: ‘EVP_MD_CTX_md’ is deprecated (declared at /usr/include/openssl/evp.h:486)
  591.     ossl_digest.c: In function ‘ossl_digest_block_length’:
  592.     ossl_digest.c:234: warning: ‘EVP_MD_block_size’ is deprecated (declared at /usr/include/openssl/evp.h:484)
  593.     ossl_digest.c:234: warning: ‘EVP_MD_CTX_md’ is deprecated (declared at /usr/include/openssl/evp.h:486)
  594.     /usr/bin/gcc -I. -I../.. -I../../. -I../.././ext/openssl -DRUBY_EXTCONF_H=\"extconf.h\" -I/opt/X11/include -D_XOPEN_SOURCE -D_DARWIN_C_SOURCE  -I/opt/X11/include -fno-common -g -O2  -fno-common -pipe -fno-common   -c ossl_engine.c
  595.     ossl_engine.c: In function ‘ossl_engine_s_load’:
  596.     ossl_engine.c:59: warning: ‘ENGINE_load_builtin_engines’ is deprecated (declared at /usr/include/openssl/engine.h:343)
  597.     ossl_engine.c:95: warning: ‘ENGINE_load_openssl’ is deprecated (declared at /usr/include/openssl/engine.h:326)
  598.     ossl_engine.c: In function ‘ossl_engine_s_cleanup’:
  599.     ossl_engine.c:105: warning: ‘ENGINE_cleanup’ is deprecated (declared at /usr/include/openssl/engine.h:490)
  600.     ossl_engine.c: In function ‘ossl_engine_s_engines’:
  601.     ossl_engine.c:117: warning: ‘ENGINE_get_first’ is deprecated (declared at /usr/include/openssl/engine.h:314)
  602.     ossl_engine.c:117: warning: ‘ENGINE_get_next’ is deprecated (declared at /usr/include/openssl/engine.h:317)
  603.     ossl_engine.c:118: warning: ‘ENGINE_free’ is deprecated (declared at /usr/include/openssl/engine.h:457)
  604.     ossl_engine.c: In function ‘ossl_engine_s_by_id’:
  605.     ossl_engine.c:133: warning: ‘ENGINE_by_id’ is deprecated (declared at /usr/include/openssl/engine.h:324)
  606.     ossl_engine.c:135: warning: ‘ENGINE_free’ is deprecated (declared at /usr/include/openssl/engine.h:457)
  607.     ossl_engine.c:137: warning: ‘ENGINE_init’ is deprecated (declared at /usr/include/openssl/engine.h:534)
  608.     ossl_engine.c:139: warning: ‘ENGINE_ctrl’ is deprecated (declared at /usr/include/openssl/engine.h:413)
  609.     ossl_engine.c:141: warning: ‘ERR_clear_error’ is deprecated (declared at /usr/include/openssl/err.h:278)
  610.     ossl_engine.c: In function ‘ossl_engine_s_alloc’:
  611.     ossl_engine.c:152: warning: ‘ENGINE_new’ is deprecated (declared at /usr/include/openssl/engine.h:456)
  612.     ossl_engine.c:155: warning: ‘ENGINE_free’ is deprecated (declared at /usr/include/openssl/engine.h:457)
  613.     ossl_engine.c: In function ‘ossl_engine_get_id’:
  614.     ossl_engine.c:165: warning: ‘ENGINE_get_id’ is deprecated (declared at /usr/include/openssl/engine.h:496)
  615.     ossl_engine.c: In function ‘ossl_engine_get_name’:
  616.     ossl_engine.c:173: warning: ‘ENGINE_get_name’ is deprecated (declared at /usr/include/openssl/engine.h:497)
  617.     ossl_engine.c: In function ‘ossl_engine_finish’:
  618.     ossl_engine.c:182: warning: ‘ENGINE_finish’ is deprecated (declared at /usr/include/openssl/engine.h:538)
  619.     ossl_engine.c: In function ‘ossl_engine_get_cipher’:
  620.     ossl_engine.c:197: warning: ‘EVP_get_cipherbyname’ is deprecated (declared at /usr/include/openssl/evp.h:848)
  621.     ossl_engine.c:199: warning: ‘EVP_CIPHER_nid’ is deprecated (declared at /usr/include/openssl/evp.h:491)
  622.     ossl_engine.c:201: warning: ‘ENGINE_get_cipher’ is deprecated (declared at /usr/include/openssl/engine.h:514)
  623.     ossl_engine.c: In function ‘ossl_engine_get_digest’:
  624.     ossl_engine.c:220: warning: ‘EVP_get_digestbyname’ is deprecated (declared at /usr/include/openssl/evp.h:849)
  625.     ossl_engine.c:222: warning: ‘EVP_MD_type’ is deprecated (declared at /usr/include/openssl/evp.h:479)
  626.     ossl_engine.c:224: warning: ‘ENGINE_get_digest’ is deprecated (declared at /usr/include/openssl/engine.h:515)
  627.     ossl_engine.c: In function ‘ossl_engine_load_privkey’:
  628.     ossl_engine.c:248: warning: ‘ENGINE_load_private_key’ is deprecated (declared at /usr/include/openssl/engine.h:544)
  629.     ossl_engine.c: In function ‘ossl_engine_load_pubkey’:
  630.     ossl_engine.c:272: warning: ‘ENGINE_load_public_key’ is deprecated (declared at /usr/include/openssl/engine.h:546)
  631.     ossl_engine.c: In function ‘ossl_engine_set_default’:
  632.     ossl_engine.c:286: warning: ‘ENGINE_set_default’ is deprecated (declared at /usr/include/openssl/engine.h:588)
  633.     ossl_engine.c: In function ‘ossl_engine_ctrl_cmd’:
  634.     ossl_engine.c:302: warning: ‘ENGINE_ctrl_cmd_string’ is deprecated (declared at /usr/include/openssl/engine.h:448)
  635.     ossl_engine.c: In function ‘ossl_engine_get_cmds’:
  636.     ossl_engine.c:330: warning: ‘ENGINE_get_cmd_defns’ is deprecated (declared at /usr/include/openssl/engine.h:516)
  637.     ossl_engine.c: In function ‘ossl_engine_inspect’:
  638.     ossl_engine.c:347: warning: initialization discards qualifiers from pointer target type
  639.     /usr/bin/gcc -I. -I../.. -I../../. -I../.././ext/openssl -DRUBY_EXTCONF_H=\"extconf.h\" -I/opt/X11/include -D_XOPEN_SOURCE -D_DARWIN_C_SOURCE  -I/opt/X11/include -fno-common -g -O2  -fno-common -pipe -fno-common   -c ossl_hmac.c
  640.     ossl_hmac.c: In function ‘ossl_hmac_free’:
  641.     ossl_hmac.c:44: warning: ‘HMAC_CTX_cleanup’ is deprecated (declared at /usr/include/openssl/hmac.h:91)
  642.     ossl_hmac.c: In function ‘ossl_hmac_alloc’:
  643.     ossl_hmac.c:55: warning: ‘HMAC_CTX_init’ is deprecated (declared at /usr/include/openssl/hmac.h:90)
  644.     ossl_hmac.c: In function ‘ossl_hmac_initialize’:
  645.     ossl_hmac.c:73: warning: ‘HMAC_Init’ is deprecated (declared at /usr/include/openssl/hmac.h:96)
  646.     ossl_hmac.c: In function ‘ossl_hmac_update’:
  647.     ossl_hmac.c:106: warning: ‘HMAC_Update’ is deprecated (declared at /usr/include/openssl/hmac.h:99)
  648.     ossl_hmac.c: In function ‘hmac_final’:
  649.     ossl_hmac.c:117: warning: ‘CRYPTO_malloc’ is deprecated (declared at /usr/include/openssl/crypto.h:478)
  650.     ossl_hmac.c:117: warning: ‘EVP_MD_size’ is deprecated (declared at /usr/include/openssl/evp.h:483)
  651.     ossl_hmac.c:118: warning: ‘HMAC_CTX_cleanup’ is deprecated (declared at /usr/include/openssl/hmac.h:91)
  652.     ossl_hmac.c:119: warning: ‘EVP_MD_size’ is deprecated (declared at /usr/include/openssl/evp.h:483)
  653.     ossl_hmac.c:122: warning: ‘HMAC_Final’ is deprecated (declared at /usr/include/openssl/hmac.h:100)
  654.     ossl_hmac.c:123: warning: ‘HMAC_CTX_cleanup’ is deprecated (declared at /usr/include/openssl/hmac.h:91)
  655.     ossl_hmac.c: In function ‘ossl_hmac_hexdigest’:
  656.     ossl_hmac.c:162: warning: ‘CRYPTO_free’ is deprecated (declared at /usr/include/openssl/crypto.h:480)
  657.     ossl_hmac.c:165: warning: ‘CRYPTO_free’ is deprecated (declared at /usr/include/openssl/crypto.h:480)
  658.     ossl_hmac.c: In function ‘ossl_hmac_reset’:
  659.     ossl_hmac.c:182: warning: ‘HMAC_Init’ is deprecated (declared at /usr/include/openssl/hmac.h:96)
  660.     ossl_hmac.c: In function ‘ossl_hmac_s_digest’:
  661.     ossl_hmac.c:200: warning: ‘HMAC’ is deprecated (declared at /usr/include/openssl/hmac.h:103)
  662.     ossl_hmac.c: In function ‘ossl_hmac_s_hexdigest’:
  663.     ossl_hmac.c:221: warning: ‘HMAC’ is deprecated (declared at /usr/include/openssl/hmac.h:103)
  664.     /usr/bin/gcc -I. -I../.. -I../../. -I../.././ext/openssl -DRUBY_EXTCONF_H=\"extconf.h\" -I/opt/X11/include -D_XOPEN_SOURCE -D_DARWIN_C_SOURCE  -I/opt/X11/include -fno-common -g -O2  -fno-common -pipe -fno-common   -c ossl_ns_spki.c
  665.     ossl_ns_spki.c: In function ‘ossl_spki_initialize’:
  666.     ossl_ns_spki.c:65: warning: ‘NETSCAPE_SPKI_b64_decode’ is deprecated (declared at /usr/include/openssl/x509.h:762)
  667.     ossl_ns_spki.c:67: warning: passing argument 2 of ‘d2i_NETSCAPE_SPKI’ from incompatible pointer type
  668.     ossl_ns_spki.c:73: warning: ‘ERR_clear_error’ is deprecated (declared at /usr/include/openssl/err.h:278)
  669.     ossl_ns_spki.c: In function ‘ossl_spki_to_pem’:
  670.     ossl_ns_spki.c:106: warning: ‘NETSCAPE_SPKI_b64_encode’ is deprecated (declared at /usr/include/openssl/x509.h:763)
  671.     ossl_ns_spki.c: In function ‘ossl_spki_print’:
  672.     ossl_ns_spki.c:123: warning: ‘BIO_new’ is deprecated (declared at /usr/include/openssl/bio.h:581)
  673.     ossl_ns_spki.c:123: warning: ‘BIO_s_mem’ is deprecated (declared at /usr/include/openssl/bio.h:616)
  674.     ossl_ns_spki.c:126: warning: ‘NETSCAPE_SPKI_print’ is deprecated (declared at /usr/include/openssl/x509.h:767)
  675.     ossl_ns_spki.c:127: warning: ‘BIO_free’ is deprecated (declared at /usr/include/openssl/bio.h:583)
  676.     ossl_ns_spki.c:130: warning: ‘BIO_ctrl’ is deprecated (declared at /usr/include/openssl/bio.h:590)
  677.     ossl_ns_spki.c:132: warning: ‘BIO_free’ is deprecated (declared at /usr/include/openssl/bio.h:583)
  678.     ossl_ns_spki.c: In function ‘ossl_spki_get_public_key’:
  679.     ossl_ns_spki.c:144: warning: ‘NETSCAPE_SPKI_get_pubkey’ is deprecated (declared at /usr/include/openssl/x509.h:764)
  680.     ossl_ns_spki.c: In function ‘ossl_spki_set_public_key’:
  681.     ossl_ns_spki.c:157: warning: ‘NETSCAPE_SPKI_set_pubkey’ is deprecated (declared at /usr/include/openssl/x509.h:765)
  682.     ossl_ns_spki.c: In function ‘ossl_spki_set_challenge’:
  683.     ossl_ns_spki.c:186: warning: ‘ASN1_STRING_set’ is deprecated (declared at /usr/include/openssl/asn1.h:795)
  684.     ossl_ns_spki.c: In function ‘ossl_spki_sign’:
  685.     ossl_ns_spki.c:204: warning: ‘NETSCAPE_SPKI_sign’ is deprecated (declared at /usr/include/openssl/x509.h:774)
  686.     ossl_ns_spki.c: In function ‘ossl_spki_verify’:
  687.     ossl_ns_spki.c:220: warning: ‘NETSCAPE_SPKI_verify’ is deprecated (declared at /usr/include/openssl/x509.h:760)
  688.     /usr/bin/gcc -I. -I../.. -I../../. -I../.././ext/openssl -DRUBY_EXTCONF_H=\"extconf.h\" -I/opt/X11/include -D_XOPEN_SOURCE -D_DARWIN_C_SOURCE  -I/opt/X11/include -fno-common -g -O2  -fno-common -pipe -fno-common   -c ossl_ocsp.c
  689.     ossl_ocsp.c: In function ‘ossl_ocspreq_initialize’:
  690.     ossl_ocsp.c:114: warning: passing argument 2 of ‘d2i_OCSP_REQUEST’ from incompatible pointer type
  691.     ossl_ocsp.c: In function ‘ossl_ocspreq_add_nonce’:
  692.     ossl_ocsp.c:132: warning: ‘OCSP_request_add1_nonce’ is deprecated (declared at /usr/include/openssl/ocsp.h:420)
  693.     ossl_ocsp.c:137: warning: ‘OCSP_request_add1_nonce’ is deprecated (declared at /usr/include/openssl/ocsp.h:420)
  694.     ossl_ocsp.c: In function ‘ossl_ocspreq_check_nonce’:
  695.     ossl_ocsp.c:165: warning: ‘OCSP_check_nonce’ is deprecated (declared at /usr/include/openssl/ocsp.h:422)
  696.     ossl_ocsp.c: In function ‘ossl_ocspreq_add_certid’:
  697.     ossl_ocsp.c:178: warning: ‘OCSP_request_add0_id’ is deprecated (declared at /usr/include/openssl/ocsp.h:418)
  698.     ossl_ocsp.c:178: warning: ‘ASN1_dup’ is deprecated (declared at /usr/include/openssl/asn1.h:935)
  699.     ossl_ocsp.c: In function ‘ossl_ocspreq_get_certid’:
  700.     ossl_ocsp.c:194: warning: ‘OCSP_request_onereq_count’ is deprecated (declared at /usr/include/openssl/ocsp.h:461)
  701.     ossl_ocsp.c:197: warning: ‘OCSP_request_onereq_get0’ is deprecated (declared at /usr/include/openssl/ocsp.h:462)
  702.     ossl_ocsp.c:198: warning: ‘ASN1_dup’ is deprecated (declared at /usr/include/openssl/asn1.h:935)
  703.     ossl_ocsp.c:198: warning: ‘OCSP_onereq_get0_id’ is deprecated (declared at /usr/include/openssl/ocsp.h:463)
  704.     ossl_ocsp.c: In function ‘ossl_ocspreq_sign’:
  705.     ossl_ocsp.c:223: warning: ‘sk_new_null’ is deprecated (declared at /usr/include/openssl/stack.h:87)
  706.     ossl_ocsp.c:228: warning: ‘OCSP_request_sign’ is deprecated (declared at /usr/include/openssl/ocsp.h:433)
  707.     ossl_ocsp.c:228: warning: ‘EVP_sha1’ is deprecated (declared at /usr/include/openssl/evp.h:666)
  708.     ossl_ocsp.c:229: warning: ‘sk_pop_free’ is deprecated (declared at /usr/include/openssl/stack.h:89)
  709.     ossl_ocsp.c: In function ‘ossl_ocspreq_verify’:
  710.     ossl_ocsp.c:249: warning: ‘OCSP_request_verify’ is deprecated (declared at /usr/include/openssl/ocsp.h:454)
  711.     ossl_ocsp.c:250: warning: ‘sk_pop_free’ is deprecated (declared at /usr/include/openssl/stack.h:89)
  712.     ossl_ocsp.c:251: warning: ‘ERR_error_string’ is deprecated (declared at /usr/include/openssl/err.h:279)
  713.     ossl_ocsp.c:251: warning: ‘ERR_peek_error’ is deprecated (declared at /usr/include/openssl/err.h:270)
  714.     ossl_ocsp.c: In function ‘ossl_ocspres_s_create’:
  715.     ossl_ocsp.c:289: warning: ‘OCSP_response_create’ is deprecated (declared at /usr/include/openssl/ocsp.h:468)
  716.     ossl_ocsp.c: In function ‘ossl_ocspres_initialize’:
  717.     ossl_ocsp.c:321: warning: passing argument 2 of ‘d2i_OCSP_RESPONSE’ from incompatible pointer type
  718.     ossl_ocsp.c: In function ‘ossl_ocspres_status’:
  719.     ossl_ocsp.c:336: warning: ‘OCSP_response_status’ is deprecated (declared at /usr/include/openssl/ocsp.h:435)
  720.     ossl_ocsp.c: In function ‘ossl_ocspres_status_string’:
  721.     ossl_ocsp.c:348: warning: ‘OCSP_response_status’ is deprecated (declared at /usr/include/openssl/ocsp.h:435)
  722.     ossl_ocsp.c:350: warning: ‘OCSP_response_status_str’ is deprecated (declared at /usr/include/openssl/ocsp.h:554)
  723.     ossl_ocsp.c: In function ‘ossl_ocspres_get_basic’:
  724.     ossl_ocsp.c:361: warning: ‘OCSP_response_get1_basic’ is deprecated (declared at /usr/include/openssl/ocsp.h:436)
  725.     ossl_ocsp.c: In function ‘ossl_ocspbres_copy_nonce’:
  726.     ossl_ocsp.c:419: warning: ‘OCSP_copy_nonce’ is deprecated (declared at /usr/include/openssl/ocsp.h:423)
  727.     ossl_ocsp.c: In function ‘ossl_ocspbres_add_nonce’:
  728.     ossl_ocsp.c:434: warning: ‘OCSP_basic_add1_nonce’ is deprecated (declared at /usr/include/openssl/ocsp.h:421)
  729.     ossl_ocsp.c:439: warning: ‘OCSP_basic_add1_nonce’ is deprecated (declared at /usr/include/openssl/ocsp.h:421)
  730.     ossl_ocsp.c: In function ‘ossl_ocspbres_add_status’:
  731.     ossl_ocsp.c:473: warning: ‘X509_gmtime_adj’ is deprecated (declared at /usr/include/openssl/x509.h:884)
  732.     ossl_ocsp.c:477: warning: ‘X509_gmtime_adj’ is deprecated (declared at /usr/include/openssl/x509.h:884)
  733.     ossl_ocsp.c:480: warning: ‘X509_gmtime_adj’ is deprecated (declared at /usr/include/openssl/x509.h:884)
  734.     ossl_ocsp.c:484: warning: ‘OCSP_basic_add1_status’ is deprecated (declared at /usr/include/openssl/ocsp.h:473)
  735.     ossl_ocsp.c:491: warning: ‘sk_pop_free’ is deprecated (declared at /usr/include/openssl/stack.h:89)
  736.     ossl_ocsp.c:495: warning: ‘OCSP_SINGLERESP_add_ext’ is deprecated (declared at /usr/include/openssl/ocsp.h:536)
  737.     ossl_ocsp.c: In function ‘ossl_ocspbres_get_status’:
  738.     ossl_ocsp.c:528: warning: ‘OCSP_resp_count’ is deprecated (declared at /usr/include/openssl/ocsp.h:438)
  739.     ossl_ocsp.c:530: warning: ‘OCSP_resp_get0’ is deprecated (declared at /usr/include/openssl/ocsp.h:439)
  740.     ossl_ocsp.c:534: warning: ‘OCSP_single_get0_status’ is deprecated (declared at /usr/include/openssl/ocsp.h:444)
  741.     ossl_ocsp.c:537: warning: ‘ASN1_dup’ is deprecated (declared at /usr/include/openssl/asn1.h:935)
  742.     ossl_ocsp.c:547: warning: ‘OCSP_SINGLERESP_get_ext_count’ is deprecated (declared at /usr/include/openssl/ocsp.h:527)
  743.     ossl_ocsp.c:549: warning: ‘OCSP_SINGLERESP_get_ext’ is deprecated (declared at /usr/include/openssl/ocsp.h:531)
  744.     ossl_ocsp.c: In function ‘ossl_ocspbres_sign’:
  745.     ossl_ocsp.c:575: warning: ‘sk_new_null’ is deprecated (declared at /usr/include/openssl/stack.h:87)
  746.     ossl_ocsp.c:582: warning: ‘OCSP_basic_sign’ is deprecated (declared at /usr/include/openssl/ocsp.h:477)
  747.     ossl_ocsp.c:582: warning: ‘EVP_sha1’ is deprecated (declared at /usr/include/openssl/evp.h:666)
  748.     ossl_ocsp.c:583: warning: ‘sk_pop_free’ is deprecated (declared at /usr/include/openssl/stack.h:89)
  749.     ossl_ocsp.c: In function ‘ossl_ocspbres_verify’:
  750.     ossl_ocsp.c:603: warning: ‘OCSP_basic_verify’ is deprecated (declared at /usr/include/openssl/ocsp.h:562)
  751.     ossl_ocsp.c:604: warning: ‘sk_pop_free’ is deprecated (declared at /usr/include/openssl/stack.h:89)
  752.     ossl_ocsp.c:605: warning: ‘ERR_error_string’ is deprecated (declared at /usr/include/openssl/err.h:279)
  753.     ossl_ocsp.c:605: warning: ‘ERR_peek_error’ is deprecated (declared at /usr/include/openssl/err.h:270)
  754.     ossl_ocsp.c: In function ‘ossl_ocspcid_initialize’:
  755.     ossl_ocsp.c:634: warning: ‘OCSP_cert_to_id’ is deprecated (declared at /usr/include/openssl/ocsp.h:411)
  756.     ossl_ocsp.c: In function ‘ossl_ocspcid_cmp’:
  757.     ossl_ocsp.c:651: warning: ‘OCSP_id_cmp’ is deprecated (declared at /usr/include/openssl/ocsp.h:459)
  758.     ossl_ocsp.c: In function ‘ossl_ocspcid_cmp_issuer’:
  759.     ossl_ocsp.c:664: warning: ‘OCSP_id_issuer_cmp’ is deprecated (declared at /usr/include/openssl/ocsp.h:458)
  760.     /usr/bin/gcc -I. -I../.. -I../../. -I../.././ext/openssl -DRUBY_EXTCONF_H=\"extconf.h\" -I/opt/X11/include -D_XOPEN_SOURCE -D_DARWIN_C_SOURCE  -I/opt/X11/include -fno-common -g -O2  -fno-common -pipe -fno-common   -c ossl_pkcs12.c
  761.     ossl_pkcs12.c: In function ‘ossl_pkcs12_s_create’:
  762.     ossl_pkcs12.c:93: warning: ‘OBJ_txt2nid’ is deprecated (declared at /usr/include/openssl/objects.h:1012)
  763.     ossl_pkcs12.c:97: warning: ‘OBJ_txt2nid’ is deprecated (declared at /usr/include/openssl/objects.h:1012)
  764.     ossl_pkcs12.c:107: warning: ‘PKCS12_create’ is deprecated (declared at /usr/include/openssl/pkcs12.h:253)
  765.     ossl_pkcs12.c:109: warning: ‘sk_pop_free’ is deprecated (declared at /usr/include/openssl/stack.h:89)
  766.     ossl_pkcs12.c: In function ‘ossl_pkcs12_initialize’:
  767.     ossl_pkcs12.c:144: warning: ‘d2i_PKCS12_bio’ is deprecated (declared at /usr/include/openssl/pkcs12.h:265)
  768.     ossl_pkcs12.c:145: warning: ‘BIO_free’ is deprecated (declared at /usr/include/openssl/bio.h:583)
  769.     ossl_pkcs12.c:148: warning: ‘PKCS12_parse’ is deprecated (declared at /usr/include/openssl/pkcs12.h:250)
  770.     ossl_pkcs12.c:163: warning: ‘sk_pop_free’ is deprecated (declared at /usr/include/openssl/stack.h:89)
  771.     /usr/bin/gcc -I. -I../.. -I../../. -I../.././ext/openssl -DRUBY_EXTCONF_H=\"extconf.h\" -I/opt/X11/include -D_XOPEN_SOURCE -D_DARWIN_C_SOURCE  -I/opt/X11/include -fno-common -g -O2  -fno-common -pipe -fno-common   -c ossl_pkcs5.c
  772.     ossl_pkcs5.c: In function ‘ossl_pkcs5_pbkdf2_hmac_sha1’:
  773.     ossl_pkcs5.c:78: warning: ‘PKCS5_PBKDF2_HMAC_SHA1’ is deprecated (declared at /usr/include/openssl/evp.h:920)
  774.     /usr/bin/gcc -I. -I../.. -I../../. -I../.././ext/openssl -DRUBY_EXTCONF_H=\"extconf.h\" -I/opt/X11/include -D_XOPEN_SOURCE -D_DARWIN_C_SOURCE  -I/opt/X11/include -fno-common -g -O2  -fno-common -pipe -fno-common   -c ossl_pkcs7.c
  775.     ossl_pkcs7.c: In function ‘ossl_pkcs7si_new’:
  776.     ossl_pkcs7.c:89: warning: ‘ASN1_dup’ is deprecated (declared at /usr/include/openssl/asn1.h:935)
  777.     ossl_pkcs7.c:89: warning: passing argument 2 of ‘ASN1_dup’ from incompatible pointer type
  778.     ossl_pkcs7.c: In function ‘DupPKCS7SignerPtr’:
  779.     ossl_pkcs7.c:102: warning: ‘ASN1_dup’ is deprecated (declared at /usr/include/openssl/asn1.h:935)
  780.     ossl_pkcs7.c:102: warning: passing argument 2 of ‘ASN1_dup’ from incompatible pointer type
  781.     ossl_pkcs7.c: In function ‘ossl_pkcs7ri_new’:
  782.     ossl_pkcs7.c:115: warning: ‘ASN1_dup’ is deprecated (declared at /usr/include/openssl/asn1.h:935)
  783.     ossl_pkcs7.c:115: warning: passing argument 2 of ‘ASN1_dup’ from incompatible pointer type
  784.     ossl_pkcs7.c: In function ‘DupPKCS7RecipientPtr’:
  785.     ossl_pkcs7.c:128: warning: ‘ASN1_dup’ is deprecated (declared at /usr/include/openssl/asn1.h:935)
  786.     ossl_pkcs7.c:128: warning: passing argument 2 of ‘ASN1_dup’ from incompatible pointer type
  787.     ossl_pkcs7.c: In function ‘ossl_pkcs7_s_read_smime’:
  788.     ossl_pkcs7.c:148: warning: ‘SMIME_read_PKCS7’ is deprecated (declared at /usr/include/openssl/pkcs7.h:373)
  789.     ossl_pkcs7.c:149: warning: ‘BIO_free’ is deprecated (declared at /usr/include/openssl/bio.h:583)
  790.     ossl_pkcs7.c: In function ‘ossl_pkcs7_s_write_smime’:
  791.     ossl_pkcs7.c:176: warning: ‘OBJ_obj2nid’ is deprecated (declared at /usr/include/openssl/objects.h:1009)
  792.     ossl_pkcs7.c:176: warning: ‘PKCS7_ctrl’ is deprecated (declared at /usr/include/openssl/pkcs7.h:313)
  793.     ossl_pkcs7.c:179: warning: ‘BIO_new’ is deprecated (declared at /usr/include/openssl/bio.h:581)
  794.     ossl_pkcs7.c:179: warning: ‘BIO_s_mem’ is deprecated (declared at /usr/include/openssl/bio.h:616)
  795.     ossl_pkcs7.c:180: warning: ‘BIO_free’ is deprecated (declared at /usr/include/openssl/bio.h:583)
  796.     ossl_pkcs7.c:183: warning: ‘SMIME_write_PKCS7’ is deprecated (declared at /usr/include/openssl/pkcs7.h:372)
  797.     ossl_pkcs7.c:184: warning: ‘BIO_free’ is deprecated (declared at /usr/include/openssl/bio.h:583)
  798.     ossl_pkcs7.c:185: warning: ‘BIO_free’ is deprecated (declared at /usr/include/openssl/bio.h:583)
  799.     ossl_pkcs7.c:188: warning: ‘BIO_free’ is deprecated (declared at /usr/include/openssl/bio.h:583)
  800.     ossl_pkcs7.c: In function ‘ossl_pkcs7_s_sign’:
  801.     ossl_pkcs7.c:219: warning: ‘BIO_free’ is deprecated (declared at /usr/include/openssl/bio.h:583)
  802.     ossl_pkcs7.c:223: warning: ‘PKCS7_sign’ is deprecated (declared at /usr/include/openssl/pkcs7.h:359)
  803.     ossl_pkcs7.c:224: warning: ‘BIO_free’ is deprecated (declared at /usr/include/openssl/bio.h:583)
  804.     ossl_pkcs7.c:225: warning: ‘sk_pop_free’ is deprecated (declared at /usr/include/openssl/stack.h:89)
  805.     ossl_pkcs7.c:231: warning: ‘BIO_free’ is deprecated (declared at /usr/include/openssl/bio.h:583)
  806.     ossl_pkcs7.c:232: warning: ‘sk_pop_free’ is deprecated (declared at /usr/include/openssl/stack.h:89)
  807.     ossl_pkcs7.c: In function ‘ossl_pkcs7_s_encrypt’:
  808.     ossl_pkcs7.c:255: warning: ‘EVP_rc2_40_cbc’ is deprecated (declared at /usr/include/openssl/evp.h:737)
  809.     ossl_pkcs7.c:272: warning: ‘BIO_free’ is deprecated (declared at /usr/include/openssl/bio.h:583)
  810.     ossl_pkcs7.c:275: warning: ‘PKCS7_encrypt’ is deprecated (declared at /usr/include/openssl/pkcs7.h:364)
  811.     ossl_pkcs7.c:276: warning: ‘BIO_free’ is deprecated (declared at /usr/include/openssl/bio.h:583)
  812.     ossl_pkcs7.c:277: warning: ‘sk_pop_free’ is deprecated (declared at /usr/include/openssl/stack.h:89)
  813.     ossl_pkcs7.c:280: warning: ‘BIO_free’ is deprecated (declared at /usr/include/openssl/bio.h:583)
  814.     ossl_pkcs7.c:283: warning: ‘sk_pop_free’ is deprecated (declared at /usr/include/openssl/stack.h:89)
  815.     ossl_pkcs7.c: In function ‘ossl_pkcs7_initialize’:
  816.     ossl_pkcs7.c:322: warning: ‘BIO_ctrl’ is deprecated (declared at /usr/include/openssl/bio.h:590)
  817.     ossl_pkcs7.c:323: warning: ‘d2i_PKCS7_bio’ is deprecated (declared at /usr/include/openssl/pkcs7.h:294)
  818.     ossl_pkcs7.c:325: warning: ‘BIO_free’ is deprecated (declared at /usr/include/openssl/bio.h:583)
  819.     ossl_pkcs7.c: In function ‘ossl_pkcs7_copy’:
  820.     ossl_pkcs7.c:343: warning: ‘PKCS7_dup’ is deprecated (declared at /usr/include/openssl/pkcs7.h:293)
  821.     ossl_pkcs7.c: In function ‘ossl_pkcs7_set_type’:
  822.     ossl_pkcs7.c:396: warning: ‘PKCS7_set_type’ is deprecated (declared at /usr/include/openssl/pkcs7.h:315)
  823.     ossl_pkcs7.c: In function ‘ossl_pkcs7_get_type’:
  824.     ossl_pkcs7.c:412: warning: ‘OBJ_obj2nid’ is deprecated (declared at /usr/include/openssl/objects.h:1009)
  825.     ossl_pkcs7.c:414: warning: ‘OBJ_obj2nid’ is deprecated (declared at /usr/include/openssl/objects.h:1009)
  826.     ossl_pkcs7.c:416: warning: ‘OBJ_obj2nid’ is deprecated (declared at /usr/include/openssl/objects.h:1009)
  827.     ossl_pkcs7.c:418: warning: ‘OBJ_obj2nid’ is deprecated (declared at /usr/include/openssl/objects.h:1009)
  828.     ossl_pkcs7.c:420: warning: ‘OBJ_obj2nid’ is deprecated (declared at /usr/include/openssl/objects.h:1009)
  829.     ossl_pkcs7.c: In function ‘ossl_pkcs7_set_detached’:
  830.     ossl_pkcs7.c:433: warning: ‘PKCS7_ctrl’ is deprecated (declared at /usr/include/openssl/pkcs7.h:313)
  831.     ossl_pkcs7.c: In function ‘ossl_pkcs7_get_detached’:
  832.     ossl_pkcs7.c:444: warning: ‘PKCS7_ctrl’ is deprecated (declared at /usr/include/openssl/pkcs7.h:313)
  833.     ossl_pkcs7.c: In function ‘ossl_pkcs7_detached_p’:
  834.     ossl_pkcs7.c:452: warning: ‘OBJ_obj2nid’ is deprecated (declared at /usr/include/openssl/objects.h:1009)
  835.     ossl_pkcs7.c:452: warning: ‘PKCS7_ctrl’ is deprecated (declared at /usr/include/openssl/pkcs7.h:313)
  836.     ossl_pkcs7.c: In function ‘ossl_pkcs7_set_cipher’:
  837.     ossl_pkcs7.c:461: warning: ‘PKCS7_set_cipher’ is deprecated (declared at /usr/include/openssl/pkcs7.h:343)
  838.     ossl_pkcs7.c: In function ‘ossl_pkcs7_add_signer’:
  839.     ossl_pkcs7.c:476: warning: ‘PKCS7_add_signer’ is deprecated (declared at /usr/include/openssl/pkcs7.h:320)
  840.     ossl_pkcs7.c:480: warning: ‘OBJ_obj2nid’ is deprecated (declared at /usr/include/openssl/objects.h:1009)
  841.     ossl_pkcs7.c:481: warning: ‘PKCS7_add_signed_attribute’ is deprecated (declared at /usr/include/openssl/pkcs7.h:348)
  842.     ossl_pkcs7.c:482: warning: ‘OBJ_nid2obj’ is deprecated (declared at /usr/include/openssl/objects.h:1006)
  843.     ossl_pkcs7.c: In function ‘ossl_pkcs7_get_signer’:
  844.     ossl_pkcs7.c:498: warning: ‘PKCS7_get_signer_info’ is deprecated (declared at /usr/include/openssl/pkcs7.h:338)
  845.     ossl_pkcs7.c:502: warning: ‘sk_num’ is deprecated (declared at /usr/include/openssl/stack.h:81)
  846.     ossl_pkcs7.c:507: warning: ‘sk_value’ is deprecated (declared at /usr/include/openssl/stack.h:82)
  847.     ossl_pkcs7.c: In function ‘ossl_pkcs7_add_recipient’:
  848.     ossl_pkcs7.c:522: warning: ‘PKCS7_add_recipient_info’ is deprecated (declared at /usr/include/openssl/pkcs7.h:341)
  849.     ossl_pkcs7.c: In function ‘ossl_pkcs7_get_recipient’:
  850.     ossl_pkcs7.c:540: warning: ‘OBJ_obj2nid’ is deprecated (declared at /usr/include/openssl/objects.h:1009)
  851.     ossl_pkcs7.c:542: warning: ‘OBJ_obj2nid’ is deprecated (declared at /usr/include/openssl/objects.h:1009)
  852.     ossl_pkcs7.c:546: warning: ‘sk_num’ is deprecated (declared at /usr/include/openssl/stack.h:81)
  853.     ossl_pkcs7.c:551: warning: ‘sk_value’ is deprecated (declared at /usr/include/openssl/stack.h:82)
  854.     ossl_pkcs7.c: In function ‘ossl_pkcs7_add_certificate’:
  855.     ossl_pkcs7.c:566: warning: ‘PKCS7_add_certificate’ is deprecated (declared at /usr/include/openssl/pkcs7.h:321)
  856.     ossl_pkcs7.c: In function ‘pkcs7_get_certs’:
  857.     ossl_pkcs7.c:581: warning: ‘OBJ_obj2nid’ is deprecated (declared at /usr/include/openssl/objects.h:1009)
  858.     ossl_pkcs7.c: In function ‘pkcs7_get_crls’:
  859.     ossl_pkcs7.c:604: warning: ‘OBJ_obj2nid’ is deprecated (declared at /usr/include/openssl/objects.h:1009)
  860.     ossl_pkcs7.c: In function ‘ossl_pkcs7_set_certificates’:
  861.     ossl_pkcs7.c:632: warning: ‘sk_pop’ is deprecated (declared at /usr/include/openssl/stack.h:98)
  862.     ossl_pkcs7.c: In function ‘ossl_pkcs7_add_crl’:
  863.     ossl_pkcs7.c:652: warning: ‘PKCS7_add_crl’ is deprecated (declared at /usr/include/openssl/pkcs7.h:322)
  864.     ossl_pkcs7.c: In function ‘ossl_pkcs7_set_crls’:
  865.     ossl_pkcs7.c:672: warning: ‘sk_pop’ is deprecated (declared at /usr/include/openssl/stack.h:98)
  866.     ossl_pkcs7.c: In function ‘ossl_pkcs7_verify’:
  867.     ossl_pkcs7.c:704: warning: ‘BIO_free’ is deprecated (declared at /usr/include/openssl/bio.h:583)
  868.     ossl_pkcs7.c:710: warning: ‘BIO_new’ is deprecated (declared at /usr/include/openssl/bio.h:581)
  869.     ossl_pkcs7.c:710: warning: ‘BIO_s_mem’ is deprecated (declared at /usr/include/openssl/bio.h:616)
  870.     ossl_pkcs7.c:711: warning: ‘BIO_free’ is deprecated (declared at /usr/include/openssl/bio.h:583)
  871.     ossl_pkcs7.c:712: warning: ‘sk_pop_free’ is deprecated (declared at /usr/include/openssl/stack.h:89)
  872.     ossl_pkcs7.c:715: warning: ‘PKCS7_verify’ is deprecated (declared at /usr/include/openssl/pkcs7.h:361)
  873.     ossl_pkcs7.c:716: warning: ‘BIO_free’ is deprecated (declared at /usr/include/openssl/bio.h:583)
  874.     ossl_pkcs7.c:718: warning: ‘ERR_reason_error_string’ is deprecated (declared at /usr/include/openssl/err.h:283)
  875.     ossl_pkcs7.c:718: warning: ‘ERR_get_error’ is deprecated (declared at /usr/include/openssl/err.h:266)
  876.     ossl_pkcs7.c:720: warning: ‘ERR_clear_error’ is deprecated (declared at /usr/include/openssl/err.h:278)
  877.     ossl_pkcs7.c:723: warning: ‘sk_pop_free’ is deprecated (declared at /usr/include/openssl/stack.h:89)
  878.     ossl_pkcs7.c: In function ‘ossl_pkcs7_decrypt’:
  879.     ossl_pkcs7.c:744: warning: ‘BIO_new’ is deprecated (declared at /usr/include/openssl/bio.h:581)
  880.     ossl_pkcs7.c:744: warning: ‘BIO_s_mem’ is deprecated (declared at /usr/include/openssl/bio.h:616)
  881.     ossl_pkcs7.c:746: warning: ‘PKCS7_decrypt’ is deprecated (declared at /usr/include/openssl/pkcs7.h:365)
  882.     ossl_pkcs7.c:747: warning: ‘BIO_free’ is deprecated (declared at /usr/include/openssl/bio.h:583)
  883.     ossl_pkcs7.c: In function ‘ossl_pkcs7_add_data’:
  884.     ossl_pkcs7.c:765: warning: ‘OBJ_obj2nid’ is deprecated (declared at /usr/include/openssl/objects.h:1009)
  885.     ossl_pkcs7.c:766: warning: ‘PKCS7_content_new’ is deprecated (declared at /usr/include/openssl/pkcs7.h:323)
  886.     ossl_pkcs7.c:769: warning: ‘PKCS7_dataInit’ is deprecated (declared at /usr/include/openssl/pkcs7.h:329)
  887.     ossl_pkcs7.c:771: warning: ‘BIO_read’ is deprecated (declared at /usr/include/openssl/bio.h:585)
  888.     ossl_pkcs7.c:773: warning: ‘BIO_write’ is deprecated (declared at /usr/include/openssl/bio.h:587)
  889.     ossl_pkcs7.c:776: warning: ‘PKCS7_dataFinal’ is deprecated (declared at /usr/include/openssl/pkcs7.h:330)
  890.     ossl_pkcs7.c:780: warning: ‘BIO_free’ is deprecated (declared at /usr/include/openssl/bio.h:583)
  891.     ossl_pkcs7.c:781: warning: ‘BIO_free’ is deprecated (declared at /usr/include/openssl/bio.h:583)
  892.     ossl_pkcs7.c:782: warning: ‘ERR_peek_error’ is deprecated (declared at /usr/include/openssl/err.h:270)
  893.     ossl_pkcs7.c: In function ‘ossl_pkcs7_to_pem’:
  894.     ossl_pkcs7.c:817: warning: ‘BIO_new’ is deprecated (declared at /usr/include/openssl/bio.h:581)
  895.     ossl_pkcs7.c:817: warning: ‘BIO_s_mem’ is deprecated (declared at /usr/include/openssl/bio.h:616)
  896.     ossl_pkcs7.c:821: warning: ‘BIO_free’ is deprecated (declared at /usr/include/openssl/bio.h:583)
  897.     ossl_pkcs7.c: In function ‘ossl_pkcs7si_initialize’:
  898.     ossl_pkcs7.c:858: warning: ‘PKCS7_SIGNER_INFO_set’ is deprecated (declared at /usr/include/openssl/pkcs7.h:319)
  899.     ossl_pkcs7.c: In function ‘ossl_pkcs7si_get_signed_time’:
  900.     ossl_pkcs7.c:893: warning: ‘PKCS7_get_signed_attribute’ is deprecated (declared at /usr/include/openssl/pkcs7.h:352)
  901.     ossl_pkcs7.c: In function ‘ossl_pkcs7ri_initialize’:
  902.     ossl_pkcs7.c:933: warning: ‘PKCS7_RECIP_INFO_set’ is deprecated (declared at /usr/include/openssl/pkcs7.h:342)
  903.     /usr/bin/gcc -I. -I../.. -I../../. -I../.././ext/openssl -DRUBY_EXTCONF_H=\"extconf.h\" -I/opt/X11/include -D_XOPEN_SOURCE -D_DARWIN_C_SOURCE  -I/opt/X11/include -fno-common -g -O2  -fno-common -pipe -fno-common   -c ossl_pkey.c
  904.     ossl_pkey.c: In function ‘ossl_pkey_new’:
  905.     ossl_pkey.c:45: warning: ‘EVP_PKEY_type’ is deprecated (declared at /usr/include/openssl/evp.h:858)
  906.     ossl_pkey.c: In function ‘DupPKeyPtr’:
  907.     ossl_pkey.c:117: warning: ‘CRYPTO_add_lock’ is deprecated (declared at /usr/include/openssl/crypto.h:430)
  908.     ossl_pkey.c: In function ‘DupPrivPKeyPtr’:
  909.     ossl_pkey.c:131: warning: ‘CRYPTO_add_lock’ is deprecated (declared at /usr/include/openssl/crypto.h:430)
  910.     ossl_pkey.c: In function ‘ossl_pkey_alloc’:
  911.     ossl_pkey.c:145: warning: ‘EVP_PKEY_new’ is deprecated (declared at /usr/include/openssl/evp.h:884)
  912.     ossl_pkey.c:148: warning: ‘EVP_PKEY_free’ is deprecated (declared at /usr/include/openssl/evp.h:885)
  913.     ossl_pkey.c: In function ‘ossl_pkey_sign’:
  914.     ossl_pkey.c:174: warning: ‘EVP_DigestInit’ is deprecated (declared at /usr/include/openssl/evp.h:563)
  915.     ossl_pkey.c:176: warning: ‘EVP_DigestUpdate’ is deprecated (declared at /usr/include/openssl/evp.h:557)
  916.     ossl_pkey.c:177: warning: ‘EVP_PKEY_size’ is deprecated (declared at /usr/include/openssl/evp.h:860)
  917.     ossl_pkey.c:178: warning: ‘EVP_SignFinal’ is deprecated (declared at /usr/include/openssl/evp.h:608)
  918.     ossl_pkey.c: In function ‘ossl_pkey_verify’:
  919.     ossl_pkey.c:193: warning: ‘EVP_DigestInit’ is deprecated (declared at /usr/include/openssl/evp.h:563)
  920.     ossl_pkey.c:196: warning: ‘EVP_DigestUpdate’ is deprecated (declared at /usr/include/openssl/evp.h:557)
  921.     ossl_pkey.c:197: warning: ‘EVP_VerifyFinal’ is deprecated (declared at /usr/include/openssl/evp.h:611)
  922.     /usr/bin/gcc -I. -I../.. -I../../. -I../.././ext/openssl -DRUBY_EXTCONF_H=\"extconf.h\" -I/opt/X11/include -D_XOPEN_SOURCE -D_DARWIN_C_SOURCE  -I/opt/X11/include -fno-common -g -O2  -fno-common -pipe -fno-common   -c ossl_pkey_dh.c
  923.     ossl_pkey_dh.c: In function ‘dh_instance’:
  924.     ossl_pkey_dh.c:49: warning: ‘EVP_PKEY_new’ is deprecated (declared at /usr/include/openssl/evp.h:884)
  925.     ossl_pkey_dh.c:52: warning: ‘EVP_PKEY_assign’ is deprecated (declared at /usr/include/openssl/evp.h:861)
  926.     ossl_pkey_dh.c:53: warning: ‘EVP_PKEY_free’ is deprecated (declared at /usr/include/openssl/evp.h:885)
  927.     ossl_pkey_dh.c:56: warning: ‘EVP_PKEY_free’ is deprecated (declared at /usr/include/openssl/evp.h:885)
  928.     ossl_pkey_dh.c: In function ‘ossl_dh_new’:
  929.     ossl_pkey_dh.c:67: warning: ‘DH_new’ is deprecated (declared at /usr/include/openssl/dh.h:184)
  930.     ossl_pkey_dh.c:69: warning: ‘EVP_PKEY_type’ is deprecated (declared at /usr/include/openssl/evp.h:858)
  931.     ossl_pkey_dh.c:72: warning: ‘EVP_PKEY_free’ is deprecated (declared at /usr/include/openssl/evp.h:885)
  932.     ossl_pkey_dh.c: In function ‘dh_generate’:
  933.     ossl_pkey_dh.c:94: warning: ‘DH_generate_key’ is deprecated (declared at /usr/include/openssl/dh.h:204)
  934.     ossl_pkey_dh.c:95: warning: ‘DH_free’ is deprecated (declared at /usr/include/openssl/dh.h:185)
  935.     ossl_pkey_dh.c: In function ‘ossl_dh_s_generate’:
  936.     ossl_pkey_dh.c:124: warning: ‘DH_free’ is deprecated (declared at /usr/include/openssl/dh.h:185)
  937.     ossl_pkey_dh.c: In function ‘ossl_dh_initialize’:
  938.     ossl_pkey_dh.c:157: warning: ‘DH_new’ is deprecated (declared at /usr/include/openssl/dh.h:184)
  939.     ossl_pkey_dh.c:172: warning: ‘BIO_ctrl’ is deprecated (declared at /usr/include/openssl/bio.h:590)
  940.     ossl_pkey_dh.c:173: warning: ‘ASN1_d2i_bio’ is deprecated (declared at /usr/include/openssl/asn1.h:984)
  941.     ossl_pkey_dh.c:173: warning: ‘DH_new’ is deprecated (declared at /usr/include/openssl/dh.h:184)
  942.     ossl_pkey_dh.c:173: warning: ‘d2i_DHparams’ is deprecated (declared at /usr/include/openssl/dh.h:206)
  943.     ossl_pkey_dh.c:175: warning: ‘BIO_free’ is deprecated (declared at /usr/include/openssl/bio.h:583)
  944.     ossl_pkey_dh.c:178: warning: ‘EVP_PKEY_assign’ is deprecated (declared at /usr/include/openssl/evp.h:861)
  945.     ossl_pkey_dh.c:179: warning: ‘DH_free’ is deprecated (declared at /usr/include/openssl/dh.h:185)
  946.     ossl_pkey_dh.c: In function ‘ossl_dh_is_public’:
  947.     ossl_pkey_dh.c:195: warning: ‘EVP_PKEY_type’ is deprecated (declared at /usr/include/openssl/evp.h:858)
  948.     ossl_pkey_dh.c: In function ‘ossl_dh_is_private’:
  949.     ossl_pkey_dh.c:210: warning: ‘EVP_PKEY_type’ is deprecated (declared at /usr/include/openssl/evp.h:858)
  950.     ossl_pkey_dh.c: In function ‘ossl_dh_export’:
  951.     ossl_pkey_dh.c:227: warning: ‘EVP_PKEY_type’ is deprecated (declared at /usr/include/openssl/evp.h:858)
  952.     ossl_pkey_dh.c:228: warning: ‘BIO_new’ is deprecated (declared at /usr/include/openssl/bio.h:581)
  953.     ossl_pkey_dh.c:228: warning: ‘BIO_s_mem’ is deprecated (declared at /usr/include/openssl/bio.h:616)
  954.     ossl_pkey_dh.c:232: warning: ‘BIO_free’ is deprecated (declared at /usr/include/openssl/bio.h:583)
  955.     ossl_pkey_dh.c: In function ‘ossl_dh_to_der’:
  956.     ossl_pkey_dh.c:253: warning: ‘EVP_PKEY_type’ is deprecated (declared at /usr/include/openssl/evp.h:858)
  957.     ossl_pkey_dh.c:254: warning: ‘i2d_DHparams’ is deprecated (declared at /usr/include/openssl/dh.h:207)
  958.     ossl_pkey_dh.c:258: warning: ‘i2d_DHparams’ is deprecated (declared at /usr/include/openssl/dh.h:207)
  959.     ossl_pkey_dh.c: In function ‘ossl_dh_get_params’:
  960.     ossl_pkey_dh.c:279: warning: ‘EVP_PKEY_type’ is deprecated (declared at /usr/include/openssl/evp.h:858)
  961.     ossl_pkey_dh.c: In function ‘ossl_dh_to_text’:
  962.     ossl_pkey_dh.c:306: warning: ‘EVP_PKEY_type’ is deprecated (declared at /usr/include/openssl/evp.h:858)
  963.     ossl_pkey_dh.c:307: warning: ‘BIO_new’ is deprecated (declared at /usr/include/openssl/bio.h:581)
  964.     ossl_pkey_dh.c:307: warning: ‘BIO_s_mem’ is deprecated (declared at /usr/include/openssl/bio.h:616)
  965.     ossl_pkey_dh.c:310: warning: ‘DHparams_print’ is deprecated (declared at /usr/include/openssl/dh.h:212)
  966.     ossl_pkey_dh.c:311: warning: ‘BIO_free’ is deprecated (declared at /usr/include/openssl/bio.h:583)
  967.     ossl_pkey_dh.c: In function ‘ossl_dh_to_public_key’:
  968.     ossl_pkey_dh.c:332: warning: ‘EVP_PKEY_type’ is deprecated (declared at /usr/include/openssl/evp.h:858)
  969.     ossl_pkey_dh.c:333: warning: ‘ASN1_dup’ is deprecated (declared at /usr/include/openssl/asn1.h:935)
  970.     ossl_pkey_dh.c:333: warning: ‘i2d_DHparams’ is deprecated (declared at /usr/include/openssl/dh.h:207)
  971.     ossl_pkey_dh.c:333: warning: ‘d2i_DHparams’ is deprecated (declared at /usr/include/openssl/dh.h:206)
  972.     ossl_pkey_dh.c:336: warning: ‘DH_free’ is deprecated (declared at /usr/include/openssl/dh.h:185)
  973.     ossl_pkey_dh.c: In function ‘ossl_dh_check_params’:
  974.     ossl_pkey_dh.c:355: warning: ‘EVP_PKEY_type’ is deprecated (declared at /usr/include/openssl/evp.h:858)
  975.     ossl_pkey_dh.c:358: warning: ‘DH_check’ is deprecated (declared at /usr/include/openssl/dh.h:202)
  976.     ossl_pkey_dh.c: In function ‘ossl_dh_generate_key’:
  977.     ossl_pkey_dh.c:376: warning: ‘EVP_PKEY_type’ is deprecated (declared at /usr/include/openssl/evp.h:858)
  978.     ossl_pkey_dh.c:379: warning: ‘DH_generate_key’ is deprecated (declared at /usr/include/openssl/dh.h:204)
  979.     ossl_pkey_dh.c: In function ‘ossl_dh_compute_key’:
  980.     ossl_pkey_dh.c:405: warning: ‘EVP_PKEY_type’ is deprecated (declared at /usr/include/openssl/evp.h:858)
  981.     ossl_pkey_dh.c:408: warning: ‘DH_size’ is deprecated (declared at /usr/include/openssl/dh.h:187)
  982.     ossl_pkey_dh.c:410: warning: ‘DH_compute_key’ is deprecated (declared at /usr/include/openssl/dh.h:205)
  983.     ossl_pkey_dh.c: In function ‘ossl_dh_set_p’:
  984.     ossl_pkey_dh.c:418: warning: ‘BN_clear_free’ is deprecated (declared at /usr/include/openssl/bn.h:419)
  985.     ossl_pkey_dh.c:418: warning: ‘BN_new’ is deprecated (declared at /usr/include/openssl/bn.h:417)
  986.     ossl_pkey_dh.c:418: warning: ‘BN_copy’ is deprecated (declared at /usr/include/openssl/bn.h:420)
  987.     ossl_pkey_dh.c: In function ‘ossl_dh_set_g’:
  988.     ossl_pkey_dh.c:419: warning: ‘BN_clear_free’ is deprecated (declared at /usr/include/openssl/bn.h:419)
  989.     ossl_pkey_dh.c:419: warning: ‘BN_new’ is deprecated (declared at /usr/include/openssl/bn.h:417)
  990.     ossl_pkey_dh.c:419: warning: ‘BN_copy’ is deprecated (declared at /usr/include/openssl/bn.h:420)
  991.     ossl_pkey_dh.c: In function ‘ossl_dh_set_pub_key’:
  992.     ossl_pkey_dh.c:420: warning: ‘BN_clear_free’ is deprecated (declared at /usr/include/openssl/bn.h:419)
  993.     ossl_pkey_dh.c:420: warning: ‘BN_new’ is deprecated (declared at /usr/include/openssl/bn.h:417)
  994.     ossl_pkey_dh.c:420: warning: ‘BN_copy’ is deprecated (declared at /usr/include/openssl/bn.h:420)
  995.     ossl_pkey_dh.c: In function ‘ossl_dh_set_priv_key’:
  996.     ossl_pkey_dh.c:421: warning: ‘BN_clear_free’ is deprecated (declared at /usr/include/openssl/bn.h:419)
  997.     ossl_pkey_dh.c:421: warning: ‘BN_new’ is deprecated (declared at /usr/include/openssl/bn.h:417)
  998.     ossl_pkey_dh.c:421: warning: ‘BN_copy’ is deprecated (declared at /usr/include/openssl/bn.h:420)
  999.     ossl_pkey_dh.c: In function ‘ossl_create_dh’:
  1000.     ossl_pkey_dh.c:475: warning: ‘DH_new’ is deprecated (declared at /usr/include/openssl/dh.h:184)
  1001.     ossl_pkey_dh.c:476: warning: ‘BN_bin2bn’ is deprecated (declared at /usr/include/openssl/bn.h:422)
  1002.     ossl_pkey_dh.c:477: warning: ‘BN_bin2bn’ is deprecated (declared at /usr/include/openssl/bn.h:422)
  1003.     ossl_pkey_dh.c:479: warning: ‘DH_free’ is deprecated (declared at /usr/include/openssl/dh.h:185)
  1004.     /usr/bin/gcc -I. -I../.. -I../../. -I../.././ext/openssl -DRUBY_EXTCONF_H=\"extconf.h\" -I/opt/X11/include -D_XOPEN_SOURCE -D_DARWIN_C_SOURCE  -I/opt/X11/include -fno-common -g -O2  -fno-common -pipe -fno-common   -c ossl_pkey_dsa.c
  1005.     ossl_pkey_dsa.c: In function ‘dsa_instance’:
  1006.     ossl_pkey_dsa.c:43: warning: ‘EVP_PKEY_new’ is deprecated (declared at /usr/include/openssl/evp.h:884)
  1007.     ossl_pkey_dsa.c:46: warning: ‘EVP_PKEY_assign’ is deprecated (declared at /usr/include/openssl/evp.h:861)
  1008.     ossl_pkey_dsa.c:47: warning: ‘EVP_PKEY_free’ is deprecated (declared at /usr/include/openssl/evp.h:885)
  1009.     ossl_pkey_dsa.c:50: warning: ‘EVP_PKEY_free’ is deprecated (declared at /usr/include/openssl/evp.h:885)
  1010.     ossl_pkey_dsa.c: In function ‘ossl_dsa_new’:
  1011.     ossl_pkey_dsa.c:61: warning: ‘DSA_new’ is deprecated (declared at /usr/include/openssl/dsa.h:220)
  1012.     ossl_pkey_dsa.c:63: warning: ‘EVP_PKEY_type’ is deprecated (declared at /usr/include/openssl/evp.h:858)
  1013.     ossl_pkey_dsa.c:66: warning: ‘EVP_PKEY_free’ is deprecated (declared at /usr/include/openssl/evp.h:885)
  1014.     ossl_pkey_dsa.c: In function ‘dsa_generate’:
  1015.     ossl_pkey_dsa.c:86: warning: ‘RAND_bytes’ is deprecated (declared at /usr/include/openssl/rand.h:104)
  1016.     ossl_pkey_dsa.c:89: warning: ‘DSA_generate_parameters’ is deprecated (declared at /usr/include/openssl/dsa.h:246)
  1017.     ossl_pkey_dsa.c:94: warning: ‘DSA_generate_key’ is deprecated (declared at /usr/include/openssl/dsa.h:254)
  1018.     ossl_pkey_dsa.c:95: warning: ‘DSA_free’ is deprecated (declared at /usr/include/openssl/dsa.h:222)
  1019.     ossl_pkey_dsa.c: In function ‘ossl_dsa_s_generate’:
  1020.     ossl_pkey_dsa.c:117: warning: ‘DSA_free’ is deprecated (declared at /usr/include/openssl/dsa.h:222)
  1021.     ossl_pkey_dsa.c: In function ‘ossl_dsa_initialize’:
  1022.     ossl_pkey_dsa.c:151: warning: ‘DSA_new’ is deprecated (declared at /usr/include/openssl/dsa.h:220)
  1023.     ossl_pkey_dsa.c:164: warning: ‘BIO_ctrl’ is deprecated (declared at /usr/include/openssl/bio.h:590)
  1024.     ossl_pkey_dsa.c:165: warning: ‘PEM_ASN1_read_bio’ is deprecated (declared at /usr/include/openssl/pem.h:585)
  1025.     ossl_pkey_dsa.c:165: warning: ‘d2i_DSAPublicKey’ is deprecated (declared at /usr/include/openssl/dsa.h:237)
  1026.     ossl_pkey_dsa.c:165: warning: passing argument 1 of ‘PEM_ASN1_read_bio’ from incompatible pointer type
  1027.     ossl_pkey_dsa.c:165: warning: passing argument 4 of ‘PEM_ASN1_read_bio’ from incompatible pointer type
  1028.     ossl_pkey_dsa.c:168: warning: ‘BIO_ctrl’ is deprecated (declared at /usr/include/openssl/bio.h:590)
  1029.     ossl_pkey_dsa.c:172: warning: ‘BIO_ctrl’ is deprecated (declared at /usr/include/openssl/bio.h:590)
  1030.     ossl_pkey_dsa.c:173: warning: ‘d2i_DSAPrivateKey_bio’ is deprecated (declared at /usr/include/openssl/x509.h:845)
  1031.     ossl_pkey_dsa.c:176: warning: ‘BIO_ctrl’ is deprecated (declared at /usr/include/openssl/bio.h:590)
  1032.     ossl_pkey_dsa.c:177: warning: ‘d2i_DSA_PUBKEY_bio’ is deprecated (declared at /usr/include/openssl/x509.h:843)
  1033.     ossl_pkey_dsa.c:179: warning: ‘BIO_free’ is deprecated (declared at /usr/include/openssl/bio.h:583)
  1034.     ossl_pkey_dsa.c:182: warning: ‘EVP_PKEY_assign’ is deprecated (declared at /usr/include/openssl/evp.h:861)
  1035.     ossl_pkey_dsa.c:183: warning: ‘DSA_free’ is deprecated (declared at /usr/include/openssl/dsa.h:222)
  1036.     ossl_pkey_dsa.c: In function ‘ossl_dsa_is_public’:
  1037.     ossl_pkey_dsa.c:200: warning: ‘EVP_PKEY_type’ is deprecated (declared at /usr/include/openssl/evp.h:858)
  1038.     ossl_pkey_dsa.c: In function ‘ossl_dsa_is_private’:
  1039.     ossl_pkey_dsa.c:215: warning: ‘EVP_PKEY_type’ is deprecated (declared at /usr/include/openssl/evp.h:858)
  1040.     ossl_pkey_dsa.c: In function ‘ossl_dsa_export’:
  1041.     ossl_pkey_dsa.c:242: warning: ‘EVP_PKEY_type’ is deprecated (declared at /usr/include/openssl/evp.h:858)
  1042.     ossl_pkey_dsa.c:250: warning: ‘BIO_new’ is deprecated (declared at /usr/include/openssl/bio.h:581)
  1043.     ossl_pkey_dsa.c:250: warning: ‘BIO_s_mem’ is deprecated (declared at /usr/include/openssl/bio.h:616)
  1044.     ossl_pkey_dsa.c:256: warning: ‘BIO_free’ is deprecated (declared at /usr/include/openssl/bio.h:583)
  1045.     ossl_pkey_dsa.c:260: warning: ‘PEM_ASN1_write_bio’ is deprecated (declared at /usr/include/openssl/pem.h:595)
  1046.     ossl_pkey_dsa.c:260: warning: ‘i2d_DSAPublicKey’ is deprecated (declared at /usr/include/openssl/dsa.h:255)
  1047.     ossl_pkey_dsa.c:261: warning: ‘BIO_free’ is deprecated (declared at /usr/include/openssl/bio.h:583)
  1048.     ossl_pkey_dsa.c: In function ‘ossl_dsa_to_der’:
  1049.     ossl_pkey_dsa.c:284: warning: ‘EVP_PKEY_type’ is deprecated (declared at /usr/include/openssl/evp.h:858)
  1050.     ossl_pkey_dsa.c:286: warning: ‘i2d_DSAPrivateKey’ is deprecated (declared at /usr/include/openssl/dsa.h:256)
  1051.     ossl_pkey_dsa.c:288: warning: ‘i2d_DSA_PUBKEY’ is deprecated (declared at /usr/include/openssl/x509.h:915)
  1052.     ossl_pkey_dsa.c: In function ‘ossl_dsa_get_params’:
  1053.     ossl_pkey_dsa.c:314: warning: ‘EVP_PKEY_type’ is deprecated (declared at /usr/include/openssl/evp.h:858)
  1054.     ossl_pkey_dsa.c: In function ‘ossl_dsa_to_text’:
  1055.     ossl_pkey_dsa.c:342: warning: ‘EVP_PKEY_type’ is deprecated (declared at /usr/include/openssl/evp.h:858)
  1056.     ossl_pkey_dsa.c:343: warning: ‘BIO_new’ is deprecated (declared at /usr/include/openssl/bio.h:581)
  1057.     ossl_pkey_dsa.c:343: warning: ‘BIO_s_mem’ is deprecated (declared at /usr/include/openssl/bio.h:616)
  1058.     ossl_pkey_dsa.c:346: warning: ‘DSA_print’ is deprecated (declared at /usr/include/openssl/dsa.h:261)
  1059.     ossl_pkey_dsa.c:347: warning: ‘BIO_free’ is deprecated (declared at /usr/include/openssl/bio.h:583)
  1060.     ossl_pkey_dsa.c: In function ‘ossl_dsa_to_public_key’:
  1061.     ossl_pkey_dsa.c:368: warning: ‘EVP_PKEY_type’ is deprecated (declared at /usr/include/openssl/evp.h:858)
  1062.     ossl_pkey_dsa.c:370: warning: ‘ASN1_dup’ is deprecated (declared at /usr/include/openssl/asn1.h:935)
  1063.     ossl_pkey_dsa.c:370: warning: ‘i2d_DSAPublicKey’ is deprecated (declared at /usr/include/openssl/dsa.h:255)
  1064.     ossl_pkey_dsa.c:370: warning: ‘d2i_DSAPublicKey’ is deprecated (declared at /usr/include/openssl/dsa.h:237)
  1065.     ossl_pkey_dsa.c:370: warning: passing argument 2 of ‘ASN1_dup’ from incompatible pointer type
  1066.     ossl_pkey_dsa.c:373: warning: ‘DSA_free’ is deprecated (declared at /usr/include/openssl/dsa.h:222)
  1067.     ossl_pkey_dsa.c: In function ‘ossl_dsa_sign’:
  1068.     ossl_pkey_dsa.c:393: warning: ‘EVP_PKEY_type’ is deprecated (declared at /usr/include/openssl/evp.h:858)
  1069.     ossl_pkey_dsa.c:398: warning: ‘DSA_size’ is deprecated (declared at /usr/include/openssl/dsa.h:225)
  1070.     ossl_pkey_dsa.c:399: warning: ‘DSA_sign’ is deprecated (declared at /usr/include/openssl/dsa.h:229)
  1071.     ossl_pkey_dsa.c: In function ‘ossl_dsa_verify’:
  1072.     ossl_pkey_dsa.c:419: warning: ‘EVP_PKEY_type’ is deprecated (declared at /usr/include/openssl/evp.h:858)
  1073.     ossl_pkey_dsa.c:423: warning: ‘DSA_verify’ is deprecated (declared at /usr/include/openssl/dsa.h:231)
  1074.     ossl_pkey_dsa.c: In function ‘ossl_dsa_set_p’:
  1075.     ossl_pkey_dsa.c:435: warning: ‘BN_clear_free’ is deprecated (declared at /usr/include/openssl/bn.h:419)
  1076.     ossl_pkey_dsa.c:435: warning: ‘BN_new’ is deprecated (declared at /usr/include/openssl/bn.h:417)
  1077.     ossl_pkey_dsa.c:435: warning: ‘BN_copy’ is deprecated (declared at /usr/include/openssl/bn.h:420)
  1078.     ossl_pkey_dsa.c: In function ‘ossl_dsa_set_q’:
  1079.     ossl_pkey_dsa.c:436: warning: ‘BN_clear_free’ is deprecated (declared at /usr/include/openssl/bn.h:419)
  1080.     ossl_pkey_dsa.c:436: warning: ‘BN_new’ is deprecated (declared at /usr/include/openssl/bn.h:417)
  1081.     ossl_pkey_dsa.c:436: warning: ‘BN_copy’ is deprecated (declared at /usr/include/openssl/bn.h:420)
  1082.     ossl_pkey_dsa.c: In function ‘ossl_dsa_set_g’:
  1083.     ossl_pkey_dsa.c:437: warning: ‘BN_clear_free’ is deprecated (declared at /usr/include/openssl/bn.h:419)
  1084.     ossl_pkey_dsa.c:437: warning: ‘BN_new’ is deprecated (declared at /usr/include/openssl/bn.h:417)
  1085.     ossl_pkey_dsa.c:437: warning: ‘BN_copy’ is deprecated (declared at /usr/include/openssl/bn.h:420)
  1086.     ossl_pkey_dsa.c: In function ‘ossl_dsa_set_pub_key’:
  1087.     ossl_pkey_dsa.c:438: warning: ‘BN_clear_free’ is deprecated (declared at /usr/include/openssl/bn.h:419)
  1088.     ossl_pkey_dsa.c:438: warning: ‘BN_new’ is deprecated (declared at /usr/include/openssl/bn.h:417)
  1089.     ossl_pkey_dsa.c:438: warning: ‘BN_copy’ is deprecated (declared at /usr/include/openssl/bn.h:420)
  1090.     ossl_pkey_dsa.c: In function ‘ossl_dsa_set_priv_key’:
  1091.     ossl_pkey_dsa.c:439: warning: ‘BN_clear_free’ is deprecated (declared at /usr/include/openssl/bn.h:419)
  1092.     ossl_pkey_dsa.c:439: warning: ‘BN_new’ is deprecated (declared at /usr/include/openssl/bn.h:417)
  1093.     ossl_pkey_dsa.c:439: warning: ‘BN_copy’ is deprecated (declared at /usr/include/openssl/bn.h:420)
  1094.     /usr/bin/gcc -I. -I../.. -I../../. -I../.././ext/openssl -DRUBY_EXTCONF_H=\"extconf.h\" -I/opt/X11/include -D_XOPEN_SOURCE -D_DARWIN_C_SOURCE  -I/opt/X11/include -fno-common -g -O2  -fno-common -pipe -fno-common   -c ossl_pkey_ec.c
  1095.     ossl_pkey_ec.c: In function ‘ec_instance’:
  1096.     ossl_pkey_ec.c:117: warning: ‘EVP_PKEY_new’ is deprecated (declared at /usr/include/openssl/evp.h:884)
  1097.     ossl_pkey_ec.c:120: warning: ‘EVP_PKEY_assign’ is deprecated (declared at /usr/include/openssl/evp.h:861)
  1098.     ossl_pkey_ec.c:121: warning: ‘EVP_PKEY_free’ is deprecated (declared at /usr/include/openssl/evp.h:885)
  1099.     ossl_pkey_ec.c:124: warning: ‘EVP_PKEY_free’ is deprecated (declared at /usr/include/openssl/evp.h:885)
  1100.     ossl_pkey_ec.c: In function ‘ossl_ec_new’:
  1101.     ossl_pkey_ec.c:134: warning: ‘EC_KEY_new’ is deprecated (declared at /usr/include/openssl/ec.h:305)
  1102.     ossl_pkey_ec.c:136: warning: ‘EVP_PKEY_type’ is deprecated (declared at /usr/include/openssl/evp.h:858)
  1103.     ossl_pkey_ec.c:139: warning: ‘EVP_PKEY_free’ is deprecated (declared at /usr/include/openssl/evp.h:885)
  1104.     ossl_pkey_ec.c: In function ‘ossl_ec_key_initialize’:
  1105.     ossl_pkey_ec.c:174: warning: ‘EC_KEY_new’ is deprecated (declared at /usr/include/openssl/ec.h:305)
  1106.     ossl_pkey_ec.c:179: warning: ‘EVP_PKEY_type’ is deprecated (declared at /usr/include/openssl/evp.h:858)
  1107.     ossl_pkey_ec.c:180: warning: ‘EC_KEY_dup’ is deprecated (declared at /usr/include/openssl/ec.h:309)
  1108.     ossl_pkey_ec.c:182: warning: ‘EC_KEY_new’ is deprecated (declared at /usr/include/openssl/ec.h:305)
  1109.     ossl_pkey_ec.c:189: warning: ‘BIO_ctrl’ is deprecated (declared at /usr/include/openssl/bio.h:590)
  1110.     ossl_pkey_ec.c:193: warning: ‘BIO_ctrl’ is deprecated (declared at /usr/include/openssl/bio.h:590)
  1111.     ossl_pkey_ec.c:194: warning: ‘d2i_ECPrivateKey_bio’ is deprecated (declared at /usr/include/openssl/x509.h:851)
  1112.     ossl_pkey_ec.c:197: warning: ‘BIO_ctrl’ is deprecated (declared at /usr/include/openssl/bio.h:590)
  1113.     ossl_pkey_ec.c:198: warning: ‘d2i_EC_PUBKEY_bio’ is deprecated (declared at /usr/include/openssl/x509.h:849)
  1114.     ossl_pkey_ec.c:201: warning: ‘BIO_free’ is deprecated (declared at /usr/include/openssl/bio.h:583)
  1115.     ossl_pkey_ec.c:205: warning: ‘OBJ_sn2nid’ is deprecated (declared at /usr/include/openssl/objects.h:1014)
  1116.     ossl_pkey_ec.c:210: warning: ‘EC_KEY_new_by_curve_name’ is deprecated (declared at /usr/include/openssl/ec.h:306)
  1117.     ossl_pkey_ec.c:213: warning: ‘EC_KEY_set_asn1_flag’ is deprecated (declared at /usr/include/openssl/ec.h:329)
  1118.     ossl_pkey_ec.c:214: warning: ‘EC_KEY_set_conv_form’ is deprecated (declared at /usr/include/openssl/ec.h:322)
  1119.     ossl_pkey_ec.c:222: warning: ‘EVP_PKEY_assign’ is deprecated (declared at /usr/include/openssl/evp.h:861)
  1120.     ossl_pkey_ec.c:223: warning: ‘EC_KEY_free’ is deprecated (declared at /usr/include/openssl/ec.h:307)
  1121.     ossl_pkey_ec.c: In function ‘ossl_ec_key_get_group’:
  1122.     ossl_pkey_ec.c:249: warning: ‘EVP_PKEY_type’ is deprecated (declared at /usr/include/openssl/evp.h:858)
  1123.     ossl_pkey_ec.c:255: warning: ‘EC_KEY_get0_group’ is deprecated (declared at /usr/include/openssl/ec.h:313)
  1124.     ossl_pkey_ec.c: In function ‘ossl_ec_key_set_group’:
  1125.     ossl_pkey_ec.c:290: warning: ‘EVP_PKEY_type’ is deprecated (declared at /usr/include/openssl/evp.h:858)
  1126.     ossl_pkey_ec.c:305: warning: ‘EC_KEY_set_group’ is deprecated (declared at /usr/include/openssl/ec.h:314)
  1127.     ossl_pkey_ec.c: In function ‘ossl_ec_key_get_private_key’:
  1128.     ossl_pkey_ec.c:322: warning: ‘EVP_PKEY_type’ is deprecated (declared at /usr/include/openssl/evp.h:858)
  1129.     ossl_pkey_ec.c:324: warning: ‘EC_KEY_get0_private_key’ is deprecated (declared at /usr/include/openssl/ec.h:315)
  1130.     ossl_pkey_ec.c: In function ‘ossl_ec_key_set_private_key’:
  1131.     ossl_pkey_ec.c:341: warning: ‘EVP_PKEY_type’ is deprecated (declared at /usr/include/openssl/evp.h:858)
  1132.     ossl_pkey_ec.c:345: warning: ‘EC_KEY_set_private_key’ is deprecated (declared at /usr/include/openssl/ec.h:316)
  1133.     ossl_pkey_ec.c: In function ‘ossl_ec_point_dup’:
  1134.     ossl_pkey_ec.c:370: warning: ‘EC_POINT_dup’ is deprecated (declared at /usr/include/openssl/ec.h:208)
  1135.     ossl_pkey_ec.c: In function ‘ossl_ec_key_get_public_key’:
  1136.     ossl_pkey_ec.c:390: warning: ‘EVP_PKEY_type’ is deprecated (declared at /usr/include/openssl/evp.h:858)
  1137.     ossl_pkey_ec.c:392: warning: ‘EC_KEY_get0_public_key’ is deprecated (declared at /usr/include/openssl/ec.h:317)
  1138.     ossl_pkey_ec.c: In function ‘ossl_ec_key_set_public_key’:
  1139.     ossl_pkey_ec.c:413: warning: ‘EVP_PKEY_type’ is deprecated (declared at /usr/include/openssl/evp.h:858)
  1140.     ossl_pkey_ec.c:417: warning: ‘EC_KEY_set_public_key’ is deprecated (declared at /usr/include/openssl/ec.h:318)
  1141.     ossl_pkey_ec.c: In function ‘ossl_ec_key_is_public_key’:
  1142.     ossl_pkey_ec.c:440: warning: ‘EVP_PKEY_type’ is deprecated (declared at /usr/include/openssl/evp.h:858)
  1143.     ossl_pkey_ec.c:442: warning: ‘EC_KEY_get0_public_key’ is deprecated (declared at /usr/include/openssl/ec.h:317)
  1144.     ossl_pkey_ec.c: In function ‘ossl_ec_key_is_private_key’:
  1145.     ossl_pkey_ec.c:455: warning: ‘EVP_PKEY_type’ is deprecated (declared at /usr/include/openssl/evp.h:858)
  1146.     ossl_pkey_ec.c:457: warning: ‘EC_KEY_get0_private_key’ is deprecated (declared at /usr/include/openssl/ec.h:315)
  1147.     ossl_pkey_ec.c: In function ‘ossl_ec_key_to_string’:
  1148.     ossl_pkey_ec.c:472: warning: ‘EVP_PKEY_type’ is deprecated (declared at /usr/include/openssl/evp.h:858)
  1149.     ossl_pkey_ec.c:474: warning: ‘EC_KEY_get0_public_key’ is deprecated (declared at /usr/include/openssl/ec.h:317)
  1150.     ossl_pkey_ec.c:477: warning: ‘EC_KEY_check_key’ is deprecated (declared at /usr/include/openssl/ec.h:335)
  1151.     ossl_pkey_ec.c:480: warning: ‘EC_KEY_get0_private_key’ is deprecated (declared at /usr/include/openssl/ec.h:315)
  1152.     ossl_pkey_ec.c:483: warning: ‘BIO_new’ is deprecated (declared at /usr/include/openssl/bio.h:581)
  1153.     ossl_pkey_ec.c:483: warning: ‘BIO_s_mem’ is deprecated (declared at /usr/include/openssl/bio.h:616)
  1154.     ossl_pkey_ec.c:513: warning: ‘i2d_ECPrivateKey_bio’ is deprecated (declared at /usr/include/openssl/x509.h:852)
  1155.     ossl_pkey_ec.c:520: warning: ‘i2d_EC_PUBKEY_bio’ is deprecated (declared at /usr/include/openssl/x509.h:850)
  1156.     ossl_pkey_ec.c:525: warning: ‘BIO_free’ is deprecated (declared at /usr/include/openssl/bio.h:583)
  1157.     ossl_pkey_ec.c:530: warning: ‘BIO_free’ is deprecated (declared at /usr/include/openssl/bio.h:583)
  1158.     ossl_pkey_ec.c: In function ‘ossl_ec_key_to_text’:
  1159.     ossl_pkey_ec.c:573: warning: ‘EVP_PKEY_type’ is deprecated (declared at /usr/include/openssl/evp.h:858)
  1160.     ossl_pkey_ec.c:574: warning: ‘BIO_new’ is deprecated (declared at /usr/include/openssl/bio.h:581)
  1161.     ossl_pkey_ec.c:574: warning: ‘BIO_s_mem’ is deprecated (declared at /usr/include/openssl/bio.h:616)
  1162.     ossl_pkey_ec.c:577: warning: ‘EC_KEY_print’ is deprecated (declared at /usr/include/openssl/ec.h:350)
  1163.     ossl_pkey_ec.c:578: warning: ‘BIO_free’ is deprecated (declared at /usr/include/openssl/bio.h:583)
  1164.     ossl_pkey_ec.c: In function ‘ossl_ec_key_generate_key’:
  1165.     ossl_pkey_ec.c:596: warning: ‘EVP_PKEY_type’ is deprecated (declared at /usr/include/openssl/evp.h:858)
  1166.     ossl_pkey_ec.c:598: warning: ‘EC_KEY_generate_key’ is deprecated (declared at /usr/include/openssl/ec.h:333)
  1167.     ossl_pkey_ec.c: In function ‘ossl_ec_key_check_key’:
  1168.     ossl_pkey_ec.c:616: warning: ‘EVP_PKEY_type’ is deprecated (declared at /usr/include/openssl/evp.h:858)
  1169.     ossl_pkey_ec.c:618: warning: ‘EC_KEY_check_key’ is deprecated (declared at /usr/include/openssl/ec.h:335)
  1170.     ossl_pkey_ec.c: In function ‘ossl_ec_key_dh_compute_key’:
  1171.     ossl_pkey_ec.c:637: warning: ‘EVP_PKEY_type’ is deprecated (declared at /usr/include/openssl/evp.h:858)
  1172.     ossl_pkey_ec.c:644: warning: ‘ECDH_compute_key’ is deprecated (declared at /usr/include/openssl/ecdh.h:97)
  1173.     ossl_pkey_ec.c: In function ‘ossl_ec_key_dsa_sign_asn1’:
  1174.     ossl_pkey_ec.c:667: warning: ‘EVP_PKEY_type’ is deprecated (declared at /usr/include/openssl/evp.h:858)
  1175.     ossl_pkey_ec.c:670: warning: ‘EC_KEY_get0_private_key’ is deprecated (declared at /usr/include/openssl/ec.h:315)
  1176.     ossl_pkey_ec.c:673: warning: ‘ECDSA_size’ is deprecated (declared at /usr/include/openssl/ecdsa.h:180)
  1177.     ossl_pkey_ec.c:674: warning: ‘ECDSA_sign’ is deprecated (declared at /usr/include/openssl/ecdsa.h:205)
  1178.     ossl_pkey_ec.c: In function ‘ossl_ec_key_dsa_verify_asn1’:
  1179.     ossl_pkey_ec.c:692: warning: ‘EVP_PKEY_type’ is deprecated (declared at /usr/include/openssl/evp.h:858)
  1180.     ossl_pkey_ec.c:696: warning: ‘ECDSA_verify’ is deprecated (declared at /usr/include/openssl/ecdsa.h:238)
  1181.     ossl_pkey_ec.c: In function ‘ossl_ec_group_free’:
  1182.     ossl_pkey_ec.c:708: warning: ‘EC_GROUP_clear_free’ is deprecated (declared at /usr/include/openssl/ec.h:140)
  1183.     ossl_pkey_ec.c: In function ‘ossl_ec_group_initialize’:
  1184.     ossl_pkey_ec.c:755: warning: ‘EC_GFp_simple_method’ is deprecated (declared at /usr/include/openssl/ec.h:129)
  1185.     ossl_pkey_ec.c:757: warning: ‘EC_GFp_mont_method’ is deprecated (declared at /usr/include/openssl/ec.h:130)
  1186.     ossl_pkey_ec.c:759: warning: ‘EC_GFp_nist_method’ is deprecated (declared at /usr/include/openssl/ec.h:131)
  1187.     ossl_pkey_ec.c:761: warning: ‘EC_GF2m_simple_method’ is deprecated (declared at /usr/include/openssl/ec.h:135)
  1188.     ossl_pkey_ec.c:765: warning: ‘EC_GROUP_new’ is deprecated (declared at /usr/include/openssl/ec.h:138)
  1189.     ossl_pkey_ec.c:774: warning: ‘EC_GROUP_dup’ is deprecated (declared at /usr/include/openssl/ec.h:142)
  1190.     ossl_pkey_ec.c:781: warning: ‘BIO_ctrl’ is deprecated (declared at /usr/include/openssl/bio.h:590)
  1191.     ossl_pkey_ec.c:782: warning: ‘ASN1_d2i_bio’ is deprecated (declared at /usr/include/openssl/asn1.h:984)
  1192.     ossl_pkey_ec.c:782: warning: ‘d2i_ECPKParameters’ is deprecated (declared at /usr/include/openssl/ec.h:281)
  1193.     ossl_pkey_ec.c:785: warning: ‘BIO_free’ is deprecated (declared at /usr/include/openssl/bio.h:583)
  1194.     ossl_pkey_ec.c:789: warning: ‘OBJ_sn2nid’ is deprecated (declared at /usr/include/openssl/objects.h:1014)
  1195.     ossl_pkey_ec.c:794: warning: ‘EC_GROUP_new_by_curve_name’ is deprecated (declared at /usr/include/openssl/ec.h:189)
  1196.     ossl_pkey_ec.c:798: warning: ‘EC_GROUP_set_asn1_flag’ is deprecated (declared at /usr/include/openssl/ec.h:155)
  1197.     ossl_pkey_ec.c:799: warning: ‘EC_GROUP_set_point_conversion_form’ is deprecated (declared at /usr/include/openssl/ec.h:158)
  1198.     ossl_pkey_ec.c:813: warning: ‘EC_GROUP_new_curve_GFp’ is deprecated (declared at /usr/include/openssl/ec.h:184)
  1199.     ossl_pkey_ec.c:815: warning: ‘EC_GROUP_new_curve_GF2m’ is deprecated (declared at /usr/include/openssl/ec.h:185)
  1200.     ossl_pkey_ec.c: In function ‘ossl_ec_group_eql’:
  1201.     ossl_pkey_ec.c:850: warning: ‘EC_GROUP_cmp’ is deprecated (declared at /usr/include/openssl/ec.h:180)
  1202.     ossl_pkey_ec.c: In function ‘ossl_ec_group_get_generator’:
  1203.     ossl_pkey_ec.c:868: warning: ‘EC_GROUP_get0_generator’ is deprecated (declared at /usr/include/openssl/ec.h:148)
  1204.     ossl_pkey_ec.c: In function ‘ossl_ec_group_set_generator’:
  1205.     ossl_pkey_ec.c:889: warning: ‘EC_GROUP_set_generator’ is deprecated (declared at /usr/include/openssl/ec.h:147)
  1206.     ossl_pkey_ec.c: In function ‘ossl_ec_group_get_order’:
  1207.     ossl_pkey_ec.c:911: warning: ‘EC_GROUP_get_order’ is deprecated (declared at /usr/include/openssl/ec.h:149)
  1208.     ossl_pkey_ec.c: In function ‘ossl_ec_group_get_cofactor’:
  1209.     ossl_pkey_ec.c:933: warning: ‘EC_GROUP_get_cofactor’ is deprecated (declared at /usr/include/openssl/ec.h:150)
  1210.     ossl_pkey_ec.c: In function ‘ossl_ec_group_get_curve_name’:
  1211.     ossl_pkey_ec.c:953: warning: ‘EC_GROUP_get_curve_name’ is deprecated (declared at /usr/include/openssl/ec.h:153)
  1212.     ossl_pkey_ec.c:956: warning: ‘OBJ_nid2sn’ is deprecated (declared at /usr/include/openssl/objects.h:1008)
  1213.     ossl_pkey_ec.c: In function ‘ossl_s_builtin_curves’:
  1214.     ossl_pkey_ec.c:968: warning: ‘EC_get_builtin_curves’ is deprecated (declared at /usr/include/openssl/ec.h:199)
  1215.     ossl_pkey_ec.c:974: warning: ‘EC_get_builtin_curves’ is deprecated (declared at /usr/include/openssl/ec.h:199)
  1216.     ossl_pkey_ec.c:980: warning: ‘OBJ_nid2sn’ is deprecated (declared at /usr/include/openssl/objects.h:1008)
  1217.     ossl_pkey_ec.c: In function ‘ossl_ec_group_get_asn1_flag’:
  1218.     ossl_pkey_ec.c:1004: warning: ‘EC_GROUP_get_asn1_flag’ is deprecated (declared at /usr/include/openssl/ec.h:156)
  1219.     ossl_pkey_ec.c: In function ‘ossl_ec_group_set_asn1_flag’:
  1220.     ossl_pkey_ec.c:1020: warning: ‘EC_GROUP_set_asn1_flag’ is deprecated (declared at /usr/include/openssl/ec.h:155)
  1221.     ossl_pkey_ec.c: In function ‘ossl_ec_group_get_point_conversion_form’:
  1222.     ossl_pkey_ec.c:1038: warning: ‘EC_GROUP_get_point_conversion_form’ is deprecated (declared at /usr/include/openssl/ec.h:159)
  1223.     ossl_pkey_ec.c: In function ‘ossl_ec_group_set_point_conversion_form’:
  1224.     ossl_pkey_ec.c:1073: warning: ‘EC_GROUP_set_point_conversion_form’ is deprecated (declared at /usr/include/openssl/ec.h:158)
  1225.     ossl_pkey_ec.c: In function ‘ossl_ec_group_get_seed’:
  1226.     ossl_pkey_ec.c:1090: warning: ‘EC_GROUP_get_seed_len’ is deprecated (declared at /usr/include/openssl/ec.h:162)
  1227.     ossl_pkey_ec.c:1095: warning: ‘EC_GROUP_get0_seed’ is deprecated (declared at /usr/include/openssl/ec.h:161)
  1228.     ossl_pkey_ec.c: In function ‘ossl_ec_group_set_seed’:
  1229.     ossl_pkey_ec.c:1110: warning: ‘EC_GROUP_set_seed’ is deprecated (declared at /usr/include/openssl/ec.h:163)
  1230.     ossl_pkey_ec.c: In function ‘ossl_ec_group_get_degree’:
  1231.     ossl_pkey_ec.c:1129: warning: ‘EC_GROUP_get_degree’ is deprecated (declared at /usr/include/openssl/ec.h:171)
  1232.     ossl_pkey_ec.c: In function ‘ossl_ec_group_to_string’:
  1233.     ossl_pkey_ec.c:1141: warning: ‘BIO_new’ is deprecated (declared at /usr/include/openssl/bio.h:581)
  1234.     ossl_pkey_ec.c:1141: warning: ‘BIO_s_mem’ is deprecated (declared at /usr/include/openssl/bio.h:616)
  1235.     ossl_pkey_ec.c:1149: warning: ‘ASN1_i2d_bio’ is deprecated (declared at /usr/include/openssl/asn1.h:993)
  1236.     ossl_pkey_ec.c:1149: warning: ‘i2d_ECPKParameters’ is deprecated (declared at /usr/include/openssl/ec.h:282)
  1237.     ossl_pkey_ec.c:1152: warning: ‘BIO_free’ is deprecated (declared at /usr/include/openssl/bio.h:583)
  1238.     ossl_pkey_ec.c:1157: warning: ‘BIO_free’ is deprecated (declared at /usr/include/openssl/bio.h:583)
  1239.     ossl_pkey_ec.c: In function ‘ossl_ec_group_to_text’:
  1240.     ossl_pkey_ec.c:1198: warning: ‘BIO_new’ is deprecated (declared at /usr/include/openssl/bio.h:581)
  1241.     ossl_pkey_ec.c:1198: warning: ‘BIO_s_mem’ is deprecated (declared at /usr/include/openssl/bio.h:616)
  1242.     ossl_pkey_ec.c:1201: warning: ‘ECPKParameters_print’ is deprecated (declared at /usr/include/openssl/ec.h:292)
  1243.     ossl_pkey_ec.c:1202: warning: ‘BIO_free’ is deprecated (declared at /usr/include/openssl/bio.h:583)
  1244.     ossl_pkey_ec.c: In function ‘ossl_ec_point_free’:
  1245.     ossl_pkey_ec.c:1214: warning: ‘EC_POINT_clear_free’ is deprecated (declared at /usr/include/openssl/ec.h:206)
  1246.     ossl_pkey_ec.c: In function ‘ossl_ec_point_initialize’:
  1247.     ossl_pkey_ec.c:1257: warning: ‘EC_POINT_dup’ is deprecated (declared at /usr/include/openssl/ec.h:208)
  1248.     ossl_pkey_ec.c:1262: warning: ‘EC_POINT_new’ is deprecated (declared at /usr/include/openssl/ec.h:204)
  1249.     ossl_pkey_ec.c:1277: warning: ‘EC_POINT_bn2point’ is deprecated (declared at /usr/include/openssl/ec.h:240)
  1250.     ossl_pkey_ec.c:1283: warning: ‘BIO_free’ is deprecated (declared at /usr/include/openssl/bio.h:583)
  1251.     ossl_pkey_ec.c: In function ‘ossl_ec_point_eql’:
  1252.     ossl_pkey_ec.c:1326: warning: ‘EC_POINT_cmp’ is deprecated (declared at /usr/include/openssl/ec.h:252)
  1253.     ossl_pkey_ec.c: In function ‘ossl_ec_point_is_at_infinity’:
  1254.     ossl_pkey_ec.c:1346: warning: ‘EC_POINT_is_at_infinity’ is deprecated (declared at /usr/include/openssl/ec.h:250)
  1255.     ossl_pkey_ec.c: In function ‘ossl_ec_point_is_on_curve’:
  1256.     ossl_pkey_ec.c:1367: warning: ‘EC_POINT_is_on_curve’ is deprecated (declared at /usr/include/openssl/ec.h:251)
  1257.     ossl_pkey_ec.c: In function ‘ossl_ec_point_make_affine’:
  1258.     ossl_pkey_ec.c:1388: warning: ‘EC_POINT_make_affine’ is deprecated (declared at /usr/include/openssl/ec.h:254)
  1259.     ossl_pkey_ec.c: In function ‘ossl_ec_point_invert’:
  1260.     ossl_pkey_ec.c:1408: warning: ‘EC_POINT_invert’ is deprecated (declared at /usr/include/openssl/ec.h:248)
  1261.     ossl_pkey_ec.c: In function ‘ossl_ec_point_set_to_infinity’:
  1262.     ossl_pkey_ec.c:1428: warning: ‘EC_POINT_set_to_infinity’ is deprecated (declared at /usr/include/openssl/ec.h:212)
  1263.     ossl_pkey_ec.c: In function ‘ossl_ec_point_to_bn’:
  1264.     ossl_pkey_ec.c:1452: warning: ‘EC_GROUP_get_point_conversion_form’ is deprecated (declared at /usr/include/openssl/ec.h:159)
  1265.     ossl_pkey_ec.c:1457: warning: ‘EC_POINT_point2bn’ is deprecated (declared at /usr/include/openssl/ec.h:238)
  1266.     /usr/bin/gcc -I. -I../.. -I../../. -I../.././ext/openssl -DRUBY_EXTCONF_H=\"extconf.h\" -I/opt/X11/include -D_XOPEN_SOURCE -D_DARWIN_C_SOURCE  -I/opt/X11/include -fno-common -g -O2  -fno-common -pipe -fno-common   -c ossl_pkey_rsa.c
  1267.     ossl_pkey_rsa.c: In function ‘rsa_instance’:
  1268.     ossl_pkey_rsa.c:43: warning: ‘EVP_PKEY_new’ is deprecated (declared at /usr/include/openssl/evp.h:884)
  1269.     ossl_pkey_rsa.c:46: warning: ‘EVP_PKEY_assign’ is deprecated (declared at /usr/include/openssl/evp.h:861)
  1270.     ossl_pkey_rsa.c:47: warning: ‘EVP_PKEY_free’ is deprecated (declared at /usr/include/openssl/evp.h:885)
  1271.     ossl_pkey_rsa.c:50: warning: ‘EVP_PKEY_free’ is deprecated (declared at /usr/include/openssl/evp.h:885)
  1272.     ossl_pkey_rsa.c: In function ‘ossl_rsa_new’:
  1273.     ossl_pkey_rsa.c:61: warning: ‘RSA_new’ is deprecated (declared at /usr/include/openssl/rsa.h:254)
  1274.     ossl_pkey_rsa.c:64: warning: ‘EVP_PKEY_type’ is deprecated (declared at /usr/include/openssl/evp.h:858)
  1275.     ossl_pkey_rsa.c:67: warning: ‘EVP_PKEY_free’ is deprecated (declared at /usr/include/openssl/evp.h:885)
  1276.     ossl_pkey_rsa.c: In function ‘rsa_generate’:
  1277.     ossl_pkey_rsa.c:82: warning: ‘RSA_generate_key’ is deprecated (declared at /usr/include/openssl/rsa.h:261)
  1278.     ossl_pkey_rsa.c: In function ‘ossl_rsa_s_generate’:
  1279.     ossl_pkey_rsa.c:110: warning: ‘RSA_free’ is deprecated (declared at /usr/include/openssl/rsa.h:282)
  1280.     ossl_pkey_rsa.c: In function ‘ossl_rsa_initialize’:
  1281.     ossl_pkey_rsa.c:142: warning: ‘RSA_new’ is deprecated (declared at /usr/include/openssl/rsa.h:254)
  1282.     ossl_pkey_rsa.c:154: warning: ‘BIO_ctrl’ is deprecated (declared at /usr/include/openssl/bio.h:590)
  1283.     ossl_pkey_rsa.c:158: warning: ‘BIO_ctrl’ is deprecated (declared at /usr/include/openssl/bio.h:590)
  1284.     ossl_pkey_rsa.c:162: warning: ‘BIO_ctrl’ is deprecated (declared at /usr/include/openssl/bio.h:590)
  1285.     ossl_pkey_rsa.c:163: warning: ‘d2i_RSAPrivateKey_bio’ is deprecated (declared at /usr/include/openssl/x509.h:835)
  1286.     ossl_pkey_rsa.c:166: warning: ‘BIO_ctrl’ is deprecated (declared at /usr/include/openssl/bio.h:590)
  1287.     ossl_pkey_rsa.c:167: warning: ‘d2i_RSAPublicKey_bio’ is deprecated (declared at /usr/include/openssl/x509.h:837)
  1288.     ossl_pkey_rsa.c:170: warning: ‘BIO_ctrl’ is deprecated (declared at /usr/include/openssl/bio.h:590)
  1289.     ossl_pkey_rsa.c:171: warning: ‘d2i_RSA_PUBKEY_bio’ is deprecated (declared at /usr/include/openssl/x509.h:839)
  1290.     ossl_pkey_rsa.c:173: warning: ‘BIO_free’ is deprecated (declared at /usr/include/openssl/bio.h:583)
  1291.     ossl_pkey_rsa.c:176: warning: ‘EVP_PKEY_assign’ is deprecated (declared at /usr/include/openssl/evp.h:861)
  1292.     ossl_pkey_rsa.c:177: warning: ‘RSA_free’ is deprecated (declared at /usr/include/openssl/rsa.h:282)
  1293.     ossl_pkey_rsa.c: In function ‘ossl_rsa_is_public’:
  1294.     ossl_pkey_rsa.c:196: warning: ‘EVP_PKEY_type’ is deprecated (declared at /usr/include/openssl/evp.h:858)
  1295.     ossl_pkey_rsa.c: In function ‘ossl_rsa_is_private’:
  1296.     ossl_pkey_rsa.c:213: warning: ‘EVP_PKEY_type’ is deprecated (declared at /usr/include/openssl/evp.h:858)
  1297.     ossl_pkey_rsa.c: In function ‘ossl_rsa_export’:
  1298.     ossl_pkey_rsa.c:239: warning: ‘EVP_PKEY_type’ is deprecated (declared at /usr/include/openssl/evp.h:858)
  1299.     ossl_pkey_rsa.c:249: warning: ‘BIO_new’ is deprecated (declared at /usr/include/openssl/bio.h:581)
  1300.     ossl_pkey_rsa.c:249: warning: ‘BIO_s_mem’ is deprecated (declared at /usr/include/openssl/bio.h:616)
  1301.     ossl_pkey_rsa.c:255: warning: ‘BIO_free’ is deprecated (declared at /usr/include/openssl/bio.h:583)
  1302.     ossl_pkey_rsa.c:260: warning: ‘BIO_free’ is deprecated (declared at /usr/include/openssl/bio.h:583)
  1303.     ossl_pkey_rsa.c: In function ‘ossl_rsa_to_der’:
  1304.     ossl_pkey_rsa.c:283: warning: ‘EVP_PKEY_type’ is deprecated (declared at /usr/include/openssl/evp.h:858)
  1305.     ossl_pkey_rsa.c: In function ‘ossl_rsa_public_encrypt’:
  1306.     ossl_pkey_rsa.c:313: warning: ‘EVP_PKEY_type’ is deprecated (declared at /usr/include/openssl/evp.h:858)
  1307.     ossl_pkey_rsa.c:317: warning: ‘RSA_size’ is deprecated (declared at /usr/include/openssl/rsa.h:256)
  1308.     ossl_pkey_rsa.c:318: warning: ‘RSA_public_encrypt’ is deprecated (declared at /usr/include/openssl/rsa.h:275)
  1309.     ossl_pkey_rsa.c: In function ‘ossl_rsa_public_decrypt’:
  1310.     ossl_pkey_rsa.c:339: warning: ‘EVP_PKEY_type’ is deprecated (declared at /usr/include/openssl/evp.h:858)
  1311.     ossl_pkey_rsa.c:343: warning: ‘RSA_size’ is deprecated (declared at /usr/include/openssl/rsa.h:256)
  1312.     ossl_pkey_rsa.c:344: warning: ‘RSA_public_decrypt’ is deprecated (declared at /usr/include/openssl/rsa.h:279)
  1313.     ossl_pkey_rsa.c: In function ‘ossl_rsa_private_encrypt’:
  1314.     ossl_pkey_rsa.c:365: warning: ‘EVP_PKEY_type’ is deprecated (declared at /usr/include/openssl/evp.h:858)
  1315.     ossl_pkey_rsa.c:372: warning: ‘RSA_size’ is deprecated (declared at /usr/include/openssl/rsa.h:256)
  1316.     ossl_pkey_rsa.c:373: warning: ‘RSA_private_encrypt’ is deprecated (declared at /usr/include/openssl/rsa.h:277)
  1317.     ossl_pkey_rsa.c: In function ‘ossl_rsa_private_decrypt’:
  1318.     ossl_pkey_rsa.c:395: warning: ‘EVP_PKEY_type’ is deprecated (declared at /usr/include/openssl/evp.h:858)
  1319.     ossl_pkey_rsa.c:402: warning: ‘RSA_size’ is deprecated (declared at /usr/include/openssl/rsa.h:256)
  1320.     ossl_pkey_rsa.c:403: warning: ‘RSA_private_decrypt’ is deprecated (declared at /usr/include/openssl/rsa.h:281)
  1321.     ossl_pkey_rsa.c: In function ‘ossl_rsa_get_params’:
  1322.     ossl_pkey_rsa.c:426: warning: ‘EVP_PKEY_type’ is deprecated (declared at /usr/include/openssl/evp.h:858)
  1323.     ossl_pkey_rsa.c: In function ‘ossl_rsa_to_text’:
  1324.     ossl_pkey_rsa.c:457: warning: ‘EVP_PKEY_type’ is deprecated (declared at /usr/include/openssl/evp.h:858)
  1325.     ossl_pkey_rsa.c:458: warning: ‘BIO_new’ is deprecated (declared at /usr/include/openssl/bio.h:581)
  1326.     ossl_pkey_rsa.c:458: warning: ‘BIO_s_mem’ is deprecated (declared at /usr/include/openssl/bio.h:616)
  1327.     ossl_pkey_rsa.c:461: warning: ‘RSA_print’ is deprecated (declared at /usr/include/openssl/rsa.h:314)
  1328.     ossl_pkey_rsa.c:462: warning: ‘BIO_free’ is deprecated (declared at /usr/include/openssl/bio.h:583)
  1329.     ossl_pkey_rsa.c: In function ‘ossl_rsa_to_public_key’:
  1330.     ossl_pkey_rsa.c:483: warning: ‘EVP_PKEY_type’ is deprecated (declared at /usr/include/openssl/evp.h:858)
  1331.     ossl_pkey_rsa.c:485: warning: ‘RSAPublicKey_dup’ is deprecated (declared at /usr/include/openssl/rsa.h:394)
  1332.     ossl_pkey_rsa.c:488: warning: ‘RSA_free’ is deprecated (declared at /usr/include/openssl/rsa.h:282)
  1333.     ossl_pkey_rsa.c: In function ‘ossl_rsa_set_n’:
  1334.     ossl_pkey_rsa.c:522: warning: ‘BN_clear_free’ is deprecated (declared at /usr/include/openssl/bn.h:419)
  1335.     ossl_pkey_rsa.c:522: warning: ‘BN_new’ is deprecated (declared at /usr/include/openssl/bn.h:417)
  1336.     ossl_pkey_rsa.c:522: warning: ‘BN_copy’ is deprecated (declared at /usr/include/openssl/bn.h:420)
  1337.     ossl_pkey_rsa.c: In function ‘ossl_rsa_set_e’:
  1338.     ossl_pkey_rsa.c:523: warning: ‘BN_clear_free’ is deprecated (declared at /usr/include/openssl/bn.h:419)
  1339.     ossl_pkey_rsa.c:523: warning: ‘BN_new’ is deprecated (declared at /usr/include/openssl/bn.h:417)
  1340.     ossl_pkey_rsa.c:523: warning: ‘BN_copy’ is deprecated (declared at /usr/include/openssl/bn.h:420)
  1341.     ossl_pkey_rsa.c: In function ‘ossl_rsa_set_d’:
  1342.     ossl_pkey_rsa.c:524: warning: ‘BN_clear_free’ is deprecated (declared at /usr/include/openssl/bn.h:419)
  1343.     ossl_pkey_rsa.c:524: warning: ‘BN_new’ is deprecated (declared at /usr/include/openssl/bn.h:417)
  1344.     ossl_pkey_rsa.c:524: warning: ‘BN_copy’ is deprecated (declared at /usr/include/openssl/bn.h:420)
  1345.     ossl_pkey_rsa.c: In function ‘ossl_rsa_set_p’:
  1346.     ossl_pkey_rsa.c:525: warning: ‘BN_clear_free’ is deprecated (declared at /usr/include/openssl/bn.h:419)
  1347.     ossl_pkey_rsa.c:525: warning: ‘BN_new’ is deprecated (declared at /usr/include/openssl/bn.h:417)
  1348.     ossl_pkey_rsa.c:525: warning: ‘BN_copy’ is deprecated (declared at /usr/include/openssl/bn.h:420)
  1349.     ossl_pkey_rsa.c: In function ‘ossl_rsa_set_q’:
  1350.     ossl_pkey_rsa.c:526: warning: ‘BN_clear_free’ is deprecated (declared at /usr/include/openssl/bn.h:419)
  1351.     ossl_pkey_rsa.c:526: warning: ‘BN_new’ is deprecated (declared at /usr/include/openssl/bn.h:417)
  1352.     ossl_pkey_rsa.c:526: warning: ‘BN_copy’ is deprecated (declared at /usr/include/openssl/bn.h:420)
  1353.     ossl_pkey_rsa.c: In function ‘ossl_rsa_set_dmp1’:
  1354.     ossl_pkey_rsa.c:527: warning: ‘BN_clear_free’ is deprecated (declared at /usr/include/openssl/bn.h:419)
  1355.     ossl_pkey_rsa.c:527: warning: ‘BN_new’ is deprecated (declared at /usr/include/openssl/bn.h:417)
  1356.     ossl_pkey_rsa.c:527: warning: ‘BN_copy’ is deprecated (declared at /usr/include/openssl/bn.h:420)
  1357.     ossl_pkey_rsa.c: In function ‘ossl_rsa_set_dmq1’:
  1358.     ossl_pkey_rsa.c:528: warning: ‘BN_clear_free’ is deprecated (declared at /usr/include/openssl/bn.h:419)
  1359.     ossl_pkey_rsa.c:528: warning: ‘BN_new’ is deprecated (declared at /usr/include/openssl/bn.h:417)
  1360.     ossl_pkey_rsa.c:528: warning: ‘BN_copy’ is deprecated (declared at /usr/include/openssl/bn.h:420)
  1361.     ossl_pkey_rsa.c: In function ‘ossl_rsa_set_iqmp’:
  1362.     ossl_pkey_rsa.c:529: warning: ‘BN_clear_free’ is deprecated (declared at /usr/include/openssl/bn.h:419)
  1363.     ossl_pkey_rsa.c:529: warning: ‘BN_new’ is deprecated (declared at /usr/include/openssl/bn.h:417)
  1364.     ossl_pkey_rsa.c:529: warning: ‘BN_copy’ is deprecated (declared at /usr/include/openssl/bn.h:420)
  1365.     /usr/bin/gcc -I. -I../.. -I../../. -I../.././ext/openssl -DRUBY_EXTCONF_H=\"extconf.h\" -I/opt/X11/include -D_XOPEN_SOURCE -D_DARWIN_C_SOURCE  -I/opt/X11/include -fno-common -g -O2  -fno-common -pipe -fno-common   -c ossl_rand.c
  1366.     ossl_rand.c: In function ‘ossl_rand_seed’:
  1367.     ossl_rand.c:40: warning: ‘RAND_seed’ is deprecated (declared at /usr/include/openssl/rand.h:106)
  1368.     ossl_rand.c: In function ‘ossl_rand_add’:
  1369.     ossl_rand.c:54: warning: ‘RAND_add’ is deprecated (declared at /usr/include/openssl/rand.h:107)
  1370.     ossl_rand.c: In function ‘ossl_rand_load_file’:
  1371.     ossl_rand.c:69: warning: ‘RAND_load_file’ is deprecated (declared at /usr/include/openssl/rand.h:108)
  1372.     ossl_rand.c: In function ‘ossl_rand_write_file’:
  1373.     ossl_rand.c:84: warning: ‘RAND_write_file’ is deprecated (declared at /usr/include/openssl/rand.h:109)
  1374.     ossl_rand.c: In function ‘ossl_rand_bytes’:
  1375.     ossl_rand.c:102: warning: ‘RAND_bytes’ is deprecated (declared at /usr/include/openssl/rand.h:104)
  1376.     ossl_rand.c: In function ‘ossl_rand_pseudo_bytes’:
  1377.     ossl_rand.c:121: warning: ‘RAND_pseudo_bytes’ is deprecated (declared at /usr/include/openssl/rand.h:105)
  1378.     ossl_rand.c: In function ‘ossl_rand_egd’:
  1379.     ossl_rand.c:138: warning: ‘RAND_egd’ is deprecated (declared at /usr/include/openssl/rand.h:113)
  1380.     ossl_rand.c: In function ‘ossl_rand_egd_bytes’:
  1381.     ossl_rand.c:156: warning: ‘RAND_egd_bytes’ is deprecated (declared at /usr/include/openssl/rand.h:114)
  1382.     ossl_rand.c: In function ‘ossl_rand_status’:
  1383.     ossl_rand.c:171: warning: ‘RAND_status’ is deprecated (declared at /usr/include/openssl/rand.h:111)
  1384.     /usr/bin/gcc -I. -I../.. -I../../. -I../.././ext/openssl -DRUBY_EXTCONF_H=\"extconf.h\" -I/opt/X11/include -D_XOPEN_SOURCE -D_DARWIN_C_SOURCE  -I/opt/X11/include -fno-common -g -O2  -fno-common -pipe -fno-common   -c ossl_ssl.c
  1385.     ossl_ssl.c:101: warning: ‘TLSv1_method’ is deprecated (declared at /usr/include/openssl/ssl.h:1519)
  1386.     ossl_ssl.c:102: warning: ‘TLSv1_server_method’ is deprecated (declared at /usr/include/openssl/ssl.h:1520)
  1387.     ossl_ssl.c:103: warning: ‘TLSv1_client_method’ is deprecated (declared at /usr/include/openssl/ssl.h:1521)
  1388.     ossl_ssl.c:108: warning: ‘SSLv2_method’ is deprecated (declared at /usr/include/openssl/ssl.h:1507)
  1389.     ossl_ssl.c:109: warning: ‘SSLv2_server_method’ is deprecated (declared at /usr/include/openssl/ssl.h:1508)
  1390.     ossl_ssl.c:110: warning: ‘SSLv2_client_method’ is deprecated (declared at /usr/include/openssl/ssl.h:1509)
  1391.     ossl_ssl.c:113: warning: ‘SSLv3_method’ is deprecated (declared at /usr/include/openssl/ssl.h:1511)
  1392.     ossl_ssl.c:114: warning: ‘SSLv3_server_method’ is deprecated (declared at /usr/include/openssl/ssl.h:1512)
  1393.     ossl_ssl.c:115: warning: ‘SSLv3_client_method’ is deprecated (declared at /usr/include/openssl/ssl.h:1513)
  1394.     ossl_ssl.c:116: warning: ‘SSLv23_method’ is deprecated (declared at /usr/include/openssl/ssl.h:1515)
  1395.     ossl_ssl.c:117: warning: ‘SSLv23_server_method’ is deprecated (declared at /usr/include/openssl/ssl.h:1516)
  1396.     ossl_ssl.c:118: warning: ‘SSLv23_client_method’ is deprecated (declared at /usr/include/openssl/ssl.h:1517)
  1397.     ossl_ssl.c: In function ‘ossl_sslctx_free’:
  1398.     ossl_ssl.c:131: warning: ‘SSL_CTX_get_ex_data’ is deprecated (declared at /usr/include/openssl/ssl.h:1597)
  1399.     ossl_ssl.c:133: warning: ‘SSL_CTX_free’ is deprecated (declared at /usr/include/openssl/ssl.h:1347)
  1400.     ossl_ssl.c: In function ‘ossl_sslctx_s_alloc’:
  1401.     ossl_ssl.c:141: warning: ‘SSL_CTX_new’ is deprecated (declared at /usr/include/openssl/ssl.h:1346)
  1402.     ossl_ssl.c:141: warning: ‘SSLv23_method’ is deprecated (declared at /usr/include/openssl/ssl.h:1515)
  1403.     ossl_ssl.c:145: warning: ‘SSL_CTX_ctrl’ is deprecated (declared at /usr/include/openssl/ssl.h:1498)
  1404.     ossl_ssl.c: In function ‘ossl_sslctx_set_ssl_version’:
  1405.     ossl_ssl.c:171: warning: ‘SSL_CTX_set_ssl_version’ is deprecated (declared at /usr/include/openssl/ssl.h:1505)
  1406.     ossl_ssl.c: In function ‘ossl_call_client_cert_cb’:
  1407.     ossl_ssl.c:212: warning: ‘SSL_get_ex_data’ is deprecated (declared at /usr/include/openssl/ssl.h:1587)
  1408.     ossl_ssl.c: In function ‘ossl_client_cert_cb’:
  1409.     ossl_ssl.c:230: warning: ‘SSL_get_ex_data’ is deprecated (declared at /usr/include/openssl/ssl.h:1587)
  1410.     ossl_ssl.c: In function ‘ossl_call_tmp_dh_callback’:
  1411.     ossl_ssl.c:249: warning: ‘SSL_get_ex_data’ is deprecated (declared at /usr/include/openssl/ssl.h:1587)
  1412.     ossl_ssl.c:253: warning: ‘EVP_PKEY_type’ is deprecated (declared at /usr/include/openssl/evp.h:858)
  1413.     ossl_ssl.c: In function ‘ossl_tmp_dh_callback’:
  1414.     ossl_ssl.c:265: warning: ‘SSL_get_ex_data’ is deprecated (declared at /usr/include/openssl/ssl.h:1587)
  1415.     ossl_ssl.c: In function ‘ossl_ssl_verify_callback’:
  1416.     ossl_ssl.c:296: warning: ‘X509_STORE_CTX_get_ex_data’ is deprecated (declared at /usr/include/openssl/x509_vfy.h:450)
  1417.     ossl_ssl.c:296: warning: ‘SSL_get_ex_data_X509_STORE_CTX_idx’ is deprecated (declared at /usr/include/openssl/ssl.h:1601)
  1418.     ossl_ssl.c:297: warning: ‘SSL_get_ex_data’ is deprecated (declared at /usr/include/openssl/ssl.h:1587)
  1419.     ossl_ssl.c:298: warning: ‘X509_STORE_CTX_set_ex_data’ is deprecated (declared at /usr/include/openssl/x509_vfy.h:449)
  1420.     ossl_ssl.c: In function ‘ossl_sslctx_session_get_cb’:
  1421.     ossl_ssl.c:328: warning: ‘SSL_get_ex_data’ is deprecated (declared at /usr/include/openssl/ssl.h:1587)
  1422.     ossl_ssl.c: In function ‘ossl_sslctx_session_new_cb’:
  1423.     ossl_ssl.c:375: warning: ‘SSL_get_ex_data’ is deprecated (declared at /usr/include/openssl/ssl.h:1587)
  1424.     ossl_ssl.c:379: warning: ‘CRYPTO_add_lock’ is deprecated (declared at /usr/include/openssl/crypto.h:430)
  1425.     ossl_ssl.c: In function ‘ossl_sslctx_session_remove_cb’:
  1426.     ossl_ssl.c:418: warning: ‘SSL_CTX_get_ex_data’ is deprecated (declared at /usr/include/openssl/ssl.h:1597)
  1427.     ossl_ssl.c:422: warning: ‘CRYPTO_add_lock’ is deprecated (declared at /usr/include/openssl/crypto.h:430)
  1428.     ossl_ssl.c: In function ‘ossl_sslctx_add_extra_chain_cert_i’:
  1429.     ossl_ssl.c:447: warning: ‘SSL_CTX_ctrl’ is deprecated (declared at /usr/include/openssl/ssl.h:1498)
  1430.     ossl_ssl.c: In function ‘ossl_sslctx_setup’:
  1431.     ossl_ssl.c:478: warning: ‘SSL_CTX_set_tmp_dh_callback’ is deprecated (declared at /usr/include/openssl/ssl.h:1640)
  1432.     ossl_ssl.c:481: warning: ‘SSL_CTX_set_tmp_dh_callback’ is deprecated (declared at /usr/include/openssl/ssl.h:1640)
  1433.     ossl_ssl.c:484: warning: ‘SSL_CTX_set_ex_data’ is deprecated (declared at /usr/include/openssl/ssl.h:1596)
  1434.     ossl_ssl.c:495: warning: ‘SSL_CTX_set_cert_store’ is deprecated (declared at /usr/include/openssl/ssl.h:1351)
  1435.     ossl_ssl.c:496: warning: ‘SSL_CTX_set_ex_data’ is deprecated (declared at /usr/include/openssl/ssl.h:1596)
  1436.     ossl_ssl.c:510: warning: ‘SSL_CTX_use_certificate’ is deprecated (declared at /usr/include/openssl/ssl.h:1469)
  1437.     ossl_ssl.c:514: warning: ‘SSL_CTX_use_PrivateKey’ is deprecated (declared at /usr/include/openssl/ssl.h:1466)
  1438.     ossl_ssl.c:518: warning: ‘SSL_CTX_check_private_key’ is deprecated (declared at /usr/include/openssl/ssl.h:1475)
  1439.     ossl_ssl.c:528: warning: ‘SSL_CTX_add_client_CA’ is deprecated (declared at /usr/include/openssl/ssl.h:1546)
  1440.     ossl_ssl.c:536: warning: ‘SSL_CTX_add_client_CA’ is deprecated (declared at /usr/include/openssl/ssl.h:1546)
  1441.     ossl_ssl.c:548: warning: ‘SSL_CTX_load_verify_locations’ is deprecated (declared at /usr/include/openssl/ssl.h:1572)
  1442.     ossl_ssl.c:554: warning: ‘SSL_CTX_set_verify’ is deprecated (declared at /usr/include/openssl/ssl.h:1459)
  1443.     ossl_ssl.c:556: warning: ‘SSL_CTX_set_client_cert_cb’ is deprecated (declared at /usr/include/openssl/ssl.h:852)
  1444.     ossl_ssl.c:559: warning: ‘SSL_CTX_set_timeout’ is deprecated (declared at /usr/include/openssl/ssl.h:1348)
  1445.     ossl_ssl.c:562: warning: ‘SSL_CTX_set_verify_depth’ is deprecated (declared at /usr/include/openssl/ssl.h:1460)
  1446.     ossl_ssl.c:566: warning: ‘SSL_CTX_ctrl’ is deprecated (declared at /usr/include/openssl/ssl.h:1498)
  1447.     ossl_ssl.c:568: warning: ‘SSL_CTX_ctrl’ is deprecated (declared at /usr/include/openssl/ssl.h:1498)
  1448.     ossl_ssl.c:575: warning: ‘SSL_CTX_set_session_id_context’ is deprecated (declared at /usr/include/openssl/ssl.h:1479)
  1449.     ossl_ssl.c:582: warning: ‘SSL_CTX_sess_set_get_cb’ is deprecated (declared at /usr/include/openssl/ssl.h:848)
  1450.     ossl_ssl.c:586: warning: ‘SSL_CTX_sess_set_new_cb’ is deprecated (declared at /usr/include/openssl/ssl.h:844)
  1451.     ossl_ssl.c:590: warning: ‘SSL_CTX_sess_set_remove_cb’ is deprecated (declared at /usr/include/openssl/ssl.h:846)
  1452.     ossl_ssl.c: In function ‘ossl_ssl_cipher_to_ary’:
  1453.     ossl_ssl.c:603: warning: ‘SSL_CIPHER_get_name’ is deprecated (declared at /usr/include/openssl/ssl.h:1360)
  1454.     ossl_ssl.c:604: warning: ‘SSL_CIPHER_get_version’ is deprecated (declared at /usr/include/openssl/ssl.h:1359)
  1455.     ossl_ssl.c:605: warning: ‘SSL_CIPHER_get_bits’ is deprecated (declared at /usr/include/openssl/ssl.h:1358)
  1456.     ossl_ssl.c: In function ‘ossl_sslctx_get_ciphers’:
  1457.     ossl_ssl.c:635: warning: ‘sk_num’ is deprecated (declared at /usr/include/openssl/stack.h:81)
  1458.     ossl_ssl.c:638: warning: ‘sk_value’ is deprecated (declared at /usr/include/openssl/stack.h:82)
  1459.     ossl_ssl.c: In function ‘ossl_sslctx_set_ciphers’:
  1460.     ossl_ssl.c:679: warning: ‘SSL_CTX_set_cipher_list’ is deprecated (declared at /usr/include/openssl/ssl.h:1345)
  1461.     ossl_ssl.c: In function ‘ossl_sslctx_session_add’:
  1462.     ossl_ssl.c:701: warning: ‘SSL_CTX_add_session’ is deprecated (declared at /usr/include/openssl/ssl.h:1440)
  1463.     ossl_ssl.c: In function ‘ossl_sslctx_session_remove’:
  1464.     ossl_ssl.c:718: warning: ‘SSL_CTX_remove_session’ is deprecated (declared at /usr/include/openssl/ssl.h:1441)
  1465.     ossl_ssl.c: In function ‘ossl_sslctx_get_session_cache_mode’:
  1466.     ossl_ssl.c:733: warning: ‘SSL_CTX_ctrl’ is deprecated (declared at /usr/include/openssl/ssl.h:1498)
  1467.     ossl_ssl.c: In function ‘ossl_sslctx_set_session_cache_mode’:
  1468.     ossl_ssl.c:748: warning: ‘SSL_CTX_ctrl’ is deprecated (declared at /usr/include/openssl/ssl.h:1498)
  1469.     ossl_ssl.c: In function ‘ossl_sslctx_get_session_cache_size’:
  1470.     ossl_ssl.c:765: warning: ‘SSL_CTX_ctrl’ is deprecated (declared at /usr/include/openssl/ssl.h:1498)
  1471.     ossl_ssl.c: In function ‘ossl_sslctx_set_session_cache_size’:
  1472.     ossl_ssl.c:780: warning: ‘SSL_CTX_ctrl’ is deprecated (declared at /usr/include/openssl/ssl.h:1498)
  1473.     ossl_ssl.c: In function ‘ossl_sslctx_get_session_cache_stats’:
  1474.     ossl_ssl.c:799: warning: ‘SSL_CTX_ctrl’ is deprecated (declared at /usr/include/openssl/ssl.h:1498)
  1475.     ossl_ssl.c:800: warning: ‘SSL_CTX_ctrl’ is deprecated (declared at /usr/include/openssl/ssl.h:1498)
  1476.     ossl_ssl.c:801: warning: ‘SSL_CTX_ctrl’ is deprecated (declared at /usr/include/openssl/ssl.h:1498)
  1477.     ossl_ssl.c:802: warning: ‘SSL_CTX_ctrl’ is deprecated (declared at /usr/include/openssl/ssl.h:1498)
  1478.     ossl_ssl.c:803: warning: ‘SSL_CTX_ctrl’ is deprecated (declared at /usr/include/openssl/ssl.h:1498)
  1479.     ossl_ssl.c:804: warning: ‘SSL_CTX_ctrl’ is deprecated (declared at /usr/include/openssl/ssl.h:1498)
  1480.     ossl_ssl.c:805: warning: ‘SSL_CTX_ctrl’ is deprecated (declared at /usr/include/openssl/ssl.h:1498)
  1481.     ossl_ssl.c:806: warning: ‘SSL_CTX_ctrl’ is deprecated (declared at /usr/include/openssl/ssl.h:1498)
  1482.     ossl_ssl.c:807: warning: ‘SSL_CTX_ctrl’ is deprecated (declared at /usr/include/openssl/ssl.h:1498)
  1483.     ossl_ssl.c:808: warning: ‘SSL_CTX_ctrl’ is deprecated (declared at /usr/include/openssl/ssl.h:1498)
  1484.     ossl_ssl.c:809: warning: ‘SSL_CTX_ctrl’ is deprecated (declared at /usr/include/openssl/ssl.h:1498)
  1485.     ossl_ssl.c:810: warning: ‘SSL_CTX_ctrl’ is deprecated (declared at /usr/include/openssl/ssl.h:1498)
  1486.     ossl_ssl.c: In function ‘ossl_sslctx_flush_sessions’:
  1487.     ossl_ssl.c:841: warning: ‘SSL_CTX_flush_sessions’ is deprecated (declared at /usr/include/openssl/ssl.h:1355)
  1488.     ossl_ssl.c: In function ‘ossl_ssl_shutdown’:
  1489.     ossl_ssl.c:853: warning: ‘SSL_shutdown’ is deprecated (declared at /usr/include/openssl/ssl.h:1532)
  1490.     ossl_ssl.c:854: warning: ‘SSL_clear’ is deprecated (declared at /usr/include/openssl/ssl.h:1353)
  1491.     ossl_ssl.c: In function ‘ossl_ssl_free’:
  1492.     ossl_ssl.c:862: warning: ‘SSL_free’ is deprecated (declared at /usr/include/openssl/ssl.h:1490)
  1493.     ossl_ssl.c: In function ‘ossl_ssl_setup’:
  1494.     ossl_ssl.c:917: warning: ‘SSL_new’ is deprecated (declared at /usr/include/openssl/ssl.h:1481)
  1495.     ossl_ssl.c:927: warning: ‘SSL_set_fd’ is deprecated (declared at /usr/include/openssl/ssl.h:1370)
  1496.     ossl_ssl.c:928: warning: ‘SSL_set_ex_data’ is deprecated (declared at /usr/include/openssl/ssl.h:1586)
  1497.     ossl_ssl.c:930: warning: ‘SSL_set_ex_data’ is deprecated (declared at /usr/include/openssl/ssl.h:1586)
  1498.     ossl_ssl.c:932: warning: ‘SSL_set_ex_data’ is deprecated (declared at /usr/include/openssl/ssl.h:1586)
  1499.     ossl_ssl.c:934: warning: ‘SSL_set_ex_data’ is deprecated (declared at /usr/include/openssl/ssl.h:1586)
  1500.     ossl_ssl.c: In function ‘ossl_start_ssl’:
  1501.     ossl_ssl.c:960: warning: ‘SSL_get_error’ is deprecated (declared at /usr/include/openssl/ssl.h:1501)
  1502.     ossl_ssl.c:969: warning: ‘SSL_state_string_long’ is deprecated (declared at /usr/include/openssl/ssl.h:1419)
  1503.     ossl_ssl.c:971: warning: ‘SSL_state_string_long’ is deprecated (declared at /usr/include/openssl/ssl.h:1419)
  1504.     ossl_ssl.c: In function ‘ossl_ssl_connect’:
  1505.     ossl_ssl.c:990: warning: ‘SSL_connect’ is deprecated (declared at /usr/include/openssl/ssl.h:1492)
  1506.     ossl_ssl.c: In function ‘ossl_ssl_accept’:
  1507.     ossl_ssl.c:1001: warning: ‘SSL_accept’ is deprecated (declared at /usr/include/openssl/ssl.h:1491)
  1508.     ossl_ssl.c: In function ‘ossl_ssl_read’:
  1509.     ossl_ssl.c:1034: warning: ‘SSL_pending’ is deprecated (declared at /usr/include/openssl/ssl.h:1368)
  1510.     ossl_ssl.c:1037: warning: ‘SSL_read’ is deprecated (declared at /usr/include/openssl/ssl.h:1493)
  1511.     ossl_ssl.c:1038: warning: ‘SSL_get_error’ is deprecated (declared at /usr/include/openssl/ssl.h:1501)
  1512.     ossl_ssl.c:1050: warning: ‘ERR_peek_error’ is deprecated (declared at /usr/include/openssl/err.h:270)
  1513.     ossl_ssl.c: In function ‘ossl_ssl_write’:
  1514.     ossl_ssl.c:1087: warning: ‘SSL_write’ is deprecated (declared at /usr/include/openssl/ssl.h:1495)
  1515.     ossl_ssl.c:1088: warning: ‘SSL_get_error’ is deprecated (declared at /usr/include/openssl/ssl.h:1501)
  1516.     ossl_ssl.c: In function ‘ossl_ssl_get_cert’:
  1517.     ossl_ssl.c:1151: warning: ‘SSL_get_certificate’ is deprecated (declared at /usr/include/openssl/ssl.h:1560)
  1518.     ossl_ssl.c: In function ‘ossl_ssl_get_peer_cert’:
  1519.     ossl_ssl.c:1177: warning: ‘SSL_get_peer_certificate’ is deprecated (declared at /usr/include/openssl/ssl.h:1450)
  1520.     ossl_ssl.c: In function ‘ossl_ssl_get_peer_cert_chain’:
  1521.     ossl_ssl.c:1208: warning: ‘sk_num’ is deprecated (declared at /usr/include/openssl/stack.h:81)
  1522.     ossl_ssl.c:1211: warning: ‘sk_value’ is deprecated (declared at /usr/include/openssl/stack.h:82)
  1523.     ossl_ssl.c: In function ‘ossl_ssl_get_cipher’:
  1524.     ossl_ssl.c:1233: warning: ‘SSL_get_current_cipher’ is deprecated (declared at /usr/include/openssl/ssl.h:1357)
  1525.     ossl_ssl.c: In function ‘ossl_ssl_get_state’:
  1526.     ossl_ssl.c:1253: warning: ‘SSL_state_string’ is deprecated (declared at /usr/include/openssl/ssl.h:1417)
  1527.     ossl_ssl.c:1256: warning: ‘SSL_state_string_long’ is deprecated (declared at /usr/include/openssl/ssl.h:1419)
  1528.     ossl_ssl.c: In function ‘ossl_ssl_pending’:
  1529.     ossl_ssl.c:1276: warning: ‘SSL_pending’ is deprecated (declared at /usr/include/openssl/ssl.h:1368)
  1530.     ossl_ssl.c: In function ‘ossl_ssl_session_reused’:
  1531.     ossl_ssl.c:1295: warning: ‘SSL_ctrl’ is deprecated (declared at /usr/include/openssl/ssl.h:1496)
  1532.     ossl_ssl.c: In function ‘ossl_ssl_set_session’:
  1533.     ossl_ssl.c:1324: warning: ‘SSL_set_session’ is deprecated (declared at /usr/include/openssl/ssl.h:1439)
  1534.     ossl_ssl.c: In function ‘ossl_ssl_get_verify_result’:
  1535.     ossl_ssl.c:1341: warning: ‘SSL_get_verify_result’ is deprecated (declared at /usr/include/openssl/ssl.h:1584)
  1536.     ossl_ssl.c: In function ‘Init_ossl_ssl’:
  1537.     ossl_ssl.c:1356: warning: ‘SSL_get_ex_new_index’ is deprecated (declared at /usr/include/openssl/ssl.h:1589)
  1538.     ossl_ssl.c:1357: warning: ‘SSL_get_ex_new_index’ is deprecated (declared at /usr/include/openssl/ssl.h:1589)
  1539.     ossl_ssl.c:1358: warning: ‘SSL_get_ex_new_index’ is deprecated (declared at /usr/include/openssl/ssl.h:1589)
  1540.     ossl_ssl.c:1360: warning: ‘SSL_get_ex_new_index’ is deprecated (declared at /usr/include/openssl/ssl.h:1589)
  1541.     ossl_ssl.c:1362: warning: ‘SSL_get_ex_new_index’ is deprecated (declared at /usr/include/openssl/ssl.h:1589)
  1542.     /usr/bin/gcc -I. -I../.. -I../../. -I../.././ext/openssl -DRUBY_EXTCONF_H=\"extconf.h\" -I/opt/X11/include -D_XOPEN_SOURCE -D_DARWIN_C_SOURCE  -I/opt/X11/include -fno-common -g -O2  -fno-common -pipe -fno-common   -c ossl_ssl_session.c
  1543.     ossl_ssl_session.c: In function ‘ossl_ssl_session_alloc’:
  1544.     ossl_ssl_session.c:25: warning: ‘SSL_SESSION_free’ is deprecated (declared at /usr/include/openssl/ssl.h:1437)
  1545.     ossl_ssl_session.c: In function ‘ossl_ssl_session_initialize’:
  1546.     ossl_ssl_session.c:50: warning: ‘SSL_get1_session’ is deprecated (declared at /usr/include/openssl/ssl.h:1575)
  1547.     ossl_ssl_session.c:55: warning: ‘PEM_ASN1_read_bio’ is deprecated (declared at /usr/include/openssl/pem.h:585)
  1548.     ossl_ssl_session.c:55: warning: ‘d2i_SSL_SESSION’ is deprecated (declared at /usr/include/openssl/ssl.h:1447)
  1549.     ossl_ssl_session.c:58: warning: ‘BIO_ctrl’ is deprecated (declared at /usr/include/openssl/bio.h:590)
  1550.     ossl_ssl_session.c:59: warning: ‘ASN1_d2i_bio’ is deprecated (declared at /usr/include/openssl/asn1.h:984)
  1551.     ossl_ssl_session.c:59: warning: ‘SSL_SESSION_new’ is deprecated (declared at /usr/include/openssl/ssl.h:1427)
  1552.     ossl_ssl_session.c:59: warning: ‘d2i_SSL_SESSION’ is deprecated (declared at /usr/include/openssl/ssl.h:1447)
  1553.     ossl_ssl_session.c:62: warning: ‘BIO_free’ is deprecated (declared at /usr/include/openssl/bio.h:583)
  1554.     ossl_ssl_session.c: In function ‘ossl_ssl_session_get_time’:
  1555.     ossl_ssl_session.c:116: warning: ‘SSL_SESSION_get_time’ is deprecated (declared at /usr/include/openssl/ssl.h:1421)
  1556.     ossl_ssl_session.c: In function ‘ossl_ssl_session_get_timeout’:
  1557.     ossl_ssl_session.c:138: warning: ‘SSL_SESSION_get_timeout’ is deprecated (declared at /usr/include/openssl/ssl.h:1423)
  1558.     ossl_ssl_session.c: In function ‘ossl_ssl_session_set_time’:
  1559.     ossl_ssl_session.c:166: warning: ‘SSL_SESSION_set_time’ is deprecated (declared at /usr/include/openssl/ssl.h:1422)
  1560.     ossl_ssl_session.c: In function ‘ossl_ssl_session_set_timeout’:
  1561.     ossl_ssl_session.c:167: warning: ‘SSL_SESSION_set_timeout’ is deprecated (declared at /usr/include/openssl/ssl.h:1424)
  1562.     ossl_ssl_session.c: In function ‘ossl_ssl_session_get_id’:
  1563.     ossl_ssl_session.c:184: warning: ‘SSL_SESSION_get_id’ is deprecated (declared at /usr/include/openssl/ssl.h:1430)
  1564.     ossl_ssl_session.c: In function ‘ossl_ssl_session_to_der’:
  1565.     ossl_ssl_session.c:205: warning: ‘i2d_SSL_SESSION’ is deprecated (declared at /usr/include/openssl/ssl.h:1438)
  1566.     ossl_ssl_session.c: In function ‘ossl_ssl_session_to_pem’:
  1567.     ossl_ssl_session.c:231: warning: ‘BIO_new’ is deprecated (declared at /usr/include/openssl/bio.h:581)
  1568.     ossl_ssl_session.c:231: warning: ‘BIO_s_mem’ is deprecated (declared at /usr/include/openssl/bio.h:616)
  1569.     ossl_ssl_session.c:235: warning: ‘PEM_ASN1_write_bio’ is deprecated (declared at /usr/include/openssl/pem.h:595)
  1570.     ossl_ssl_session.c:235: warning: ‘i2d_SSL_SESSION’ is deprecated (declared at /usr/include/openssl/ssl.h:1438)
  1571.     ossl_ssl_session.c:236: warning: ‘BIO_free’ is deprecated (declared at /usr/include/openssl/bio.h:583)
  1572.     ossl_ssl_session.c:240: warning: ‘BIO_ctrl’ is deprecated (declared at /usr/include/openssl/bio.h:590)
  1573.     ossl_ssl_session.c:242: warning: ‘BIO_free’ is deprecated (declared at /usr/include/openssl/bio.h:583)
  1574.     ossl_ssl_session.c: In function ‘ossl_ssl_session_to_text’:
  1575.     ossl_ssl_session.c:263: warning: ‘BIO_new’ is deprecated (declared at /usr/include/openssl/bio.h:581)
  1576.     ossl_ssl_session.c:263: warning: ‘BIO_s_mem’ is deprecated (declared at /usr/include/openssl/bio.h:616)
  1577.     ossl_ssl_session.c:267: warning: ‘SSL_SESSION_print’ is deprecated (declared at /usr/include/openssl/ssl.h:1435)
  1578.     ossl_ssl_session.c:268: warning: ‘BIO_free’ is deprecated (declared at /usr/include/openssl/bio.h:583)
  1579.     ossl_ssl_session.c:272: warning: ‘BIO_ctrl’ is deprecated (declared at /usr/include/openssl/bio.h:590)
  1580.     ossl_ssl_session.c:274: warning: ‘BIO_free’ is deprecated (declared at /usr/include/openssl/bio.h:583)
  1581.     /usr/bin/gcc -I. -I../.. -I../../. -I../.././ext/openssl -DRUBY_EXTCONF_H=\"extconf.h\" -I/opt/X11/include -D_XOPEN_SOURCE -D_DARWIN_C_SOURCE  -I/opt/X11/include -fno-common -g -O2  -fno-common -pipe -fno-common   -c ossl_x509.c
  1582.     ossl_x509.c: In function ‘Init_ossl_x509’:
  1583.     ossl_x509.c:97: warning: ‘X509_get_default_cert_area’ is deprecated (declared at /usr/include/openssl/x509.h:886)
  1584.     ossl_x509.c:98: warning: ‘X509_get_default_cert_dir’ is deprecated (declared at /usr/include/openssl/x509.h:887)
  1585.     ossl_x509.c:99: warning: ‘X509_get_default_cert_file’ is deprecated (declared at /usr/include/openssl/x509.h:888)
  1586.     ossl_x509.c:100: warning: ‘X509_get_default_cert_dir_env’ is deprecated (declared at /usr/include/openssl/x509.h:889)
  1587.     ossl_x509.c:101: warning: ‘X509_get_default_cert_file_env’ is deprecated (declared at /usr/include/openssl/x509.h:890)
  1588.     ossl_x509.c:102: warning: ‘X509_get_default_private_dir’ is deprecated (declared at /usr/include/openssl/x509.h:891)
  1589.     /usr/bin/gcc -I. -I../.. -I../../. -I../.././ext/openssl -DRUBY_EXTCONF_H=\"extconf.h\" -I/opt/X11/include -D_XOPEN_SOURCE -D_DARWIN_C_SOURCE  -I/opt/X11/include -fno-common -g -O2  -fno-common -pipe -fno-common   -c ossl_x509attr.c
  1590.     ossl_x509attr.c: In function ‘ossl_x509attr_new’:
  1591.     ossl_x509attr.c:48: warning: ‘X509_ATTRIBUTE_dup’ is deprecated (declared at /usr/include/openssl/x509.h:867)
  1592.     ossl_x509attr.c: In function ‘DupX509AttrPtr’:
  1593.     ossl_x509attr.c:64: warning: ‘X509_ATTRIBUTE_dup’ is deprecated (declared at /usr/include/openssl/x509.h:867)
  1594.     ossl_x509attr.c: In function ‘ossl_x509attr_initialize’:
  1595.     ossl_x509attr.c:104: warning: passing argument 2 of ‘d2i_X509_ATTRIBUTE’ from incompatible pointer type
  1596.     ossl_x509attr.c: In function ‘ossl_x509attr_set_oid’:
  1597.     ossl_x509attr.c:127: warning: ‘OBJ_txt2obj’ is deprecated (declared at /usr/include/openssl/objects.h:1010)
  1598.     ossl_x509attr.c:128: warning: ‘OBJ_txt2obj’ is deprecated (declared at /usr/include/openssl/objects.h:1010)
  1599.     ossl_x509attr.c:131: warning: ‘X509_ATTRIBUTE_set1_object’ is deprecated (declared at /usr/include/openssl/x509.h:1215)
  1600.     ossl_x509attr.c: In function ‘ossl_x509attr_get_oid’:
  1601.     ossl_x509attr.c:150: warning: ‘X509_ATTRIBUTE_get0_object’ is deprecated (declared at /usr/include/openssl/x509.h:1220)
  1602.     ossl_x509attr.c:151: warning: ‘OBJ_obj2nid’ is deprecated (declared at /usr/include/openssl/objects.h:1009)
  1603.     ossl_x509attr.c:152: warning: ‘OBJ_nid2sn’ is deprecated (declared at /usr/include/openssl/objects.h:1008)
  1604.     ossl_x509attr.c:154: warning: ‘BIO_new’ is deprecated (declared at /usr/include/openssl/bio.h:581)
  1605.     ossl_x509attr.c:154: warning: ‘BIO_s_mem’ is deprecated (declared at /usr/include/openssl/bio.h:616)
  1606.     ossl_x509attr.c:156: warning: ‘i2a_ASN1_OBJECT’ is deprecated (declared at /usr/include/openssl/asn1.h:888)
  1607.     ossl_x509attr.c: In function ‘ossl_x509attr_set_value’:
  1608.     ossl_x509attr.c:183: warning: ‘ASN1_TYPE_get’ is deprecated (declared at /usr/include/openssl/asn1.h:771)
  1609.     ossl_x509attr.c:190: warning: ‘sk_free’ is deprecated (declared at /usr/include/openssl/stack.h:88)
  1610.     ossl_x509attr.c: In function ‘ossl_x509attr_get_value’:
  1611.     ossl_x509attr.c:220: warning: ‘i2d_ASN1_SET’ is deprecated (declared at /usr/include/openssl/asn1.h:878)
  1612.     ossl_x509attr.c:225: warning: ‘i2d_ASN1_SET’ is deprecated (declared at /usr/include/openssl/asn1.h:878)
  1613.     /usr/bin/gcc -I. -I../.. -I../../. -I../.././ext/openssl -DRUBY_EXTCONF_H=\"extconf.h\" -I/opt/X11/include -D_XOPEN_SOURCE -D_DARWIN_C_SOURCE  -I/opt/X11/include -fno-common -g -O2  -fno-common -pipe -fno-common   -c ossl_x509cert.c
  1614.     ossl_x509cert.c: In function ‘ossl_x509_new’:
  1615.     ossl_x509cert.c:48: warning: ‘X509_dup’ is deprecated (declared at /usr/include/openssl/x509.h:866)
  1616.     ossl_x509cert.c: In function ‘DupX509CertPtr’:
  1617.     ossl_x509cert.c:106: warning: ‘CRYPTO_add_lock’ is deprecated (declared at /usr/include/openssl/crypto.h:430)
  1618.     ossl_x509cert.c: In function ‘ossl_x509_initialize’:
  1619.     ossl_x509cert.c:148: warning: ‘BIO_ctrl’ is deprecated (declared at /usr/include/openssl/bio.h:590)
  1620.     ossl_x509cert.c:149: warning: ‘d2i_X509_bio’ is deprecated (declared at /usr/include/openssl/x509.h:828)
  1621.     ossl_x509cert.c:151: warning: ‘BIO_free’ is deprecated (declared at /usr/include/openssl/bio.h:583)
  1622.     ossl_x509cert.c: In function ‘ossl_x509_copy’:
  1623.     ossl_x509cert.c:168: warning: ‘X509_dup’ is deprecated (declared at /usr/include/openssl/x509.h:866)
  1624.     ossl_x509cert.c: In function ‘ossl_x509_to_pem’:
  1625.     ossl_x509cert.c:213: warning: ‘BIO_new’ is deprecated (declared at /usr/include/openssl/bio.h:581)
  1626.     ossl_x509cert.c:213: warning: ‘BIO_s_mem’ is deprecated (declared at /usr/include/openssl/bio.h:616)
  1627.     ossl_x509cert.c:217: warning: ‘BIO_free’ is deprecated (declared at /usr/include/openssl/bio.h:583)
  1628.     ossl_x509cert.c: In function ‘ossl_x509_to_text’:
  1629.     ossl_x509cert.c:238: warning: ‘BIO_new’ is deprecated (declared at /usr/include/openssl/bio.h:581)
  1630.     ossl_x509cert.c:238: warning: ‘BIO_s_mem’ is deprecated (declared at /usr/include/openssl/bio.h:616)
  1631.     ossl_x509cert.c:241: warning: ‘X509_print’ is deprecated (declared at /usr/include/openssl/x509.h:1089)
  1632.     ossl_x509cert.c:242: warning: ‘BIO_free’ is deprecated (declared at /usr/include/openssl/bio.h:583)
  1633.     ossl_x509cert.c: In function ‘ossl_x509_get_version’:
  1634.     ossl_x509cert.c:283: warning: ‘ASN1_INTEGER_get’ is deprecated (declared at /usr/include/openssl/asn1.h:899)
  1635.     ossl_x509cert.c: In function ‘ossl_x509_set_version’:
  1636.     ossl_x509cert.c:300: warning: ‘X509_set_version’ is deprecated (declared at /usr/include/openssl/x509.h:1007)
  1637.     ossl_x509cert.c: In function ‘ossl_x509_get_serial’:
  1638.     ossl_x509cert.c:318: warning: ‘X509_get_serialNumber’ is deprecated (declared at /usr/include/openssl/x509.h:1009)
  1639.     ossl_x509cert.c: In function ‘ossl_x509_set_serial’:
  1640.     ossl_x509cert.c:333: warning: ‘X509_get_serialNumber’ is deprecated (declared at /usr/include/openssl/x509.h:1009)
  1641.     ossl_x509cert.c: In function ‘ossl_x509_get_signature_algorithm’:
  1642.     ossl_x509cert.c:350: warning: ‘BIO_new’ is deprecated (declared at /usr/include/openssl/bio.h:581)
  1643.     ossl_x509cert.c:350: warning: ‘BIO_s_mem’ is deprecated (declared at /usr/include/openssl/bio.h:616)
  1644.     ossl_x509cert.c:353: warning: ‘i2a_ASN1_OBJECT’ is deprecated (declared at /usr/include/openssl/asn1.h:888)
  1645.     ossl_x509cert.c:354: warning: ‘BIO_free’ is deprecated (declared at /usr/include/openssl/bio.h:583)
  1646.     ossl_x509cert.c: In function ‘ossl_x509_get_subject’:
  1647.     ossl_x509cert.c:373: warning: ‘X509_get_subject_name’ is deprecated (declared at /usr/include/openssl/x509.h:1013)
  1648.     ossl_x509cert.c: In function ‘ossl_x509_set_subject’:
  1649.     ossl_x509cert.c:390: warning: ‘X509_set_subject_name’ is deprecated (declared at /usr/include/openssl/x509.h:1012)
  1650.     ossl_x509cert.c: In function ‘ossl_x509_get_issuer’:
  1651.     ossl_x509cert.c:408: warning: ‘X509_get_issuer_name’ is deprecated (declared at /usr/include/openssl/x509.h:1011)
  1652.     ossl_x509cert.c: In function ‘ossl_x509_set_issuer’:
  1653.     ossl_x509cert.c:425: warning: ‘X509_set_issuer_name’ is deprecated (declared at /usr/include/openssl/x509.h:1010)
  1654.     ossl_x509cert.c: In function ‘ossl_x509_set_not_before’:
  1655.     ossl_x509cert.c:462: warning: ‘X509_time_adj’ is deprecated (declared at /usr/include/openssl/x509.h:883)
  1656.     ossl_x509cert.c: In function ‘ossl_x509_set_not_after’:
  1657.     ossl_x509cert.c:499: warning: ‘X509_time_adj’ is deprecated (declared at /usr/include/openssl/x509.h:883)
  1658.     ossl_x509cert.c: In function ‘ossl_x509_get_public_key’:
  1659.     ossl_x509cert.c:517: warning: ‘X509_get_pubkey’ is deprecated (declared at /usr/include/openssl/x509.h:1017)
  1660.     ossl_x509cert.c: In function ‘ossl_x509_set_public_key’:
  1661.     ossl_x509cert.c:534: warning: ‘X509_set_pubkey’ is deprecated (declared at /usr/include/openssl/x509.h:1016)
  1662.     ossl_x509cert.c: In function ‘ossl_x509_sign’:
  1663.     ossl_x509cert.c:555: warning: ‘X509_sign’ is deprecated (declared at /usr/include/openssl/x509.h:771)
  1664.     ossl_x509cert.c: In function ‘ossl_x509_verify’:
  1665.     ossl_x509cert.c:577: warning: ‘X509_verify’ is deprecated (declared at /usr/include/openssl/x509.h:756)
  1666.     ossl_x509cert.c: In function ‘ossl_x509_check_private_key’:
  1667.     ossl_x509cert.c:602: warning: ‘X509_check_private_key’ is deprecated (declared at /usr/include/openssl/x509.h:1061)
  1668.     ossl_x509cert.c:603: warning: ‘ERR_reason_error_string’ is deprecated (declared at /usr/include/openssl/err.h:283)
  1669.     ossl_x509cert.c:603: warning: ‘ERR_get_error’ is deprecated (declared at /usr/include/openssl/err.h:266)
  1670.     ossl_x509cert.c:603: warning: ‘ERR_reason_error_string’ is deprecated (declared at /usr/include/openssl/err.h:283)
  1671.     ossl_x509cert.c:603: warning: ‘ERR_get_error’ is deprecated (declared at /usr/include/openssl/err.h:266)
  1672.     ossl_x509cert.c: In function ‘ossl_x509_get_extensions’:
  1673.     ossl_x509cert.c:623: warning: ‘X509_get_ext_count’ is deprecated (declared at /usr/include/openssl/x509.h:1144)
  1674.     ossl_x509cert.c:629: warning: ‘X509_get_ext’ is deprecated (declared at /usr/include/openssl/x509.h:1148)
  1675.     ossl_x509cert.c: In function ‘ossl_x509_set_extensions’:
  1676.     ossl_x509cert.c:653: warning: ‘sk_pop_free’ is deprecated (declared at /usr/include/openssl/stack.h:89)
  1677.     ossl_x509cert.c:658: warning: ‘X509_add_ext’ is deprecated (declared at /usr/include/openssl/x509.h:1150)
  1678.     ossl_x509cert.c: In function ‘ossl_x509_add_extension’:
  1679.     ossl_x509cert.c:680: warning: ‘X509_add_ext’ is deprecated (declared at /usr/include/openssl/x509.h:1150)
  1680.     ossl_x509cert.c: In function ‘ossl_x509_inspect’:
  1681.     ossl_x509cert.c:693: warning: initialization discards qualifiers from pointer target type
  1682.     /usr/bin/gcc -I. -I../.. -I../../. -I../.././ext/openssl -DRUBY_EXTCONF_H=\"extconf.h\" -I/opt/X11/include -D_XOPEN_SOURCE -D_DARWIN_C_SOURCE  -I/opt/X11/include -fno-common -g -O2  -fno-common -pipe -fno-common   -c ossl_x509crl.c
  1683.     ossl_x509crl.c: In function ‘DupX509CRLPtr’:
  1684.     ossl_x509crl.c:55: warning: ‘CRYPTO_add_lock’ is deprecated (declared at /usr/include/openssl/crypto.h:430)
  1685.     ossl_x509crl.c: In function ‘ossl_x509crl_new’:
  1686.     ossl_x509crl.c:66: warning: ‘X509_CRL_dup’ is deprecated (declared at /usr/include/openssl/x509.h:869)
  1687.     ossl_x509crl.c: In function ‘ossl_x509crl_initialize’:
  1688.     ossl_x509crl.c:104: warning: ‘BIO_ctrl’ is deprecated (declared at /usr/include/openssl/bio.h:590)
  1689.     ossl_x509crl.c:105: warning: ‘d2i_X509_CRL_bio’ is deprecated (declared at /usr/include/openssl/x509.h:830)
  1690.     ossl_x509crl.c:107: warning: ‘BIO_free’ is deprecated (declared at /usr/include/openssl/bio.h:583)
  1691.     ossl_x509crl.c: In function ‘ossl_x509crl_copy’:
  1692.     ossl_x509crl.c:122: warning: ‘X509_CRL_dup’ is deprecated (declared at /usr/include/openssl/x509.h:869)
  1693.     ossl_x509crl.c: In function ‘ossl_x509crl_get_version’:
  1694.     ossl_x509crl.c:138: warning: ‘ASN1_INTEGER_get’ is deprecated (declared at /usr/include/openssl/asn1.h:899)
  1695.     ossl_x509crl.c: In function ‘ossl_x509crl_set_version’:
  1696.     ossl_x509crl.c:153: warning: ‘X509_CRL_set_version’ is deprecated (declared at /usr/include/openssl/x509.h:1050)
  1697.     ossl_x509crl.c: In function ‘ossl_x509crl_get_signature_algorithm’:
  1698.     ossl_x509crl.c:169: warning: ‘BIO_new’ is deprecated (declared at /usr/include/openssl/bio.h:581)
  1699.     ossl_x509crl.c:169: warning: ‘BIO_s_mem’ is deprecated (declared at /usr/include/openssl/bio.h:616)
  1700.     ossl_x509crl.c:172: warning: ‘i2a_ASN1_OBJECT’ is deprecated (declared at /usr/include/openssl/asn1.h:888)
  1701.     ossl_x509crl.c:173: warning: ‘BIO_free’ is deprecated (declared at /usr/include/openssl/bio.h:583)
  1702.     ossl_x509crl.c:176: warning: ‘BIO_ctrl’ is deprecated (declared at /usr/include/openssl/bio.h:590)
  1703.     ossl_x509crl.c:178: warning: ‘BIO_free’ is deprecated (declared at /usr/include/openssl/bio.h:583)
  1704.     ossl_x509crl.c: In function ‘ossl_x509crl_set_issuer’:
  1705.     ossl_x509crl.c:199: warning: ‘X509_CRL_set_issuer_name’ is deprecated (declared at /usr/include/openssl/x509.h:1051)
  1706.     ossl_x509crl.c: In function ‘ossl_x509crl_set_last_update’:
  1707.     ossl_x509crl.c:223: warning: ‘X509_time_adj’ is deprecated (declared at /usr/include/openssl/x509.h:883)
  1708.     ossl_x509crl.c: In function ‘ossl_x509crl_set_next_update’:
  1709.     ossl_x509crl.c:249: warning: ‘X509_time_adj’ is deprecated (declared at /usr/include/openssl/x509.h:883)
  1710.     ossl_x509crl.c: In function ‘ossl_x509crl_get_revoked’:
  1711.     ossl_x509crl.c:265: warning: ‘sk_num’ is deprecated (declared at /usr/include/openssl/stack.h:81)
  1712.     ossl_x509crl.c:273: warning: ‘sk_value’ is deprecated (declared at /usr/include/openssl/stack.h:82)
  1713.     ossl_x509crl.c: In function ‘ossl_x509crl_set_revoked’:
  1714.     ossl_x509crl.c:294: warning: ‘sk_pop_free’ is deprecated (declared at /usr/include/openssl/stack.h:89)
  1715.     ossl_x509crl.c:298: warning: ‘X509_CRL_add0_revoked’ is deprecated (declared at /usr/include/openssl/x509.h:970)
  1716.     ossl_x509crl.c:302: warning: ‘X509_CRL_sort’ is deprecated (declared at /usr/include/openssl/x509.h:1054)
  1717.     ossl_x509crl.c: In function ‘ossl_x509crl_add_revoked’:
  1718.     ossl_x509crl.c:315: warning: ‘X509_CRL_add0_revoked’ is deprecated (declared at /usr/include/openssl/x509.h:970)
  1719.     ossl_x509crl.c:318: warning: ‘X509_CRL_sort’ is deprecated (declared at /usr/include/openssl/x509.h:1054)
  1720.     ossl_x509crl.c: In function ‘ossl_x509crl_sign’:
  1721.     ossl_x509crl.c:333: warning: ‘X509_CRL_sign’ is deprecated (declared at /usr/include/openssl/x509.h:773)
  1722.     ossl_x509crl.c: In function ‘ossl_x509crl_verify’:
  1723.     ossl_x509crl.c:347: warning: ‘X509_CRL_verify’ is deprecated (declared at /usr/include/openssl/x509.h:759)
  1724.     ossl_x509crl.c: In function ‘ossl_x509crl_to_der’:
  1725.     ossl_x509crl.c:366: warning: ‘BIO_new’ is deprecated (declared at /usr/include/openssl/bio.h:581)
  1726.     ossl_x509crl.c:366: warning: ‘BIO_s_mem’ is deprecated (declared at /usr/include/openssl/bio.h:616)
  1727.     ossl_x509crl.c:369: warning: ‘i2d_X509_CRL_bio’ is deprecated (declared at /usr/include/openssl/x509.h:831)
  1728.     ossl_x509crl.c:370: warning: ‘BIO_free’ is deprecated (declared at /usr/include/openssl/bio.h:583)
  1729.     ossl_x509crl.c:373: warning: ‘BIO_ctrl’ is deprecated (declared at /usr/include/openssl/bio.h:590)
  1730.     ossl_x509crl.c:375: warning: ‘BIO_free’ is deprecated (declared at /usr/include/openssl/bio.h:583)
  1731.     ossl_x509crl.c: In function ‘ossl_x509crl_to_pem’:
  1732.     ossl_x509crl.c:389: warning: ‘BIO_new’ is deprecated (declared at /usr/include/openssl/bio.h:581)
  1733.     ossl_x509crl.c:389: warning: ‘BIO_s_mem’ is deprecated (declared at /usr/include/openssl/bio.h:616)
  1734.     ossl_x509crl.c:393: warning: ‘BIO_free’ is deprecated (declared at /usr/include/openssl/bio.h:583)
  1735.     ossl_x509crl.c:396: warning: ‘BIO_ctrl’ is deprecated (declared at /usr/include/openssl/bio.h:590)
  1736.     ossl_x509crl.c:398: warning: ‘BIO_free’ is deprecated (declared at /usr/include/openssl/bio.h:583)
  1737.     ossl_x509crl.c: In function ‘ossl_x509crl_to_text’:
  1738.     ossl_x509crl.c:412: warning: ‘BIO_new’ is deprecated (declared at /usr/include/openssl/bio.h:581)
  1739.     ossl_x509crl.c:412: warning: ‘BIO_s_mem’ is deprecated (declared at /usr/include/openssl/bio.h:616)
  1740.     ossl_x509crl.c:415: warning: ‘X509_CRL_print’ is deprecated (declared at /usr/include/openssl/x509.h:1092)
  1741.     ossl_x509crl.c:416: warning: ‘BIO_free’ is deprecated (declared at /usr/include/openssl/bio.h:583)
  1742.     ossl_x509crl.c:419: warning: ‘BIO_ctrl’ is deprecated (declared at /usr/include/openssl/bio.h:590)
  1743.     ossl_x509crl.c:421: warning: ‘BIO_free’ is deprecated (declared at /usr/include/openssl/bio.h:583)
  1744.     ossl_x509crl.c: In function ‘ossl_x509crl_get_extensions’:
  1745.     ossl_x509crl.c:438: warning: ‘X509_CRL_get_ext_count’ is deprecated (declared at /usr/include/openssl/x509.h:1155)
  1746.     ossl_x509crl.c:445: warning: ‘X509_CRL_get_ext’ is deprecated (declared at /usr/include/openssl/x509.h:1159)
  1747.     ossl_x509crl.c: In function ‘ossl_x509crl_set_extensions’:
  1748.     ossl_x509crl.c:468: warning: ‘sk_pop_free’ is deprecated (declared at /usr/include/openssl/stack.h:89)
  1749.     ossl_x509crl.c:472: warning: ‘X509_CRL_add_ext’ is deprecated (declared at /usr/include/openssl/x509.h:1161)
  1750.     ossl_x509crl.c: In function ‘ossl_x509crl_add_extension’:
  1751.     ossl_x509crl.c:490: warning: ‘X509_CRL_add_ext’ is deprecated (declared at /usr/include/openssl/x509.h:1161)
  1752.     /usr/bin/gcc -I. -I../.. -I../../. -I../.././ext/openssl -DRUBY_EXTCONF_H=\"extconf.h\" -I/opt/X11/include -D_XOPEN_SOURCE -D_DARWIN_C_SOURCE  -I/opt/X11/include -fno-common -g -O2  -fno-common -pipe -fno-common   -c ossl_x509ext.c
  1753.     ossl_x509ext.c: In function ‘ossl_x509ext_new’:
  1754.     ossl_x509ext.c:61: warning: ‘X509_EXTENSION_dup’ is deprecated (declared at /usr/include/openssl/x509.h:868)
  1755.     ossl_x509ext.c: In function ‘DupX509ExtPtr’:
  1756.     ossl_x509ext.c:87: warning: ‘X509_EXTENSION_dup’ is deprecated (declared at /usr/include/openssl/x509.h:868)
  1757.     ossl_x509ext.c: In function ‘ossl_x509extfactory_free’:
  1758.     ossl_x509ext.c:103: warning: ‘CRYPTO_free’ is deprecated (declared at /usr/include/openssl/crypto.h:480)
  1759.     ossl_x509ext.c: In function ‘ossl_x509extfactory_alloc’:
  1760.     ossl_x509ext.c:112: warning: ‘CRYPTO_malloc’ is deprecated (declared at /usr/include/openssl/crypto.h:478)
  1761.     ossl_x509ext.c:112: warning: ‘X509V3_set_ctx’ is deprecated (declared at /usr/include/openssl/x509v3.h:562)
  1762.     ossl_x509ext.c: In function ‘ossl_x509extfactory_set_config’:
  1763.     ossl_x509ext.c:175: warning: ‘X509V3_set_nconf’ is deprecated (declared at /usr/include/openssl/x509v3.h:553)
  1764.     ossl_x509ext.c: In function ‘ossl_x509extfactory_create_ext’:
  1765.     ossl_x509ext.c:233: warning: ‘OBJ_ln2nid’ is deprecated (declared at /usr/include/openssl/objects.h:1013)
  1766.     ossl_x509ext.c:234: warning: ‘OBJ_sn2nid’ is deprecated (declared at /usr/include/openssl/objects.h:1014)
  1767.     ossl_x509ext.c:242: warning: ‘X509V3_EXT_nconf_nid’ is deprecated (declared at /usr/include/openssl/x509v3.h:536)
  1768.     ossl_x509ext.c: In function ‘ossl_x509ext_initialize’:
  1769.     ossl_x509ext.c:286: warning: passing argument 2 of ‘d2i_X509_EXTENSION’ from incompatible pointer type
  1770.     ossl_x509ext.c: In function ‘ossl_x509ext_set_oid’:
  1771.     ossl_x509ext.c:305: warning: ‘OBJ_txt2obj’ is deprecated (declared at /usr/include/openssl/objects.h:1010)
  1772.     ossl_x509ext.c:306: warning: ‘OBJ_txt2obj’ is deprecated (declared at /usr/include/openssl/objects.h:1010)
  1773.     ossl_x509ext.c:309: warning: ‘X509_EXTENSION_set_object’ is deprecated (declared at /usr/include/openssl/x509.h:1181)
  1774.     ossl_x509ext.c: In function ‘ossl_x509ext_set_value’:
  1775.     ossl_x509ext.c:323: warning: ‘CRYPTO_malloc’ is deprecated (declared at /usr/include/openssl/crypto.h:478)
  1776.     ossl_x509ext.c:327: warning: ‘CRYPTO_free’ is deprecated (declared at /usr/include/openssl/crypto.h:480)
  1777.     ossl_x509ext.c:330: warning: ‘ASN1_STRING_set’ is deprecated (declared at /usr/include/openssl/asn1.h:795)
  1778.     ossl_x509ext.c:331: warning: ‘CRYPTO_free’ is deprecated (declared at /usr/include/openssl/crypto.h:480)
  1779.     ossl_x509ext.c:335: warning: ‘CRYPTO_free’ is deprecated (declared at /usr/include/openssl/crypto.h:480)
  1780.     ossl_x509ext.c:337: warning: ‘X509_EXTENSION_set_data’ is deprecated (declared at /usr/include/openssl/x509.h:1184)
  1781.     ossl_x509ext.c: In function ‘ossl_x509ext_set_critical’:
  1782.     ossl_x509ext.c:348: warning: ‘X509_EXTENSION_set_critical’ is deprecated (declared at /usr/include/openssl/x509.h:1182)
  1783.     ossl_x509ext.c: In function ‘ossl_x509ext_get_oid’:
  1784.     ossl_x509ext.c:363: warning: ‘X509_EXTENSION_get_object’ is deprecated (declared at /usr/include/openssl/x509.h:1185)
  1785.     ossl_x509ext.c:364: warning: ‘OBJ_obj2nid’ is deprecated (declared at /usr/include/openssl/objects.h:1009)
  1786.     ossl_x509ext.c:365: warning: ‘OBJ_nid2sn’ is deprecated (declared at /usr/include/openssl/objects.h:1008)
  1787.     ossl_x509ext.c:367: warning: ‘BIO_new’ is deprecated (declared at /usr/include/openssl/bio.h:581)
  1788.     ossl_x509ext.c:367: warning: ‘BIO_s_mem’ is deprecated (declared at /usr/include/openssl/bio.h:616)
  1789.     ossl_x509ext.c:369: warning: ‘i2a_ASN1_OBJECT’ is deprecated (declared at /usr/include/openssl/asn1.h:888)
  1790.     ossl_x509ext.c: In function ‘ossl_x509ext_get_value’:
  1791.     ossl_x509ext.c:384: warning: ‘BIO_new’ is deprecated (declared at /usr/include/openssl/bio.h:581)
  1792.     ossl_x509ext.c:384: warning: ‘BIO_s_mem’ is deprecated (declared at /usr/include/openssl/bio.h:616)
  1793.     ossl_x509ext.c:386: warning: ‘X509V3_EXT_print’ is deprecated (declared at /usr/include/openssl/x509v3.h:598)
  1794.     ossl_x509ext.c:387: warning: ‘ASN1_STRING_print’ is deprecated (declared at /usr/include/openssl/asn1.h:1009)
  1795.     ossl_x509ext.c: In function ‘ossl_x509ext_get_critical’:
  1796.     ossl_x509ext.c:399: warning: ‘X509_EXTENSION_get_critical’ is deprecated (declared at /usr/include/openssl/x509.h:1187)
  1797.     /usr/bin/gcc -I. -I../.. -I../../. -I../.././ext/openssl -DRUBY_EXTCONF_H=\"extconf.h\" -I/opt/X11/include -D_XOPEN_SOURCE -D_DARWIN_C_SOURCE  -I/opt/X11/include -fno-common -g -O2  -fno-common -pipe -fno-common   -c ossl_x509name.c
  1798.     ossl_x509name.c: In function ‘ossl_x509name_new’:
  1799.     ossl_x509name.c:53: warning: ‘X509_NAME_dup’ is deprecated (declared at /usr/include/openssl/x509.h:876)
  1800.     ossl_x509name.c: In function ‘ossl_x509name_initialize’:
  1801.     ossl_x509name.c:143: warning: passing argument 2 of ‘d2i_X509_NAME’ from incompatible pointer type
  1802.     ossl_x509name.c: In function ‘ossl_x509name_add_entry’:
  1803.     ossl_x509name.c:169: warning: ‘X509_NAME_add_entry_by_txt’ is deprecated (declared at /usr/include/openssl/x509.h:1121)
  1804.     ossl_x509name.c: In function ‘ossl_x509name_to_s_old’:
  1805.     ossl_x509name.c:185: warning: ‘X509_NAME_oneline’ is deprecated (declared at /usr/include/openssl/x509.h:984)
  1806.     ossl_x509name.c:187: warning: ‘CRYPTO_free’ is deprecated (declared at /usr/include/openssl/crypto.h:480)
  1807.     ossl_x509name.c: In function ‘ossl_x509name_to_s’:
  1808.     ossl_x509name.c:209: warning: ‘BIO_new’ is deprecated (declared at /usr/include/openssl/bio.h:581)
  1809.     ossl_x509name.c:209: warning: ‘BIO_s_mem’ is deprecated (declared at /usr/include/openssl/bio.h:616)
  1810.     ossl_x509name.c:212: warning: ‘X509_NAME_print_ex’ is deprecated (declared at /usr/include/openssl/x509.h:1087)
  1811.     ossl_x509name.c:213: warning: ‘BIO_free’ is deprecated (declared at /usr/include/openssl/bio.h:583)
  1812.     ossl_x509name.c: In function ‘ossl_x509name_to_a’:
  1813.     ossl_x509name.c:236: warning: ‘X509_NAME_entry_count’ is deprecated (declared at /usr/include/openssl/x509.h:1097)
  1814.     ossl_x509name.c:243: warning: ‘X509_NAME_get_entry’ is deprecated (declared at /usr/include/openssl/x509.h:1108)
  1815.     ossl_x509name.c:246: warning: ‘i2t_ASN1_OBJECT’ is deprecated (declared at /usr/include/openssl/asn1.h:892)
  1816.     ossl_x509name.c:249: warning: ‘OBJ_nid2sn’ is deprecated (declared at /usr/include/openssl/objects.h:1008)
  1817.     ossl_x509name.c:249: warning: ‘OBJ_ln2nid’ is deprecated (declared at /usr/include/openssl/objects.h:1013)
  1818.     ossl_x509name.c: In function ‘ossl_x509name_cmp0’:
  1819.     ossl_x509name.c:266: warning: ‘X509_NAME_cmp’ is deprecated (declared at /usr/include/openssl/x509.h:1073)
  1820.     ossl_x509name.c: In function ‘ossl_x509name_hash’:
  1821.     ossl_x509name.c:304: warning: ‘X509_NAME_hash’ is deprecated (declared at /usr/include/openssl/x509.h:1074)
  1822.     /usr/bin/gcc -I. -I../.. -I../../. -I../.././ext/openssl -DRUBY_EXTCONF_H=\"extconf.h\" -I/opt/X11/include -D_XOPEN_SOURCE -D_DARWIN_C_SOURCE  -I/opt/X11/include -fno-common -g -O2  -fno-common -pipe -fno-common   -c ossl_x509req.c
  1823.     ossl_x509req.c: In function ‘ossl_x509req_new’:
  1824.     ossl_x509req.c:48: warning: ‘X509_REQ_dup’ is deprecated (declared at /usr/include/openssl/x509.h:870)
  1825.     ossl_x509req.c: In function ‘DupX509ReqPtr’:
  1826.     ossl_x509req.c:74: warning: ‘X509_REQ_dup’ is deprecated (declared at /usr/include/openssl/x509.h:870)
  1827.     ossl_x509req.c: In function ‘ossl_x509req_initialize’:
  1828.     ossl_x509req.c:112: warning: ‘BIO_ctrl’ is deprecated (declared at /usr/include/openssl/bio.h:590)
  1829.     ossl_x509req.c:113: warning: ‘d2i_X509_REQ_bio’ is deprecated (declared at /usr/include/openssl/x509.h:832)
  1830.     ossl_x509req.c:115: warning: ‘BIO_free’ is deprecated (declared at /usr/include/openssl/bio.h:583)
  1831.     ossl_x509req.c: In function ‘ossl_x509req_copy’:
  1832.     ossl_x509req.c:130: warning: ‘X509_REQ_dup’ is deprecated (declared at /usr/include/openssl/x509.h:870)
  1833.     ossl_x509req.c: In function ‘ossl_x509req_to_pem’:
  1834.     ossl_x509req.c:148: warning: ‘BIO_new’ is deprecated (declared at /usr/include/openssl/bio.h:581)
  1835.     ossl_x509req.c:148: warning: ‘BIO_s_mem’ is deprecated (declared at /usr/include/openssl/bio.h:616)
  1836.     ossl_x509req.c:152: warning: ‘BIO_free’ is deprecated (declared at /usr/include/openssl/bio.h:583)
  1837.     ossl_x509req.c:155: warning: ‘BIO_ctrl’ is deprecated (declared at /usr/include/openssl/bio.h:590)
  1838.     ossl_x509req.c:157: warning: ‘BIO_free’ is deprecated (declared at /usr/include/openssl/bio.h:583)
  1839.     ossl_x509req.c: In function ‘ossl_x509req_to_text’:
  1840.     ossl_x509req.c:191: warning: ‘BIO_new’ is deprecated (declared at /usr/include/openssl/bio.h:581)
  1841.     ossl_x509req.c:191: warning: ‘BIO_s_mem’ is deprecated (declared at /usr/include/openssl/bio.h:616)
  1842.     ossl_x509req.c:194: warning: ‘X509_REQ_print’ is deprecated (declared at /usr/include/openssl/x509.h:1094)
  1843.     ossl_x509req.c:195: warning: ‘BIO_free’ is deprecated (declared at /usr/include/openssl/bio.h:583)
  1844.     ossl_x509req.c:198: warning: ‘BIO_ctrl’ is deprecated (declared at /usr/include/openssl/bio.h:590)
  1845.     ossl_x509req.c:200: warning: ‘BIO_free’ is deprecated (declared at /usr/include/openssl/bio.h:583)
  1846.     ossl_x509req.c: In function ‘ossl_x509req_get_version’:
  1847.     ossl_x509req.c:232: warning: ‘ASN1_INTEGER_get’ is deprecated (declared at /usr/include/openssl/asn1.h:899)
  1848.     ossl_x509req.c: In function ‘ossl_x509req_set_version’:
  1849.     ossl_x509req.c:247: warning: ‘X509_REQ_set_version’ is deprecated (declared at /usr/include/openssl/x509.h:1021)
  1850.     ossl_x509req.c: In function ‘ossl_x509req_set_subject’:
  1851.     ossl_x509req.c:275: warning: ‘X509_REQ_set_subject_name’ is deprecated (declared at /usr/include/openssl/x509.h:1022)
  1852.     ossl_x509req.c: In function ‘ossl_x509req_get_signature_algorithm’:
  1853.     ossl_x509req.c:292: warning: ‘BIO_new’ is deprecated (declared at /usr/include/openssl/bio.h:581)
  1854.     ossl_x509req.c:292: warning: ‘BIO_s_mem’ is deprecated (declared at /usr/include/openssl/bio.h:616)
  1855.     ossl_x509req.c:295: warning: ‘i2a_ASN1_OBJECT’ is deprecated (declared at /usr/include/openssl/asn1.h:888)
  1856.     ossl_x509req.c:296: warning: ‘BIO_free’ is deprecated (declared at /usr/include/openssl/bio.h:583)
  1857.     ossl_x509req.c:299: warning: ‘BIO_ctrl’ is deprecated (declared at /usr/include/openssl/bio.h:590)
  1858.     ossl_x509req.c:301: warning: ‘BIO_free’ is deprecated (declared at /usr/include/openssl/bio.h:583)
  1859.     ossl_x509req.c: In function ‘ossl_x509req_get_public_key’:
  1860.     ossl_x509req.c:312: warning: ‘X509_REQ_get_pubkey’ is deprecated (declared at /usr/include/openssl/x509.h:1024)
  1861.     ossl_x509req.c: In function ‘ossl_x509req_set_public_key’:
  1862.     ossl_x509req.c:327: warning: ‘X509_REQ_set_pubkey’ is deprecated (declared at /usr/include/openssl/x509.h:1023)
  1863.     ossl_x509req.c: In function ‘ossl_x509req_sign’:
  1864.     ossl_x509req.c:344: warning: ‘X509_REQ_sign’ is deprecated (declared at /usr/include/openssl/x509.h:772)
  1865.     ossl_x509req.c: In function ‘ossl_x509req_verify’:
  1866.     ossl_x509req.c:363: warning: ‘X509_REQ_verify’ is deprecated (declared at /usr/include/openssl/x509.h:758)
  1867.     ossl_x509req.c: In function ‘ossl_x509req_get_attributes’:
  1868.     ossl_x509req.c:383: warning: ‘X509_REQ_get_attr_count’ is deprecated (declared at /usr/include/openssl/x509.h:1032)
  1869.     ossl_x509req.c:390: warning: ‘X509_REQ_get_attr’ is deprecated (declared at /usr/include/openssl/x509.h:1037)
  1870.     ossl_x509req.c: In function ‘ossl_x509req_set_attributes’:
  1871.     ossl_x509req.c:410: warning: ‘sk_pop_free’ is deprecated (declared at /usr/include/openssl/stack.h:89)
  1872.     ossl_x509req.c:415: warning: ‘X509_REQ_add1_attr’ is deprecated (declared at /usr/include/openssl/x509.h:1039)
  1873.     ossl_x509req.c: In function ‘ossl_x509req_add_attribute’:
  1874.     ossl_x509req.c:428: warning: ‘X509_REQ_add1_attr’ is deprecated (declared at /usr/include/openssl/x509.h:1039)
  1875.     /usr/bin/gcc -I. -I../.. -I../../. -I../.././ext/openssl -DRUBY_EXTCONF_H=\"extconf.h\" -I/opt/X11/include -D_XOPEN_SOURCE -D_DARWIN_C_SOURCE  -I/opt/X11/include -fno-common -g -O2  -fno-common -pipe -fno-common   -c ossl_x509revoked.c
  1876.     ossl_x509revoked.c: In function ‘ossl_x509revoked_new’:
  1877.     ossl_x509revoked.c:48: warning: ‘ASN1_dup’ is deprecated (declared at /usr/include/openssl/asn1.h:935)
  1878.     ossl_x509revoked.c:48: warning: passing argument 2 of ‘ASN1_dup’ from incompatible pointer type
  1879.     ossl_x509revoked.c: In function ‘DupX509RevokedPtr’:
  1880.     ossl_x509revoked.c:64: warning: ‘ASN1_dup’ is deprecated (declared at /usr/include/openssl/asn1.h:935)
  1881.     ossl_x509revoked.c:64: warning: passing argument 2 of ‘ASN1_dup’ from incompatible pointer type
  1882.     ossl_x509revoked.c: In function ‘ossl_x509revoked_set_time’:
  1883.     ossl_x509revoked.c:134: warning: ‘X509_time_adj’ is deprecated (declared at /usr/include/openssl/x509.h:883)
  1884.     ossl_x509revoked.c: In function ‘ossl_x509revoked_get_extensions’:
  1885.     ossl_x509revoked.c:152: warning: ‘X509_REVOKED_get_ext_count’ is deprecated (declared at /usr/include/openssl/x509.h:1166)
  1886.     ossl_x509revoked.c:159: warning: ‘X509_REVOKED_get_ext’ is deprecated (declared at /usr/include/openssl/x509.h:1170)
  1887.     ossl_x509revoked.c: In function ‘ossl_x509revoked_set_extensions’:
  1888.     ossl_x509revoked.c:182: warning: ‘sk_pop_free’ is deprecated (declared at /usr/include/openssl/stack.h:89)
  1889.     ossl_x509revoked.c:187: warning: ‘X509_REVOKED_add_ext’ is deprecated (declared at /usr/include/openssl/x509.h:1172)
  1890.     ossl_x509revoked.c: In function ‘ossl_x509revoked_add_extension’:
  1891.     ossl_x509revoked.c:201: warning: ‘X509_REVOKED_add_ext’ is deprecated (declared at /usr/include/openssl/x509.h:1172)
  1892.     /usr/bin/gcc -I. -I../.. -I../../. -I../.././ext/openssl -DRUBY_EXTCONF_H=\"extconf.h\" -I/opt/X11/include -D_XOPEN_SOURCE -D_DARWIN_C_SOURCE  -I/opt/X11/include -fno-common -g -O2  -fno-common -pipe -fno-common   -c ossl_x509store.c
  1893.     ossl_x509store.c: In function ‘ossl_x509store_new’:
  1894.     ossl_x509store.c:63: warning: ‘X509_STORE_free’ is deprecated (declared at /usr/include/openssl/x509_vfy.h:390)
  1895.     ossl_x509store.c: In function ‘DupX509StorePtr’:
  1896.     ossl_x509store.c:84: warning: ‘CRYPTO_add_lock’ is deprecated (declared at /usr/include/openssl/crypto.h:430)
  1897.     ossl_x509store.c: In function ‘ossl_x509store_alloc’:
  1898.     ossl_x509store.c:98: warning: ‘X509_STORE_new’ is deprecated (declared at /usr/include/openssl/x509_vfy.h:389)
  1899.     ossl_x509store.c:101: warning: ‘X509_STORE_free’ is deprecated (declared at /usr/include/openssl/x509_vfy.h:390)
  1900.     ossl_x509store.c: In function ‘ossl_x509store_set_flags’:
  1901.     ossl_x509store.c:161: warning: ‘X509_STORE_set_flags’ is deprecated (declared at /usr/include/openssl/x509_vfy.h:392)
  1902.     ossl_x509store.c: In function ‘ossl_x509store_set_purpose’:
  1903.     ossl_x509store.c:177: warning: ‘X509_STORE_set_purpose’ is deprecated (declared at /usr/include/openssl/x509_vfy.h:393)
  1904.     ossl_x509store.c: In function ‘ossl_x509store_set_trust’:
  1905.     ossl_x509store.c:193: warning: ‘X509_STORE_set_trust’ is deprecated (declared at /usr/include/openssl/x509_vfy.h:394)
  1906.     ossl_x509store.c: In function ‘ossl_x509store_add_file’:
  1907.     ossl_x509store.c:220: warning: ‘X509_STORE_add_lookup’ is deprecated (declared at /usr/include/openssl/x509_vfy.h:407)
  1908.     ossl_x509store.c:220: warning: ‘X509_LOOKUP_file’ is deprecated (declared at /usr/include/openssl/x509_vfy.h:410)
  1909.     ossl_x509store.c:222: warning: ‘X509_LOOKUP_ctrl’ is deprecated (declared at /usr/include/openssl/x509_vfy.h:419)
  1910.     ossl_x509store.c: In function ‘ossl_x509store_add_path’:
  1911.     ossl_x509store.c:241: warning: ‘X509_STORE_add_lookup’ is deprecated (declared at /usr/include/openssl/x509_vfy.h:407)
  1912.     ossl_x509store.c:241: warning: ‘X509_LOOKUP_hash_dir’ is deprecated (declared at /usr/include/openssl/x509_vfy.h:409)
  1913.     ossl_x509store.c:243: warning: ‘X509_LOOKUP_ctrl’ is deprecated (declared at /usr/include/openssl/x509_vfy.h:419)
  1914.     ossl_x509store.c: In function ‘ossl_x509store_set_default_paths’:
  1915.     ossl_x509store.c:256: warning: ‘X509_STORE_set_default_paths’ is deprecated (declared at /usr/include/openssl/x509_vfy.h:444)
  1916.     ossl_x509store.c: In function ‘ossl_x509store_add_cert’:
  1917.     ossl_x509store.c:271: warning: ‘X509_STORE_add_cert’ is deprecated (declared at /usr/include/openssl/x509_vfy.h:412)
  1918.     ossl_x509store.c: In function ‘ossl_x509store_add_crl’:
  1919.     ossl_x509store.c:286: warning: ‘X509_STORE_add_crl’ is deprecated (declared at /usr/include/openssl/x509_vfy.h:413)
  1920.     ossl_x509store.c: In function ‘ossl_x509stctx_free’:
  1921.     ossl_x509store.c:348: warning: ‘sk_pop_free’ is deprecated (declared at /usr/include/openssl/stack.h:89)
  1922.     ossl_x509store.c:351: warning: ‘X509_STORE_CTX_free’ is deprecated (declared at /usr/include/openssl/x509_vfy.h:401)
  1923.     ossl_x509store.c: In function ‘ossl_x509stctx_alloc’:
  1924.     ossl_x509store.c:360: warning: ‘X509_STORE_CTX_new’ is deprecated (declared at /usr/include/openssl/x509_vfy.h:397)
  1925.     ossl_x509store.c: In function ‘ossl_x509stctx_initialize’:
  1926.     ossl_x509store.c:388: warning: ‘X509_STORE_CTX_init’ is deprecated (declared at /usr/include/openssl/x509_vfy.h:403)
  1927.     ossl_x509store.c:389: warning: ‘sk_pop_free’ is deprecated (declared at /usr/include/openssl/stack.h:89)
  1928.     ossl_x509store.c: In function ‘ossl_x509stctx_verify’:
  1929.     ossl_x509store.c:413: warning: ‘X509_STORE_CTX_set_ex_data’ is deprecated (declared at /usr/include/openssl/x509_vfy.h:449)
  1930.     ossl_x509store.c:415: warning: ‘X509_verify_cert’ is deprecated (declared at /usr/include/openssl/x509.h:1241)
  1931.     ossl_x509store.c: In function ‘ossl_x509stctx_get_chain’:
  1932.     ossl_x509store.c:430: warning: ‘X509_STORE_CTX_get_chain’ is deprecated (declared at /usr/include/openssl/x509_vfy.h:455)
  1933.     ossl_x509store.c:433: warning: ‘sk_num’ is deprecated (declared at /usr/include/openssl/stack.h:81)
  1934.     ossl_x509store.c:439: warning: ‘sk_value’ is deprecated (declared at /usr/include/openssl/stack.h:82)
  1935.     ossl_x509store.c: In function ‘ossl_x509stctx_get_err’:
  1936.     ossl_x509store.c:453: warning: ‘X509_STORE_CTX_get_error’ is deprecated (declared at /usr/include/openssl/x509_vfy.h:451)
  1937.     ossl_x509store.c: In function ‘ossl_x509stctx_set_error’:
  1938.     ossl_x509store.c:462: warning: ‘X509_STORE_CTX_set_error’ is deprecated (declared at /usr/include/openssl/x509_vfy.h:452)
  1939.     ossl_x509store.c: In function ‘ossl_x509stctx_get_err_string’:
  1940.     ossl_x509store.c:474: warning: ‘X509_STORE_CTX_get_error’ is deprecated (declared at /usr/include/openssl/x509_vfy.h:451)
  1941.     ossl_x509store.c:476: warning: ‘X509_verify_cert_error_string’ is deprecated (declared at /usr/include/openssl/x509.h:752)
  1942.     ossl_x509store.c: In function ‘ossl_x509stctx_get_err_depth’:
  1943.     ossl_x509store.c:486: warning: ‘X509_STORE_CTX_get_error_depth’ is deprecated (declared at /usr/include/openssl/x509_vfy.h:453)
  1944.     ossl_x509store.c: In function ‘ossl_x509stctx_get_curr_cert’:
  1945.     ossl_x509store.c:496: warning: ‘X509_STORE_CTX_get_current_cert’ is deprecated (declared at /usr/include/openssl/x509_vfy.h:454)
  1946.     ossl_x509store.c: In function ‘ossl_x509stctx_cleanup’:
  1947.     ossl_x509store.c:520: warning: ‘X509_STORE_CTX_cleanup’ is deprecated (declared at /usr/include/openssl/x509_vfy.h:405)
  1948.     ossl_x509store.c: In function ‘ossl_x509stctx_set_flags’:
  1949.     ossl_x509store.c:532: warning: ‘X509_STORE_CTX_set_flags’ is deprecated (declared at /usr/include/openssl/x509_vfy.h:464)
  1950.     ossl_x509store.c: In function ‘ossl_x509stctx_set_purpose’:
  1951.     ossl_x509store.c:544: warning: ‘X509_STORE_CTX_set_purpose’ is deprecated (declared at /usr/include/openssl/x509_vfy.h:460)
  1952.     ossl_x509store.c: In function ‘ossl_x509stctx_set_trust’:
  1953.     ossl_x509store.c:556: warning: ‘X509_STORE_CTX_set_trust’ is deprecated (declared at /usr/include/openssl/x509_vfy.h:461)
  1954.     ossl_x509store.c: In function ‘ossl_x509stctx_set_time’:
  1955.     ossl_x509store.c:573: warning: ‘X509_STORE_CTX_set_time’ is deprecated (declared at /usr/include/openssl/x509_vfy.h:466)
  1956.     cc -dynamic -bundle -undefined suppress -flat_namespace -o ../../.ext/i686-darwin12.2.0/openssl.bundle openssl_missing.o ossl.o ossl_asn1.o ossl_bio.o ossl_bn.o ossl_cipher.o ossl_config.o ossl_digest.o ossl_engine.o ossl_hmac.o ossl_ns_spki.o ossl_ocsp.o ossl_pkcs12.o ossl_pkcs5.o ossl_pkcs7.o ossl_pkey.o ossl_pkey_dh.o ossl_pkey_dsa.o ossl_pkey_ec.o ossl_pkey_rsa.o ossl_rand.o ossl_ssl.o ossl_ssl_session.o ossl_x509.o ossl_x509attr.o ossl_x509cert.o ossl_x509crl.o ossl_x509ext.o ossl_x509name.o ossl_x509req.o ossl_x509revoked.o ossl_x509store.o -L. -L../.. -L.     -lruby -lssl -lcrypto  -ldl -lobjc  
  1957.     mkdir -p ../../.ext/common/net
  1958.     mkdir -p ../../.ext/common/openssl
  1959.     cp ../.././ext/openssl/lib/net/ftptls.rb ../../.ext/common/net
  1960.     cp ../.././ext/openssl/lib/net/telnets.rb ../../.ext/common/net
  1961.     cp ../.././ext/openssl/lib/openssl/bn.rb ../../.ext/common/openssl
  1962.     cp ../.././ext/openssl/lib/openssl/buffering.rb ../../.ext/common/openssl
  1963.     cp ../.././ext/openssl/lib/openssl/cipher.rb ../../.ext/common/openssl
  1964.     cp ../.././ext/openssl/lib/openssl/config.rb ../../.ext/common/openssl
  1965.     cp ../.././ext/openssl/lib/openssl/digest.rb ../../.ext/common/openssl
  1966.     cp ../.././ext/openssl/lib/openssl/pkcs7.rb ../../.ext/common/openssl
  1967.     cp ../.././ext/openssl/lib/openssl/ssl-internal.rb ../../.ext/common/openssl
  1968.     cp ../.././ext/openssl/lib/openssl/ssl.rb ../../.ext/common/openssl
  1969.     cp ../.././ext/openssl/lib/openssl/x509-internal.rb ../../.ext/common/openssl
  1970.     cp ../.././ext/openssl/lib/openssl/x509.rb ../../.ext/common/openssl
  1971.     cp ../.././ext/openssl/lib/openssl.rb ../../.ext/common
  1972.     compiling pty
  1973.     /usr/bin/gcc -I. -I../.. -I../../. -I../.././ext/pty -DHAVE_OPENPTY -I/opt/X11/include -D_XOPEN_SOURCE -D_DARWIN_C_SOURCE  -I/opt/X11/include -fno-common -g -O2  -fno-common -pipe -fno-common   -c pty.c
  1974.     cc -dynamic -bundle -undefined suppress -flat_namespace -o ../../.ext/i686-darwin12.2.0/pty.bundle pty.o -L. -L../.. -L.     -lruby -lutil  -ldl -lobjc  
  1975.     cp ../.././ext/pty/lib/expect.rb ../../.ext/common
  1976.     compiling racc/cparse
  1977.     mkdir -p ../../../.ext/i686-darwin12.2.0/racc
  1978.     /usr/bin/gcc -I. -I../../.. -I../../../. -I../../.././ext/racc/cparse -I/opt/X11/include -D_XOPEN_SOURCE -D_DARWIN_C_SOURCE   -fno-common -g -O2  -fno-common -pipe -fno-common   -c cparse.c
  1979.     cc -dynamic -bundle -undefined suppress -flat_namespace -o ../../../.ext/i686-darwin12.2.0/racc/cparse.bundle cparse.o -L. -L../../.. -L.     -lruby  -ldl -lobjc  
  1980.     compiling readline
  1981.     /usr/bin/gcc -I. -I../.. -I../../. -I../.././ext/readline -DHAVE_READLINE_READLINE_H -DHAVE_READLINE_HISTORY_H -DHAVE_RL_FILENAME_COMPLETION_FUNCTION -DHAVE_RL_COMPLETION_MATCHES -DHAVE_RL_DEPREP_TERM_FUNCTION -DHAVE_RL_COMPLETION_APPEND_CHARACTER -DHAVE_RL_BASIC_WORD_BREAK_CHARACTERS -DHAVE_RL_COMPLETER_WORD_BREAK_CHARACTERS -DHAVE_RL_COMPLETER_QUOTE_CHARACTERS -DHAVE_RL_ATTEMPTED_COMPLETION_OVER -DHAVE_RL_LIBRARY_VERSION -DHAVE_RL_CLEANUP_AFTER_SIGNAL -DHAVE_REPLACE_HISTORY_ENTRY -DHAVE_REMOVE_HISTORY -I/opt/X11/include -D_XOPEN_SOURCE -D_DARWIN_C_SOURCE  -I/opt/X11/include -fno-common -g -O2  -fno-common -pipe -fno-common   -c readline.c
  1982.     readline.c: In function ‘rb_remove_history’:
  1983.     readline.c:608: warning: passing argument 1 of ‘free’ discards qualifiers from pointer target type
  1984.     cc -dynamic -bundle -undefined suppress -flat_namespace -o ../../.ext/i686-darwin12.2.0/readline.bundle readline.o -L. -L../.. -L.     -lruby -lreadline -lncurses  -ldl -lobjc  
  1985.     compiling sdbm
  1986.     /usr/bin/gcc -I. -I../.. -I../../. -I../.././ext/sdbm -I/opt/X11/include -D_XOPEN_SOURCE -D_DARWIN_C_SOURCE   -fno-common -g -O2  -fno-common -pipe -fno-common   -c _sdbm.c
  1987.     /usr/bin/gcc -I. -I../.. -I../../. -I../.././ext/sdbm -I/opt/X11/include -D_XOPEN_SOURCE -D_DARWIN_C_SOURCE   -fno-common -g -O2  -fno-common -pipe -fno-common   -c init.c
  1988.     cc -dynamic -bundle -undefined suppress -flat_namespace -o ../../.ext/i686-darwin12.2.0/sdbm.bundle _sdbm.o init.o -L. -L../.. -L.     -lruby  -ldl -lobjc  
  1989.     compiling socket
  1990.     /usr/bin/gcc -I. -I../.. -I../../. -I../.././ext/socket -DHAVE_ARPA_INET_H -DENABLE_IPV6 -DINET6 -DHAVE_SIN_LEN -DHAVE_SOCKADDR_STORAGE -DHAVE_SA_LEN  -DHAVE_NETINET_TCP_H -DHAVE_NETINET_UDP_H -DHAVE_SENDMSG -DHAVE_RECVMSG -DHAVE_ST_MSG_CONTROL -DHAVE_TYPE_STRUCT_ADDRINFO -DHAVE_FREEHOSTENT -DHAVE_FREEADDRINFO -DHAVE_GAI_STRERROR -DGAI_STRERROR_CONST -DHAVE_GETNAMEINFO -DHAVE_GETADDRINFO -DHAVE_TYPE_SOCKLEN_T -DHAVE_SYS_UN_H -DHAVE_SYS_UIO_H -DHAVE_SOCKET -DHAVE_GETIPNODEBYNAME -DHAVE_SOCKETPAIR -DHAVE_GETHOSTNAME -I/opt/X11/include -D_XOPEN_SOURCE -D_DARWIN_C_SOURCE  -I/opt/X11/include -fno-common -g -O2  -fno-common -pipe -fno-common   -c socket.c
  1991.     cc -dynamic -bundle -undefined suppress -flat_namespace -o ../../.ext/i686-darwin12.2.0/socket.bundle socket.o -L. -L../.. -L.     -lruby  -ldl -lobjc  
  1992.     compiling stringio
  1993.     /usr/bin/gcc -I. -I../.. -I../../. -I../.././ext/stringio -I/opt/X11/include -D_XOPEN_SOURCE -D_DARWIN_C_SOURCE   -fno-common -g -O2  -fno-common -pipe -fno-common   -c stringio.c
  1994.     cc -dynamic -bundle -undefined suppress -flat_namespace -o ../../.ext/i686-darwin12.2.0/stringio.bundle stringio.o -L. -L../.. -L.     -lruby  -ldl -lobjc  
  1995.     compiling strscan
  1996.     /usr/bin/gcc -I. -I../.. -I../../. -I../.././ext/strscan -I/opt/X11/include -D_XOPEN_SOURCE -D_DARWIN_C_SOURCE   -fno-common -g -O2  -fno-common -pipe -fno-common   -c strscan.c
  1997.     cc -dynamic -bundle -undefined suppress -flat_namespace -o ../../.ext/i686-darwin12.2.0/strscan.bundle strscan.o -L. -L../.. -L.     -lruby  -ldl -lobjc  
  1998.     compiling syck
  1999.     /usr/bin/gcc -I. -I../.. -I../../. -I../.././ext/syck -DHAVE_ST_H -I/opt/X11/include -D_XOPEN_SOURCE -D_DARWIN_C_SOURCE   -fno-common -g -O2  -fno-common -pipe -fno-common   -c bytecode.c
  2000.     /usr/bin/gcc -I. -I../.. -I../../. -I../.././ext/syck -DHAVE_ST_H -I/opt/X11/include -D_XOPEN_SOURCE -D_DARWIN_C_SOURCE   -fno-common -g -O2  -fno-common -pipe -fno-common   -c emitter.c
  2001.     /usr/bin/gcc -I. -I../.. -I../../. -I../.././ext/syck -DHAVE_ST_H -I/opt/X11/include -D_XOPEN_SOURCE -D_DARWIN_C_SOURCE   -fno-common -g -O2  -fno-common -pipe -fno-common   -c gram.c
  2002.     /usr/bin/gcc -I. -I../.. -I../../. -I../.././ext/syck -DHAVE_ST_H -I/opt/X11/include -D_XOPEN_SOURCE -D_DARWIN_C_SOURCE   -fno-common -g -O2  -fno-common -pipe -fno-common   -c handler.c
  2003.     /usr/bin/gcc -I. -I../.. -I../../. -I../.././ext/syck -DHAVE_ST_H -I/opt/X11/include -D_XOPEN_SOURCE -D_DARWIN_C_SOURCE   -fno-common -g -O2  -fno-common -pipe -fno-common   -c implicit.c
  2004.     /usr/bin/gcc -I. -I../.. -I../../. -I../.././ext/syck -DHAVE_ST_H -I/opt/X11/include -D_XOPEN_SOURCE -D_DARWIN_C_SOURCE   -fno-common -g -O2  -fno-common -pipe -fno-common   -c node.c
  2005.     /usr/bin/gcc -I. -I../.. -I../../. -I../.././ext/syck -DHAVE_ST_H -I/opt/X11/include -D_XOPEN_SOURCE -D_DARWIN_C_SOURCE   -fno-common -g -O2  -fno-common -pipe -fno-common   -c rubyext.c
  2006.     /usr/bin/gcc -I. -I../.. -I../../. -I../.././ext/syck -DHAVE_ST_H -I/opt/X11/include -D_XOPEN_SOURCE -D_DARWIN_C_SOURCE   -fno-common -g -O2  -fno-common -pipe -fno-common   -c syck.c
  2007.     syck.c: In function ‘syck_default_error_handler’:
  2008.     syck.c:502: warning: format ‘%d’ expects type ‘int’, but argument 3 has type ‘long int’
  2009.     syck.c:502: warning: format ‘%d’ expects type ‘int’, but argument 3 has type ‘long int’
  2010.     /usr/bin/gcc -I. -I../.. -I../../. -I../.././ext/syck -DHAVE_ST_H -I/opt/X11/include -D_XOPEN_SOURCE -D_DARWIN_C_SOURCE   -fno-common -g -O2  -fno-common -pipe -fno-common   -c token.c
  2011.     /usr/bin/gcc -I. -I../.. -I../../. -I../.././ext/syck -DHAVE_ST_H -I/opt/X11/include -D_XOPEN_SOURCE -D_DARWIN_C_SOURCE   -fno-common -g -O2  -fno-common -pipe -fno-common   -c yaml2byte.c
  2012.     cc -dynamic -bundle -undefined suppress -flat_namespace -o ../../.ext/i686-darwin12.2.0/syck.bundle bytecode.o emitter.o gram.o handler.o implicit.o node.o rubyext.o syck.o token.o yaml2byte.o -L. -L../.. -L.     -lruby  -ldl -lobjc  
  2013.     compiling syslog
  2014.     /usr/bin/gcc -I. -I../.. -I../../. -I../.././ext/syslog -DHAVE_SYSLOG_H -DHAVE_OPENLOG -DHAVE_SETLOGMASK -I/opt/X11/include -D_XOPEN_SOURCE -D_DARWIN_C_SOURCE  -I/opt/X11/include -fno-common -g -O2  -fno-common -pipe -fno-common   -c syslog.c
  2015.     cc -dynamic -bundle -undefined suppress -flat_namespace -o ../../.ext/i686-darwin12.2.0/syslog.bundle syslog.o -L. -L../.. -L.     -lruby  -ldl -lobjc  
  2016.     compiling thread
  2017.     /usr/bin/gcc -I. -I../.. -I../../. -I../.././ext/thread -I/opt/X11/include -D_XOPEN_SOURCE -D_DARWIN_C_SOURCE   -DUSE_MEM_POOLS -fno-common -g -O2  -fno-common -pipe -fno-common   -c thread.c
  2018.     cc -dynamic -bundle -undefined suppress -flat_namespace -o ../../.ext/i686-darwin12.2.0/thread.bundle thread.o -L. -L../.. -L.     -lruby  -ldl -lobjc  
  2019.     cp ../.././ext/thread/lib/thread.rb ../../.ext/common
  2020.     compiling tk
  2021.     check functions.........
  2022.     check struct members..
  2023.     check libraries....
  2024.     Use ActiveTcl libraries (if available).
  2025.     Search tclConfig.sh and tkConfig.sh..
  2026.     WARNING: found "/System/Library/Frameworks/Tcl.framework/tclConfig.sh", but it WITH nativethread-support under ruby WITHOUT nativethread-support. So, ignore it.
  2027.    
  2028.     WARNING: found "/System/Library/Frameworks/Tcl.framework/tclconfig.sh", but it WITH nativethread-support under ruby WITHOUT nativethread-support. So, ignore it.
  2029.     ............
  2030.     WARNING: found "/usr/lib/tclConfig.sh", but it WITH nativethread-support under ruby WITHOUT nativethread-support. So, ignore it.
  2031.    
  2032.     WARNING: found "/usr/lib/tclconfig.sh", but it WITH nativethread-support under ruby WITHOUT nativethread-support. So, ignore it.
  2033.     ..........
  2034.     WARNING: found "/System/Library/Frameworks/Tcl.framework/Versions/Current/tclConfig.sh", but it WITH nativethread-support under ruby WITHOUT nativethread-support. So, ignore it.
  2035.    
  2036.     WARNING: found "/System/Library/Frameworks/Tcl.framework/Versions/Current/tclconfig.sh", but it WITH nativethread-support under ruby WITHOUT nativethread-support. So, ignore it.
  2037.     .
  2038.     WARNING: found "/System/Library/Frameworks/Tcl.framework/Versions/8.5/tclConfig.sh", but it WITH nativethread-support under ruby WITHOUT nativethread-support. So, ignore it.
  2039.    
  2040.     WARNING: found "/System/Library/Frameworks/Tcl.framework/Versions/8.5/tclconfig.sh", but it WITH nativethread-support under ruby WITHOUT nativethread-support. So, ignore it.
  2041.     .
  2042.     WARNING: found "/System/Library/Frameworks/Tcl.framework/Versions/8.4/tclConfig.sh", but it WITH nativethread-support under ruby WITHOUT nativethread-support. So, ignore it.
  2043.    
  2044.     WARNING: found "/System/Library/Frameworks/Tcl.framework/Versions/8.4/tclconfig.sh", but it WITH nativethread-support under ruby WITHOUT nativethread-support. So, ignore it.
  2045.    
  2046.     Fail to find [tclConfig.sh, tkConfig.sh]
  2047.     Use MacOS X Frameworks.
  2048.    
  2049.     Find Tcl/Tk libraries. Make tcltklib.so which is required by Ruby/Tk.
  2050.     /usr/bin/gcc -I. -I../.. -I../../. -I../.././ext/tk -DHAVE_RB_SAFE_LEVEL -DHAVE_RB_HASH_LOOKUP -DHAVE_RB_PROC_NEW -DHAVE_RB_OBJ_TAINT -DHAVE_ST_PTR -DHAVE_ST_LEN -DRUBY_VERSION=\"1.8.7\" -DRUBY_RELEASE_DATE=\"2012-06-29\" -I/opt/X11/include -D_XOPEN_SOURCE -D_DARWIN_C_SOURCE  -I/opt/X11/include -DWITH_TCL_ENABLE_THREAD=0 -fno-common -g -O2  -fno-common -pipe -fno-common   -c stubs.c
  2051.     In file included from stubs.c:10:
  2052.     /usr/include/tk.h:78:23: error: X11/Xlib.h: No such file or directory
  2053.     In file included from stubs.c:10:
  2054.     /usr/include/tk.h:549: error: expected declaration specifiers or ‘...’ before ‘Window’
  2055.     /usr/include/tk.h:549: error: ‘Window’ declared as function returning a function
  2056.     /usr/include/tk.h:552: error: expected declaration specifiers or ‘...’ before ‘XEvent’
  2057.     /usr/include/tk.h:561: error: expected specifier-qualifier-list before ‘Tk_ClassCreateProc’
  2058.     /usr/include/tk.h:655: error: expected specifier-qualifier-list before ‘Bool’
  2059.     /usr/include/tk.h:677: error: expected specifier-qualifier-list before ‘Bool’
  2060.     /usr/include/tk.h:756: error: expected specifier-qualifier-list before ‘Display’
  2061.     /usr/include/tk.h:902: error: expected declaration specifiers or ‘...’ before ‘XPoint’
  2062.     /usr/include/tk.h:996: error: expected declaration specifiers or ‘...’ before ‘Display’
  2063.     /usr/include/tk.h:998: error: expected declaration specifiers or ‘...’ before ‘Display’
  2064.     /usr/include/tk.h:998: error: expected declaration specifiers or ‘...’ before ‘Drawable’
  2065.     /usr/include/tk.h:1099: error: expected specifier-qualifier-list before ‘XColor’
  2066.     /usr/include/tk.h:1162: error: expected specifier-qualifier-list before ‘GC’
  2067.     /usr/include/tk.h:1204: error: expected declaration specifiers or ‘...’ before ‘Display’
  2068.     /usr/include/tk.h:1204: error: expected declaration specifiers or ‘...’ before ‘Drawable’
  2069.     /usr/include/tk.h:1207: error: expected declaration specifiers or ‘...’ before ‘Display’
  2070.     /usr/include/tk.h:1403: error: expected declaration specifiers or ‘...’ before ‘Drawable’
  2071.     /usr/include/tk.h:1513: error: expected declaration specifiers or ‘...’ before ‘XErrorEvent’
  2072.     /usr/include/tk.h:1515: error: expected declaration specifiers or ‘...’ before ‘XEvent’
  2073.     /usr/include/tk.h:1517: error: expected declaration specifiers or ‘...’ before ‘XEvent’
  2074.     /usr/include/tk.h:1519: error: expected declaration specifiers or ‘...’ before ‘XEvent’
  2075.     /usr/include/tk.h:1524: error: expected declaration specifiers or ‘...’ before ‘XEvent’
  2076.     In file included from /usr/include/tk.h:1537,
  2077.                      from stubs.c:10:
  2078.     /usr/include/tkDecls.h:42: error: expected ‘=’, ‘,’, ‘;’, ‘asm’ or ‘__attribute__’ before ‘*’ token
  2079.     /usr/include/tkDecls.h:47: error: expected ‘=’, ‘,’, ‘;’, ‘asm’ or ‘__attribute__’ before ‘Tk_3DBorderGC’
  2080.     /usr/include/tkDecls.h:54: error: expected declaration specifiers or ‘...’ before ‘Drawable’
  2081.     /usr/include/tkDecls.h:62: error: expected declaration specifiers or ‘...’ before ‘Drawable’
  2082.     /usr/include/tkDecls.h:76: error: expected declaration specifiers or ‘...’ before ‘XEvent’
  2083.     /usr/include/tkDecls.h:108: error: expected declaration specifiers or ‘...’ before ‘Pixmap’
  2084.     /usr/include/tkDecls.h:115: error: expected declaration specifiers or ‘...’ before ‘XColor’
  2085.     /usr/include/tkDecls.h:133: error: expected declaration specifiers or ‘...’ before ‘Pixmap’
  2086.     /usr/include/tkDecls.h:143: error: expected declaration specifiers or ‘...’ before ‘GC’
  2087.     /usr/include/tkDecls.h:176: error: expected declaration specifiers or ‘...’ before ‘XSetWindowAttributes’
  2088.     /usr/include/tkDecls.h:188: error: expected declaration specifiers or ‘...’ before ‘Atom’
  2089.     /usr/include/tkDecls.h:194: error: expected declaration specifiers or ‘...’ before ‘Atom’
  2090.     /usr/include/tkDecls.h:194: error: expected declaration specifiers or ‘...’ before ‘Atom’
  2091.     /usr/include/tkDecls.h:231: error: expected declaration specifiers or ‘...’ before ‘XWindowChanges’
  2092.     /usr/include/tkDecls.h:263: error: expected ‘)’ before ‘*’ token
  2093.     /usr/include/tkDecls.h:300: error: expected declaration specifiers or ‘...’ before ‘Atom’
  2094.     /usr/include/tkDecls.h:301: error: expected declaration specifiers or ‘...’ before ‘Atom’
  2095.     /usr/include/tkDecls.h:302: error: expected declaration specifiers or ‘...’ before ‘Atom’
  2096.     /usr/include/tkDecls.h:372: error: expected declaration specifiers or ‘...’ before ‘Atom’
  2097.     /usr/include/tkDecls.h:373: error: expected declaration specifiers or ‘...’ before ‘Atom’
  2098.     /usr/include/tkDecls.h:394: error: expected declaration specifiers or ‘...’ before ‘Drawable’
  2099.     /usr/include/tkDecls.h:395: error: expected declaration specifiers or ‘...’ before ‘XPoint’
  2100.     /usr/include/tkDecls.h:403: error: expected declaration specifiers or ‘...’ before ‘Drawable’
  2101.     /usr/include/tkDecls.h:410: error: expected ‘)’ before ‘*’ token
  2102.     /usr/include/tkDecls.h:417: error: expected declaration specifiers or ‘...’ before ‘GC’
  2103.     /usr/include/tkDecls.h:418: error: expected declaration specifiers or ‘...’ before ‘Drawable’
  2104.     /usr/include/tkDecls.h:423: error: expected ‘)’ before ‘*’ token
  2105.     /usr/include/tkDecls.h:431: error: expected declaration specifiers or ‘...’ before ‘Drawable’
  2106.     /usr/include/tkDecls.h:432: error: expected declaration specifiers or ‘...’ before ‘XPoint’
  2107.     /usr/include/tkDecls.h:440: error: expected declaration specifiers or ‘...’ before ‘Drawable’
  2108.     /usr/include/tkDecls.h:453: error: expected ‘=’, ‘,’, ‘;’, ‘asm’ or ‘__attribute__’ before ‘Tk_FontId’
  2109.     /usr/include/tkDecls.h:463: error: expected ‘)’ before ‘*’ token
  2110.     /usr/include/tkDecls.h:468: error: expected ‘)’ before ‘*’ token
  2111.     /usr/include/tkDecls.h:473: error: expected ‘)’ before ‘*’ token
  2112.     /usr/include/tkDecls.h:478: error: expected ‘)’ before ‘*’ token
  2113.     /usr/include/tkDecls.h:488: error: expected ‘)’ before ‘*’ token
  2114.     /usr/include/tkDecls.h:499: error: expected declaration specifiers or ‘...’ before ‘Display’
  2115.     /usr/include/tkDecls.h:504: error: expected ‘)’ before ‘*’ token
  2116.     /usr/include/tkDecls.h:514: error: expected ‘)’ before ‘*’ token
  2117.     /usr/include/tkDecls.h:519: error: expected ‘=’, ‘,’, ‘;’, ‘asm’ or ‘__attribute__’ before ‘Tk_GCForColor’
  2118.     /usr/include/tkDecls.h:549: error: expected declaration specifiers or ‘...’ before ‘Atom’
  2119.     /usr/include/tkDecls.h:561: error: expected ‘=’, ‘,’, ‘;’, ‘asm’ or ‘__attribute__’ before ‘Tk_GetBitmap’
  2120.     /usr/include/tkDecls.h:567: error: expected ‘=’, ‘,’, ‘;’, ‘asm’ or ‘__attribute__’ before ‘Tk_GetBitmapFromData’
  2121.     /usr/include/tkDecls.h:580: error: expected ‘=’, ‘,’, ‘;’, ‘asm’ or ‘__attribute__’ before ‘*’ token
  2122.     /usr/include/tkDecls.h:586: error: expected ‘=’, ‘,’, ‘;’, ‘asm’ or ‘__attribute__’ before ‘*’ token
  2123.     /usr/include/tkDecls.h:591: error: expected ‘=’, ‘,’, ‘;’, ‘asm’ or ‘__attribute__’ before ‘Tk_GetColormap’
  2124.     /usr/include/tkDecls.h:628: error: expected ‘=’, ‘,’, ‘;’, ‘asm’ or ‘__attribute__’ before ‘Tk_GetGC’
  2125.     /usr/include/tkDecls.h:682: error: expected ‘=’, ‘,’, ‘;’, ‘asm’ or ‘__attribute__’ before ‘Tk_GetPixmap’
  2126.     /usr/include/tkDecls.h:714: error: expected declaration specifiers or ‘...’ before ‘Atom’
  2127.     /usr/include/tkDecls.h:714: error: expected declaration specifiers or ‘...’ before ‘Atom’
  2128.     /usr/include/tkDecls.h:725: error: expected ‘=’, ‘,’, ‘;’, ‘asm’ or ‘__attribute__’ before ‘*’ token
  2129.     /usr/include/tkDecls.h:744: error: expected ‘)’ before ‘*’ token
  2130.     /usr/include/tkDecls.h:749: error: expected ‘)’ before ‘*’ token
  2131.     /usr/include/tkDecls.h:766: error: expected ‘=’, ‘,’, ‘;’, ‘asm’ or ‘__attribute__’ before ‘Tk_InternAtom’
  2132.     /usr/include/tkDecls.h:839: error: expected ‘)’ before ‘*’ token
  2133.     /usr/include/tkDecls.h:849: error: expected ‘)’ before ‘*’ token
  2134.     /usr/include/tkDecls.h:854: error: expected ‘)’ before ‘*’ token
  2135.     /usr/include/tkDecls.h:891: error: expected declaration specifiers or ‘...’ before ‘Atom’
  2136.     /usr/include/tkDecls.h:960: error: expected ‘)’ before ‘*’ token
  2137.     /usr/include/tkDecls.h:966: error: expected ‘)’ before ‘*’ token
  2138.     /usr/include/tkDecls.h:974: error: expected declaration specifiers or ‘...’ before ‘Drawable’
  2139.     /usr/include/tkDecls.h:1037: error: expected declaration specifiers or ‘...’ before ‘Pixmap’
  2140.     /usr/include/tkDecls.h:1054: error: expected declaration specifiers or ‘...’ before ‘Pixmap’
  2141.     /usr/include/tkDecls.h:1060: error: expected declaration specifiers or ‘...’ before ‘Colormap’
  2142.     /usr/include/tkDecls.h:1065: error: expected declaration specifiers or ‘...’ before ‘Visual’
  2143.     /usr/include/tkDecls.h:1066: error: expected declaration specifiers or ‘...’ before ‘Colormap’
  2144.     /usr/include/tkDecls.h:1071: error: expected ‘)’ before ‘*’ token
  2145.     /usr/include/tkDecls.h:1105: error: expected ‘)’ before ‘*’ token
  2146.     /usr/include/tkDecls.h:1113: error: expected ‘)’ before ‘*’ token
  2147.     /usr/include/tkDecls.h:1148: error: expected ‘=’, ‘,’, ‘;’, ‘asm’ or ‘__attribute__’ before ‘Tk_AllocBitmapFromObj’
  2148.     /usr/include/tkDecls.h:1160: error: expected ‘=’, ‘,’, ‘;’, ‘asm’ or ‘__attribute__’ before ‘*’ token
  2149.     /usr/include/tkDecls.h:1240: error: expected ‘=’, ‘,’, ‘;’, ‘asm’ or ‘__attribute__’ before ‘Tk_GetBitmapFromObj’
  2150.     /usr/include/tkDecls.h:1245: error: expected ‘=’, ‘,’, ‘;’, ‘asm’ or ‘__attribute__’ before ‘*’ token
  2151.     /usr/include/tkDecls.h:1356: error: expected ‘)’ before ‘*’ token
  2152.     /usr/include/tkDecls.h:1362: error: expected ‘)’ before ‘*’ token
  2153.     /usr/include/tkDecls.h:1387: error: expected declaration specifiers or ‘...’ before ‘GC’
  2154.     /usr/include/tkDecls.h:1399: error: expected declaration specifiers or ‘...’ before ‘GC’
  2155.     /usr/include/tkDecls.h:1413: error: expected declaration specifiers or ‘...’ before ‘Pixmap’
  2156.     /usr/include/tkDecls.h:1420: error: expected declaration specifiers or ‘...’ before ‘XColor’
  2157.     /usr/include/tkDecls.h:1448: error: expected declaration specifiers or ‘...’ before ‘Pixmap’
  2158.     /usr/include/tkDecls.h:1524: error: expected ‘)’ before ‘*’ token
  2159.     /usr/include/tkDecls.h:1621: error: expected declaration specifiers or ‘...’ before ‘Drawable’
  2160.     /usr/include/tkDecls.h:1656: error: expected ‘)’ before ‘*’ token
  2161.     /usr/include/tkDecls.h:1661: error: expected ‘)’ before ‘*’ token
  2162.     /usr/include/tkDecls.h:1692: error: expected specifier-qualifier-list before ‘XColor’
  2163.     make[1]: *** [stubs.o] Error 1
  2164.     make: *** [all] Error 1
clone this paste RAW Paste Data