This week only. Pastebin PRO Accounts Christmas Special! Don't miss out!Want more features on Pastebin? Sign Up, it's FREE!
Guest

Arch KDE Firefox fail to build

By: a guest on Aug 1st, 2013  |  syntax: None  |  size: 7.99 KB  |  views: 87  |  expires: Never
download  |  raw  |  embed  |  report abuse  |  print
Text below is selected. Please press Ctrl+C to copy to your clipboard. (⌘+C on Mac)
  1. ==> Entering fakeroot environment...
  2. ==> Starting package()...
  3. Adding client.mk options from /home/justin/builds/firefox-kde-opensuse/src/mozilla-release/.mozconfig:
  4.     BUILD_OFFICIAL=1
  5.     MOZILLA_OFFICIAL=1
  6. make  -j8 -C obj-x86_64-unknown-linux-gnu install
  7. make[1]: Entering directory `/home/justin/builds/firefox-kde-opensuse/src/mozilla-release/obj-x86_64-unknown-linux-gnu'
  8. make[2]: Entering directory `/home/justin/builds/firefox-kde-opensuse/src/mozilla-release/obj-x86_64-unknown-linux-gnu/browser/installer'
  9. /home/justin/builds/firefox-kde-opensuse/src/mozilla-release/obj-x86_64-unknown-linux-gnu/_virtualenv/bin/python /home/justin/builds/firefox-kde-opensuse/src/mozilla-release/config/Preprocessor.py -DMOZ_GLUE_IN_PROGRAM -DNO_NSPR_10_SUPPORT -DAB_CD=en-US -DMOZ_APP_NAME=firefox -DPREF_DIR=defaults/preferences -DMOZ_ENABLE_GNOME_COMPONENT=1 -DMOZ_GTK2=1 -DMOZ_NATIVE_NSPR=1 -DMOZ_NATIVE_NSS=1 -DJAREXT= -DMOZ_CHILD_PROCESS_NAME=plugin-container -DMOZ_JSDEBUGGER -DNECKO_WIFI -DDLL_PREFIX=lib -DDLL_SUFFIX=.so -DBIN_SUFFIX= -DBINPATH=bin -DHAVE_64BIT_OS=1 -DJSGC_INCREMENTAL=1 -DMOZ_ENABLE_PROFILER_SPS=1 -DMOZILLA_VERSION=\"22.0\" -DMOZILLA_VERSION_U=22.0 -DMOZILLA_UAVERSION=\"22.0\" -DD_INO=d_ino -DSTDC_HEADERS=1 -DHAVE_SSIZE_T=1 -DHAVE_ST_BLKSIZE=1 -DHAVE_SIGINFO_T=1 -DHAVE_UINT=1 -DHAVE_UNAME_DOMAINNAME_FIELD=1 -DHAVE_VISIBILITY_HIDDEN_ATTRIBUTE=1 -DHAVE_VISIBILITY_ATTRIBUTE=1 -DHAVE_DIRENT_H=1 -DHAVE_GETOPT_H=1 -DHAVE_SYS_BITYPES_H=1 -DHAVE_MEMORY_H=1 -DHAVE_UNISTD_H=1 -DHAVE_GNU_LIBC_VERSION_H=1 -DHAVE_NL_TYPES_H=1 -DHAVE_MALLOC_H=1 -DHAVE_X11_XKBLIB_H=1 -DHAVE_CPUID_H=1 -DHAVE_SYS_QUOTA_H=1 -DHAVE_SYS_SYSMACROS_H=1 -DHAVE_LINUX_QUOTA_H=1 -DHAVE_LINUX_IF_ADDR_H=1 -DHAVE_LINUX_RTNETLINK_H=1 -DHAVE_SYS_TYPES_H=1 -DHAVE_NETINET_IN_H=1 -DHAVE_BYTESWAP_H=1 -DHAVE_SYS_CDEFS_H=1 -DHAVE_DLOPEN=1 -DHAVE_DLADDR=1 -DHAVE_MEMMEM=1 -DFUNCPROTO=15 -DHAVE_LIBXSS=1 -D_REENTRANT=1 -DHAVE_RANDOM=1 -DHAVE_STRERROR=1 -DHAVE_LCHOWN=1 -DHAVE_FCHMOD=1 -DHAVE_SNPRINTF=1 -DHAVE_MEMMOVE=1 -DHAVE_STAT64=1 -DHAVE_LSTAT64=1 -DHAVE_TRUNCATE64=1 -DHAVE_SETBUF=1 -DHAVE_ISATTY=1 -DHAVE_FLOCKFILE=1 -DHAVE_LOCALTIME_R=1 -DHAVE_STRTOK_R=1 -DHAVE_CLOCK_MONOTONIC=1 -DHAVE_RES_NINIT=1 -DHAVE_GNU_GET_LIBC_VERSION=1 -DHAVE_LANGINFO_CODESET=1 -DVA_COPY=va_copy -DHAVE_VA_COPY=1 -DHAVE_VA_LIST_AS_ARRAY=1 -DHAVE_THREAD_TLS_KEYWORD=1 -DMALLOC_H=\<malloc.h\> -DHAVE_STRNDUP=1 -DHAVE_POSIX_MEMALIGN=1 -DHAVE_MEMALIGN=1 -DHAVE_VALLOC=1 -DHAVE_MALLOC_USABLE_SIZE=1 -DHAVE_I18N_LC_MESSAGES=1 -DHAVE_LOCALECONV=1 -DNS_ATTR_MALLOC=__attribute__\(\(malloc\)\) -DNS_WARN_UNUSED_RESULT=__attribute__\(\(warn_unused_result\)\) -DHAVE_LIBPNG=1 -DMOZ_UPDATE_CHANNEL=default -DMOZ_PHOENIX=1 -DMOZ_BUILD_APP=browser -DMOZ_X11=1 -DMOZ_WIDGET_GTK2=1 -DMOZ_WIDGET_GTK=2 -DMOZ_PDF_PRINTING=1 -DMOZ_ENABLE_XREMOTE=1 -DMOZ_INSTRUMENT_EVENT_LOOP=1 -DMOZ_ENABLE_STARTUP_NOTIFICATION=1 -DMOZ_OFFICIAL_BRANDING=1 -DMOZ_DISTRIBUTION_ID=\"org.mozilla\" -DMOZ_PANGO=1 -DMOZ_ENABLE_DBUS=1 -DIBMBIDI=1 -DACCESSIBILITY=1 -DNS_PRINTING=1 -DNS_PRINT_PREVIEW=1 -DMOZ_WEBRTC=1 -DMOZ_WEBRTC_ASSERT_ALWAYS=1 -DMOZ_WEBRTC_SIGNALING=1 -DMOZ_PEERCONNECTION=1 -DMOZ_SCTP=1 -DMOZ_SRTP=1 -DMOZ_SAMPLE_TYPE_FLOAT32=1 -DMOZ_WEBSPEECH=1 -DMOZ_RAW=1 -DMOZ_OGG=1 -DATTRIBUTE_ALIGNED_MAX=64 -DMOZ_WEBM=1 -DMOZ_MEDIA_NAVIGATOR=1 -DMOZ_VP8=1 -DMOZ_VP8_ERROR_CONCEALMENT=1 -DMOZ_VP8_ENCODER=1 -DHAVE_LIBVPX=1 -DMOZ_WAVE=1 -DMOZ_SPEEX_RESAMPLER=1 -DMOZ_SOUNDTOUCH=1 -DMOZ_CUBEB=1 -DMOZ_MEDIA=1 -DMOZ_VORBIS=1 -DMOZ_OPUS=1 -DMOZ_WEBVTT=1 -DMOZ_CUBEB=1 -DMOZ_CUBEB=1 -DENABLE_SYSTEM_EXTENSION_DIRS=1 -DBREAKPAD_CUSTOM_STDINT_H=\"mozilla/StandardInteger.h\" -DMOZ_CRASHREPORTER_ENABLE_PERCENT=100 -DMOZ_FLEXBOX=1 -DMOZ_WEBAPP_RUNTIME=1 -DMOZ_FEEDS=1 -DMOZ_NATIVE_SQLITE=1 -DMOZ_SAFE_BROWSING=1 -DMOZ_URL_CLASSIFIER=1 -DGL_PROVIDER_GLX=1 -DMOZ_DEBUG_SYMBOLS=1 -DMOZ_LOGGING=1 -DSIZEOF_INT_P=8 -DMOZ_MEMORY_SIZEOF_PTR_2POW=3 -DMOZ_MEMORY=1 -DMOZ_MEMORY_LINUX=1 -DJSGC_INCREMENTAL=1 -DHAVE___CXA_DEMANGLE=1 -DHAVE__UNWIND_BACKTRACE=1 -DJS_DEFAULT_JITREPORT_GRANULARITY=3 -DMOZ_OMNIJAR=1 -DMOZ_USER_DIR=\".mozilla\" -DMOZ_STATIC_JS=1 -DHAVE_FT_BITMAP_SIZE_Y_PPEM=1 -DHAVE_FT_GLYPHSLOT_EMBOLDEN=1 -DHAVE_FT_LOAD_SFNT_TABLE=1 -DHAVE_FT_SELECT_SIZE=1 -DHAVE_FONTCONFIG_FCFREETYPE_H=1 -DHAVE_STDINT_H=1 -DHAVE_INTTYPES_H=1 -DMOZ_ENABLE_SKIA=1 -DUSE_SKIA=1 -DUSE_SKIA_GPU=1 -DMOZ_XUL=1 -DMOZ_PROFILELOCKING=1 -DBUILD_CTYPES=1 -DMOZ_PLACES=1 -DMOZ_SERVICES_COMMON=1 -DMOZ_SERVICES_CRYPTO=1 -DMOZ_SERVICES_HEALTHREPORT=1 -DMOZ_SERVICES_METRICS=1 -DMOZ_SERVICES_SYNC=1 -DMOZ_MACBUNDLE_ID=org.mozilla.firefox -DMOZ_B2G_VERSION=\"1.0.0\" -DMOZ_B2G_OS_NAME=\"\" -DMOZ_APP_UA_NAME=\"\" -DMOZ_APP_UA_VERSION=\"22.0\" -DFIREFOX_VERSION=22.0 -DMOZ_UA_BUILDID=\"20100101\" -DMOZ_TELEMETRY_DISPLAY_REV=2 -DMOZ_DATA_REPORTING=1 -DMOZ_DLL_SUFFIX=\".so\" -DHAVE_POSIX_FALLOCATE=1 -DXP_UNIX=1 -DMOZ_ACCESSIBILITY_ATK=1 -DATK_MAJOR_VERSION=2 -DATK_MINOR_VERSION=8 -DATK_REV_VERSION=0 /home/justin/builds/firefox-kde-opensuse/src/mozilla-release/browser/installer/package-manifest.in > package-manifest
  10. /home/justin/builds/firefox-kde-opensuse/src/mozilla-release/obj-x86_64-unknown-linux-gnu/_virtualenv/bin/python /home/justin/builds/firefox-kde-opensuse/src/mozilla-release/toolkit/mozapps/installer/packager.py -DMOZ_GLUE_IN_PROGRAM -DNO_NSPR_10_SUPPORT -DAB_CD=en-US -DMOZ_APP_NAME=firefox -DPREF_DIR=defaults/preferences -DMOZ_ENABLE_GNOME_COMPONENT=1 -DMOZ_GTK2=1 -DMOZ_NATIVE_NSPR=1 -DMOZ_NATIVE_NSS=1 -DJAREXT= -DMOZ_CHILD_PROCESS_NAME=plugin-container -DMOZ_JSDEBUGGER -DNECKO_WIFI -DDLL_PREFIX=lib -DDLL_SUFFIX=.so -DBIN_SUFFIX= -DBINPATH=bin \
  11.         --format omni \
  12.         --removals /home/justin/builds/firefox-kde-opensuse/src/mozilla-release/browser/installer/removed-files.in \
  13.         --ignore-errors \
  14.          \
  15.          \
  16.         --optimizejars \
  17.          \
  18.         package-manifest ../../dist ../../dist/firefox \
  19.  
  20. Warning: /home/justin/builds/firefox-kde-opensuse/src/mozilla-release/obj-x86_64-unknown-linux-gnu/browser/installer/package-manifest:401: Missing file(s): bin/defaults/pref/kde.js
  21. Executing /home/justin/builds/firefox-kde-opensuse/src/mozilla-release/obj-x86_64-unknown-linux-gnu/dist/bin/xpcshell -g /home/justin/builds/firefox-kde-opensuse/src/mozilla-release/obj-x86_64-unknown-linux-gnu/dist/bin/ -a /home/justin/builds/firefox-kde-opensuse/src/mozilla-release/obj-x86_64-unknown-linux-gnu/dist/bin/ -f /home/justin/builds/firefox-kde-opensuse/src/mozilla-release/toolkit/mozapps/installer/precompile_cache.js -e precompile_startupcache("resource://gre/");
  22. /home/justin/builds/firefox-kde-opensuse/src/mozilla-release/obj-x86_64-unknown-linux-gnu/dist/bin/xpcshell: symbol lookup error: /home/justin/builds/firefox-kde-opensuse/src/mozilla-release/obj-x86_64-unknown-linux-gnu/dist/bin/xpcshell: undefined symbol: NS_LogInit
  23. Traceback (most recent call last):
  24.   File "/home/justin/builds/firefox-kde-opensuse/src/mozilla-release/toolkit/mozapps/installer/packager.py", line 374, in <module>
  25.     main()
  26.   File "/home/justin/builds/firefox-kde-opensuse/src/mozilla-release/toolkit/mozapps/installer/packager.py", line 366, in main
  27.     args.source, gre_path, base)
  28.   File "/home/justin/builds/firefox-kde-opensuse/src/mozilla-release/toolkit/mozapps/installer/packager.py", line 147, in precompile_cache
  29.     errors.fatal('Error while running startup cache precompilation')
  30.   File "/home/justin/builds/firefox-kde-opensuse/src/mozilla-release/python/mozbuild/mozpack/errors.py", line 101, in fatal
  31.     self._handle(self.FATAL, msg)
  32.   File "/home/justin/builds/firefox-kde-opensuse/src/mozilla-release/python/mozbuild/mozpack/errors.py", line 96, in _handle
  33.     raise ErrorMessage(msg)
  34. mozpack.errors.ErrorMessage: Error: Error while running startup cache precompilation
  35. make[2]: *** [stage-package] Error 1
  36. make[2]: Leaving directory `/home/justin/builds/firefox-kde-opensuse/src/mozilla-release/obj-x86_64-unknown-linux-gnu/browser/installer'
  37. make[1]: *** [install] Error 2
  38. make[1]: Leaving directory `/home/justin/builds/firefox-kde-opensuse/src/mozilla-release/obj-x86_64-unknown-linux-gnu'
  39. make: *** [install] Error 2
  40. ==> ERROR: A failure occurred in package().
  41.     Aborting...
clone this paste RAW Paste Data