Want more features on Pastebin? Sign Up, it's FREE!
Guest

Untitled

By: a guest on May 20th, 2012  |  syntax: None  |  size: 3.62 KB  |  views: 43  |  expires: Never
download  |  raw  |  embed  |  report abuse  |  print
Text below is selected. Please press Ctrl+C to copy to your clipboard. (⌘+C on Mac)
  1. arch/arm/mach-msm/board-zte-amigo.c:104:25: error: mach/msm_ts.h: No such file or directory
  2. arch/arm/mach-msm/board-zte-amigo.c:479: error: unknown field 'pmic_notif_init' specified in initializer
  3. cc1: warnings being treated as errors
  4. arch/arm/mach-msm/board-zte-amigo.c:479: error: initialization makes integer from pointer without a cast
  5. arch/arm/mach-msm/board-zte-amigo.c:480: error: unknown field 'pmic_notif_deinit' specified in initializer
  6. arch/arm/mach-msm/board-zte-amigo.c:480: error: initialization makes integer from pointer without a cast
  7. arch/arm/mach-msm/board-zte-amigo.c: In function 'bcm_power':
  8. arch/arm/mach-msm/board-zte-amigo.c:1097: error: unused variable 'vreg_bt'
  9. arch/arm/mach-msm/board-zte-amigo.c: At top level:
  10. arch/arm/mach-msm/board-zte-amigo.c:2273: error: variable 'msm_tssc_pdata' has initializer but incomplete type
  11. arch/arm/mach-msm/board-zte-amigo.c:2274: error: unknown field 'min_x' specified in initializer
  12. arch/arm/mach-msm/board-zte-amigo.c:2274: error: excess elements in struct initializer
  13. arch/arm/mach-msm/board-zte-amigo.c:2274: error: (near initialization for 'msm_tssc_pdata')
  14. arch/arm/mach-msm/board-zte-amigo.c:2275: error: unknown field 'max_x' specified in initializer
  15. arch/arm/mach-msm/board-zte-amigo.c:2275: error: excess elements in struct initializer
  16. arch/arm/mach-msm/board-zte-amigo.c:2275: error: (near initialization for 'msm_tssc_pdata')
  17. arch/arm/mach-msm/board-zte-amigo.c:2276: error: unknown field 'min_y' specified in initializer
  18. arch/arm/mach-msm/board-zte-amigo.c:2276: error: excess elements in struct initializer
  19. arch/arm/mach-msm/board-zte-amigo.c:2276: error: (near initialization for 'msm_tssc_pdata')
  20. arch/arm/mach-msm/board-zte-amigo.c:2277: error: unknown field 'max_y' specified in initializer
  21. arch/arm/mach-msm/board-zte-amigo.c:2277: error: excess elements in struct initializer
  22. arch/arm/mach-msm/board-zte-amigo.c:2277: error: (near initialization for 'msm_tssc_pdata')
  23. arch/arm/mach-msm/board-zte-amigo.c:2278: error: unknown field 'min_press' specified in initializer
  24. arch/arm/mach-msm/board-zte-amigo.c:2278: error: excess elements in struct initializer
  25. arch/arm/mach-msm/board-zte-amigo.c:2278: error: (near initialization for 'msm_tssc_pdata')
  26. arch/arm/mach-msm/board-zte-amigo.c:2279: error: unknown field 'max_press' specified in initializer
  27. arch/arm/mach-msm/board-zte-amigo.c:2279: error: excess elements in struct initializer
  28. arch/arm/mach-msm/board-zte-amigo.c:2279: error: (near initialization for 'msm_tssc_pdata')
  29. arch/arm/mach-msm/board-zte-amigo.c:2280: error: unknown field 'inv_x' specified in initializer
  30. arch/arm/mach-msm/board-zte-amigo.c:2280: error: excess elements in struct initializer
  31. arch/arm/mach-msm/board-zte-amigo.c:2280: error: (near initialization for 'msm_tssc_pdata')
  32. arch/arm/mach-msm/board-zte-amigo.c:2281: error: unknown field 'inv_y' specified in initializer
  33. arch/arm/mach-msm/board-zte-amigo.c:2281: error: excess elements in struct initializer
  34. arch/arm/mach-msm/board-zte-amigo.c:2281: error: (near initialization for 'msm_tssc_pdata')
  35. arch/arm/mach-msm/board-zte-amigo.c:3144: error: function declaration isn't a prototype
  36. arch/arm/mach-msm/board-zte-amigo.c: In function 'msm7x2x_init':
  37. arch/arm/mach-msm/board-zte-amigo.c:3231: error: implicit declaration of function 'map_zero_page_strongly_ordered'
  38. arch/arm/mach-msm/board-zte-amigo.c:3248: error: 'struct kgsl_platform_data' has no member named 'grp2d_clk_name'
  39. arch/arm/mach-msm/board-zte-amigo.c:3287: error: 'struct msm_hsusb_gadget_platform_data' has no member named 'swfi_latency'
  40. make[1]: *** [arch/arm/mach-msm/board-zte-amigo.o] Error 1
  41. make: *** [arch/arm/mach-msm] Error 2
clone this paste RAW Paste Data