This week only. Pastebin PRO Accounts Christmas Special! Don't miss out!Want more features on Pastebin? Sign Up, it's FREE!
Guest

Untitled

By: a guest on Aug 22nd, 2009  |  syntax: None  |  size: 159.24 KB  |  views: 168  |  expires: Never
download  |  raw  |  embed  |  report abuse  |  print
Text below is selected. Please press Ctrl+C to copy to your clipboard. (⌘+C on Mac)
  1. root@trixbox:~/skypeforasterisk-1.6.0_1.0.1-x86_32
  2. trixbox.prossiveit.lan skypeforasterisk-1.6.0_1.0.1-x86_32]# make
  3. gcc -o chan_skype.o -c chan_skype.c -pipe -fPIC -DAST_MODULE=\"chan_skype\" -MD -MT chan_skype.o -MF .chan_skype.o.d -MP
  4. chan_skype.c:25:22: error: asterisk.h: No such file or directory
  5. chan_skype.c:27: error: expected declaration specifiers or ‘...’ before string constant
  6. chan_skype.c:27: error: expected declaration specifiers or ‘...’ before string constant
  7. In file included from /usr/include/stdio.h:34,
  8.                  from chan_skype.c:29:
  9. /usr/lib/gcc/i386-redhat-linux/4.1.2/include/stddef.h: In function ‘ASTERISK_FILE_VERSION’:
  10. /usr/lib/gcc/i386-redhat-linux/4.1.2/include/stddef.h:214: error: storage class specified for parameter ‘size_t’
  11. In file included from /usr/include/stdio.h:36,
  12.                  from chan_skype.c:29:
  13. /usr/include/bits/types.h:34: error: storage class specified for parameter ‘__u_char’
  14. /usr/include/bits/types.h:35: error: storage class specified for parameter ‘__u_short’
  15. /usr/include/bits/types.h:36: error: storage class specified for parameter ‘__u_int’
  16. /usr/include/bits/types.h:37: error: storage class specified for parameter ‘__u_long’
  17. /usr/include/bits/types.h:40: error: storage class specified for parameter ‘__int8_t’
  18. /usr/include/bits/types.h:41: error: storage class specified for parameter ‘__uint8_t’
  19. /usr/include/bits/types.h:42: error: storage class specified for parameter ‘__int16_t’
  20. /usr/include/bits/types.h:43: error: storage class specified for parameter ‘__uint16_t’
  21. /usr/include/bits/types.h:44: error: storage class specified for parameter ‘__int32_t’
  22. /usr/include/bits/types.h:45: error: storage class specified for parameter ‘__uint32_t’
  23. /usr/include/bits/types.h:50: error: expected declaration specifiers before ‘__extension__’
  24. /usr/include/bits/types.h:51: error: expected declaration specifiers before ‘__extension__’
  25. /usr/include/bits/types.h:59: error: expected declaration specifiers before ‘__extension__’
  26. /usr/include/bits/types.h:60: error: expected declaration specifiers before ‘__extension__’
  27. In file included from /usr/include/stdio.h:36,
  28.                  from chan_skype.c:29:
  29. /usr/include/bits/types.h:137: error: expected declaration specifiers before ‘__extension__’
  30. /usr/include/bits/types.h:138: error: expected declaration specifiers before ‘__extension__’
  31. /usr/include/bits/types.h:139: error: expected declaration specifiers before ‘__extension__’
  32. /usr/include/bits/types.h:140: error: expected declaration specifiers before ‘__extension__’
  33. /usr/include/bits/types.h:141: error: expected declaration specifiers before ‘__extension__’
  34. /usr/include/bits/types.h:142: error: expected declaration specifiers before ‘__extension__’
  35. /usr/include/bits/types.h:143: error: expected declaration specifiers before ‘__extension__’
  36. /usr/include/bits/types.h:144: error: expected declaration specifiers before ‘__extension__’
  37. /usr/include/bits/types.h:145: error: expected declaration specifiers before ‘__extension__’
  38. /usr/include/bits/types.h:146: error: expected declaration specifiers before ‘__extension__’
  39. /usr/include/bits/types.h:147: error: expected declaration specifiers before ‘__extension__’
  40. /usr/include/bits/types.h:147: error: expected declaration specifiers before ‘__fsid_t’
  41. /usr/include/bits/types.h:148: error: expected declaration specifiers before ‘__extension__’
  42. /usr/include/bits/types.h:149: error: expected declaration specifiers before ‘__extension__’
  43. /usr/include/bits/types.h:150: error: expected declaration specifiers before ‘__extension__’
  44. /usr/include/bits/types.h:151: error: expected declaration specifiers before ‘__extension__’
  45. /usr/include/bits/types.h:152: error: expected declaration specifiers before ‘__extension__’
  46. /usr/include/bits/types.h:153: error: expected declaration specifiers before ‘__extension__’
  47. /usr/include/bits/types.h:154: error: expected declaration specifiers before ‘__extension__’
  48. /usr/include/bits/types.h:156: error: expected declaration specifiers before ‘__extension__’
  49. /usr/include/bits/types.h:157: error: expected declaration specifiers before ‘__extension__’
  50. /usr/include/bits/types.h:158: error: expected declaration specifiers before ‘__extension__’
  51. /usr/include/bits/types.h:161: error: expected declaration specifiers before ‘__extension__’
  52. /usr/include/bits/types.h:164: error: expected declaration specifiers before ‘__extension__’
  53. /usr/include/bits/types.h:167: error: expected declaration specifiers before ‘__extension__’
  54. /usr/include/bits/types.h:172: error: expected declaration specifiers before ‘__extension__’
  55. /usr/include/bits/types.h:173: error: expected declaration specifiers before ‘__extension__’
  56. /usr/include/bits/types.h:176: error: expected declaration specifiers before ‘__extension__’
  57. /usr/include/bits/types.h:177: error: expected declaration specifiers before ‘__extension__’
  58. /usr/include/bits/types.h:180: error: expected declaration specifiers before ‘__extension__’
  59. /usr/include/bits/types.h:181: error: expected declaration specifiers before ‘__extension__’
  60. /usr/include/bits/types.h:183: error: expected declaration specifiers before ‘__extension__’
  61. /usr/include/bits/types.h:187: error: expected ‘=’, ‘,’, ‘;’, ‘asm’ or ‘__attribute__’ before ‘__loff_t’
  62. /usr/include/bits/types.h:188: error: expected ‘=’, ‘,’, ‘;’, ‘asm’ or ‘__attribute__’ before ‘*’ token
  63. /usr/include/bits/types.h:189: error: storage class specified for parameter ‘__caddr_t’
  64. /usr/include/bits/types.h:192: error: expected declaration specifiers before ‘__extension__’
  65. /usr/include/bits/types.h:195: error: expected declaration specifiers before ‘__extension__’
  66. In file included from chan_skype.c:29:
  67. /usr/include/stdio.h:46: error: storage class specified for parameter ‘FILE’
  68. /usr/include/stdio.h:62: error: storage class specified for parameter ‘__FILE’
  69. In file included from /usr/include/_G_config.h:14,
  70.                  from /usr/include/libio.h:32,
  71.                  from /usr/include/stdio.h:72,
  72.                  from chan_skype.c:29:
  73. /usr/lib/gcc/i386-redhat-linux/4.1.2/include/stddef.h:326: error: storage class specified for parameter ‘wchar_t’
  74. /usr/lib/gcc/i386-redhat-linux/4.1.2/include/stddef.h:355: error: storage class specified for parameter ‘wint_t’
  75. In file included from /usr/include/_G_config.h:24,
  76.                  from /usr/include/libio.h:32,
  77.                  from /usr/include/stdio.h:72,
  78.                  from chan_skype.c:29:
  79. /usr/include/wchar.h:81: error: expected specifier-qualifier-list before ‘wint_t’
  80. /usr/include/wchar.h:84: error: storage class specified for parameter ‘__mbstate_t’
  81. In file included from /usr/include/libio.h:32,
  82.                  from /usr/include/stdio.h:72,
  83.                  from chan_skype.c:29:
  84. /usr/include/_G_config.h:28: error: expected specifier-qualifier-list before ‘__off_t’
  85. /usr/include/_G_config.h:30: error: storage class specified for parameter ‘_G_fpos_t’
  86. /usr/include/_G_config.h:33: error: expected specifier-qualifier-list before ‘__off64_t’
  87. /usr/include/_G_config.h:35: error: storage class specified for parameter ‘_G_fpos64_t’
  88. In file included from /usr/include/_G_config.h:44,
  89.                  from /usr/include/libio.h:32,
  90.                  from /usr/include/stdio.h:72,
  91.                  from chan_skype.c:29:
  92. /usr/include/gconv.h:72: error: expected declaration specifiers or ‘...’ before ‘size_t’
  93. /usr/include/gconv.h:72: error: storage class specified for parameter ‘__gconv_fct’
  94. /usr/include/gconv.h:75: error: expected declaration specifiers or ‘...’ before ‘*’ token
  95. /usr/include/gconv.h:75: error: storage class specified for parameter ‘wint_t’
  96. /usr/include/gconv.h:75: error: ‘wint_t’ declared as function returning a function
  97. /usr/include/gconv.h:75: error: conflicting types for ‘wint_t’
  98. /usr/lib/gcc/i386-redhat-linux/4.1.2/include/stddef.h:355: error: previous definition of ‘wint_t’ was here
  99. /usr/include/gconv.h:78: error: storage class specified for parameter ‘__gconv_init_fct’
  100. /usr/include/gconv.h:79: error: storage class specified for parameter ‘__gconv_end_fct’
  101. /usr/include/gconv.h:88: error: expected declaration specifiers or ‘...’ before ‘size_t’
  102. /usr/include/gconv.h:88: error: storage class specified for parameter ‘__gconv_trans_fct’
  103. /usr/include/gconv.h:93: error: storage class specified for parameter ‘__gconv_trans_context_fct’
  104. /usr/include/gconv.h:97: error: expected declaration specifiers or ‘...’ before ‘size_t’
  105. /usr/include/gconv.h:97: error: storage class specified for parameter ‘__gconv_trans_query_fct’
  106. /usr/include/gconv.h:100: error: storage class specified for parameter ‘__gconv_trans_init_fct’
  107. /usr/include/gconv.h:101: error: storage class specified for parameter ‘__gconv_trans_end_fct’
  108. /usr/include/gconv.h:106: error: expected specifier-qualifier-list before ‘__gconv_trans_fct’
  109. /usr/include/gconv.h:125: error: expected specifier-qualifier-list before ‘__gconv_fct’
  110. /usr/include/gconv.h:162: error: expected specifier-qualifier-list before ‘__mbstate_t’
  111. /usr/include/gconv.h:174: error: expected specifier-qualifier-list before ‘size_t’
  112. /usr/include/gconv.h:177: error: storage class specified for parameter ‘__gconv_t’
  113. In file included from /usr/include/libio.h:32,
  114.                  from /usr/include/stdio.h:72,
  115.                  from chan_skype.c:29:
  116. /usr/include/_G_config.h:53: error: storage class specified for parameter ‘_G_iconv_t’
  117. /usr/include/_G_config.h:55: error: storage class specified for parameter ‘_G_int16_t’
  118. /usr/include/_G_config.h:56: error: storage class specified for parameter ‘_G_int32_t’
  119. /usr/include/_G_config.h:57: error: storage class specified for parameter ‘_G_uint16_t’
  120. /usr/include/_G_config.h:58: error: storage class specified for parameter ‘_G_uint32_t’
  121. In file included from /usr/include/libio.h:53,
  122.                  from /usr/include/stdio.h:72,
  123.                  from chan_skype.c:29:
  124. /usr/lib/gcc/i386-redhat-linux/4.1.2/include/stdarg.h:43: error: storage class specified for parameter ‘__gnuc_va_list’
  125. In file included from /usr/include/stdio.h:72,
  126.                  from chan_skype.c:29:
  127. /usr/include/libio.h:177: error: storage class specified for parameter ‘_IO_lock_t’
  128. /usr/include/libio.h:297: error: expected specifier-qualifier-list before ‘__off_t’
  129. /usr/include/libio.h:338: error: storage class specified for parameter ‘_IO_FILE’
  130. /usr/include/libio.h:343: error: storage class specified for parameter ‘_IO_2_1_stdin_’
  131. /usr/include/libio.h:344: error: storage class specified for parameter ‘_IO_2_1_stdout_’
  132. /usr/include/libio.h:345: error: storage class specified for parameter ‘_IO_2_1_stderr_’
  133. /usr/include/libio.h:361: error: expected ‘=’, ‘,’, ‘;’, ‘asm’ or ‘__attribute__’ before ‘__io_read_fn’
  134. /usr/include/libio.h:369: error: expected ‘=’, ‘,’, ‘;’, ‘asm’ or ‘__attribute__’ before ‘__io_write_fn’
  135. /usr/include/libio.h:378: error: expected declaration specifiers or ‘...’ before ‘__off64_t’
  136. /usr/include/libio.h:378: error: storage class specified for parameter ‘__io_seek_fn’
  137. /usr/include/libio.h:381: error: storage class specified for parameter ‘__io_close_fn’
  138. /usr/include/libio.h:413: error: expected ‘)’ before ‘*’ token
  139. /usr/include/libio.h:414: error: expected ‘)’ before ‘*’ token
  140. /usr/include/libio.h:415: error: expected ‘)’ before ‘*’ token
  141. /usr/include/libio.h:416: error: expected ‘=’, ‘,’, ‘;’, ‘asm’ or ‘__attribute__’ before ‘__wunderflow’
  142. /usr/include/libio.h:417: error: expected ‘=’, ‘,’, ‘;’, ‘asm’ or ‘__attribute__’ before ‘__wuflow’
  143. /usr/include/libio.h:418: error: expected ‘=’, ‘,’, ‘;’, ‘asm’ or ‘__attribute__’ before ‘__woverflow’
  144. /usr/include/libio.h:451: error: expected ‘)’ before ‘*’ token
  145. /usr/include/libio.h:452: error: expected declaration specifiers or ‘...’ before ‘_IO_FILE’
  146. /usr/include/libio.h:452: error: storage class specified for parameter ‘_IO_putc’
  147. /usr/include/libio.h:453: error: expected ‘)’ before ‘*’ token
  148. /usr/include/libio.h:454: error: expected ‘)’ before ‘*’ token
  149. /usr/include/libio.h:456: error: expected ‘)’ before ‘*’ token
  150. /usr/include/libio.h:462: error: expected ‘)’ before ‘*’ token
  151. /usr/include/libio.h:463: error: expected ‘)’ before ‘*’ token
  152. /usr/include/libio.h:464: error: expected ‘)’ before ‘*’ token
  153. /usr/include/libio.h:481: error: expected ‘)’ before ‘*’ token
  154. /usr/include/libio.h:483: error: expected ‘)’ before ‘*’ token
  155. /usr/include/libio.h:485: error: expected ‘=’, ‘,’, ‘;’, ‘asm’ or ‘__attribute__’ before ‘_IO_padn’
  156. /usr/include/libio.h:486: error: expected ‘=’, ‘,’, ‘;’, ‘asm’ or ‘__attribute__’ before ‘_IO_sgetn’
  157. /usr/include/libio.h:488: error: expected ‘=’, ‘,’, ‘;’, ‘asm’ or ‘__attribute__’ before ‘_IO_seekoff’
  158. /usr/include/libio.h:489: error: expected ‘=’, ‘,’, ‘;’, ‘asm’ or ‘__attribute__’ before ‘_IO_seekpos’
  159. /usr/include/libio.h:491: error: expected ‘)’ before ‘*’ token
  160. In file included from chan_skype.c:29:
  161. /usr/include/stdio.h:88: error: expected ‘=’, ‘,’, ‘;’, ‘asm’ or ‘__attribute__’ before ‘fpos_t’
  162. In file included from chan_skype.c:29:
  163. /usr/include/stdio.h:142: error: storage class specified for parameter ‘stdin’
  164. /usr/include/stdio.h:143: error: storage class specified for parameter ‘stdout’
  165. /usr/include/stdio.h:144: error: storage class specified for parameter ‘stderr’
  166. /usr/include/stdio.h:154: error: storage class specified for parameter ‘remove’
  167. /usr/include/stdio.h:156: error: storage class specified for parameter ‘rename’
  168. /usr/include/stdio.h:171: error: expected ‘=’, ‘,’, ‘;’, ‘asm’ or ‘__attribute__’ before ‘*’ token
  169. /usr/include/stdio.h:185: error: storage class specified for parameter ‘tmpnam’
  170. /usr/include/stdio.h:191: error: storage class specified for parameter ‘tmpnam_r’
  171. /usr/include/stdio.h:204: error: storage class specified for parameter ‘tempnam’
  172. /usr/include/stdio.h:213: error: expected ‘)’ before ‘*’ token
  173. /usr/include/stdio.h:218: error: expected ‘)’ before ‘*’ token
  174. /usr/include/stdio.h:228: error: expected ‘)’ before ‘*’ token
  175. /usr/include/stdio.h:248: error: expected ‘=’, ‘,’, ‘;’, ‘asm’ or ‘__attribute__’ before ‘*’ token
  176. /usr/include/stdio.h:254: error: expected ‘=’, ‘,’, ‘;’, ‘asm’ or ‘__attribute__’ before ‘*’ token
  177. /usr/include/stdio.h:280: error: expected ‘=’, ‘,’, ‘;’, ‘asm’ or ‘__attribute__’ before ‘*’ token
  178. /usr/include/stdio.h:303: error: expected ‘)’ before ‘*’ token
  179. /usr/include/stdio.h:307: error: expected ‘)’ before ‘*’ token
  180. /usr/include/stdio.h:314: error: expected ‘)’ before ‘*’ token
  181. /usr/include/stdio.h:318: error: expected ‘)’ before ‘*’ token
  182. /usr/include/stdio.h:327: error: expected ‘)’ before ‘*’ token
  183. /usr/include/stdio.h:333: error: storage class specified for parameter ‘printf’
  184. /usr/include/stdio.h:336: error: storage class specified for parameter ‘sprintf’
  185. /usr/include/stdio.h:342: error: expected ‘)’ before ‘*’ token
  186. /usr/include/stdio.h:348: error: expected declaration specifiers or ‘...’ before ‘__gnuc_va_list’
  187. /usr/include/stdio.h:348: error: storage class specified for parameter ‘vprintf’
  188. /usr/include/stdio.h:351: error: expected declaration specifiers or ‘...’ before ‘__gnuc_va_list’
  189. /usr/include/stdio.h:351: error: storage class specified for parameter ‘vsprintf’
  190. /usr/include/stdio.h:357: error: expected declaration specifiers or ‘...’ before ‘size_t’
  191. /usr/include/stdio.h:359: error: storage class specified for parameter ‘snprintf’
  192. /usr/include/stdio.h:359: error: format string argument not a string type
  193. /usr/include/stdio.h:361: error: expected declaration specifiers or ‘...’ before ‘size_t’
  194. /usr/include/stdio.h:362: error: expected declaration specifiers or ‘...’ before ‘__gnuc_va_list’
  195. /usr/include/stdio.h:363: error: storage class specified for parameter ‘vsnprintf’
  196. /usr/include/stdio.h:363: error: format string argument not a string type
  197. /usr/include/stdio.h:399: error: expected ‘)’ before ‘*’ token
  198. /usr/include/stdio.h:405: error: storage class specified for parameter ‘scanf’
  199. /usr/include/stdio.h:408: error: storage class specified for parameter ‘sscanf’
  200. /usr/include/stdio.h:441: error: expected ‘)’ before ‘*’ token
  201. /usr/include/stdio.h:442: error: expected ‘)’ before ‘*’ token
  202. /usr/include/stdio.h:448: error: storage class specified for parameter ‘getchar’
  203. /usr/include/stdio.h:460: error: expected ‘)’ before ‘*’ token
  204. /usr/include/stdio.h:461: error: storage class specified for parameter ‘getchar_unlocked’
  205. /usr/include/stdio.h:471: error: expected ‘)’ before ‘*’ token
  206. /usr/include/stdio.h:483: error: expected declaration specifiers or ‘...’ before ‘FILE’
  207. /usr/include/stdio.h:483: error: storage class specified for parameter ‘fputc’
  208. /usr/include/stdio.h:484: error: expected declaration specifiers or ‘...’ before ‘FILE’
  209. /usr/include/stdio.h:484: error: storage class specified for parameter ‘putc’
  210. /usr/include/stdio.h:490: error: storage class specified for parameter ‘putchar’
  211. /usr/include/stdio.h:504: error: expected declaration specifiers or ‘...’ before ‘FILE’
  212. /usr/include/stdio.h:504: error: storage class specified for parameter ‘fputc_unlocked’
  213. /usr/include/stdio.h:512: error: expected declaration specifiers or ‘...’ before ‘FILE’
  214. /usr/include/stdio.h:512: error: storage class specified for parameter ‘putc_unlocked’
  215. /usr/include/stdio.h:513: error: storage class specified for parameter ‘putchar_unlocked’
  216. /usr/include/stdio.h:520: error: expected ‘)’ before ‘*’ token
  217. /usr/include/stdio.h:523: error: expected declaration specifiers or ‘...’ before ‘FILE’
  218. /usr/include/stdio.h:523: error: storage class specified for parameter ‘putw’
  219. /usr/include/stdio.h:532: error: expected declaration specifiers or ‘...’ before ‘FILE’
  220. /usr/include/stdio.h:533: error: storage class specified for parameter ‘fgets’
  221. /usr/include/stdio.h:540: error: storage class specified for parameter ‘gets’
  222. /usr/include/stdio.h:590: error: expected declaration specifiers or ‘...’ before ‘FILE’
  223. /usr/include/stdio.h:590: error: storage class specified for parameter ‘fputs’
  224. /usr/include/stdio.h:596: error: storage class specified for parameter ‘puts’
  225. /usr/include/stdio.h:603: error: expected declaration specifiers or ‘...’ before ‘FILE’
  226. /usr/include/stdio.h:603: error: storage class specified for parameter ‘ungetc’
  227. /usr/include/stdio.h:610: error: expected ‘=’, ‘,’, ‘;’, ‘asm’ or ‘__attribute__’ before ‘fread’
  228. /usr/include/stdio.h:616: error: expected ‘=’, ‘,’, ‘;’, ‘asm’ or ‘__attribute__’ before ‘fwrite’
  229. /usr/include/stdio.h:638: error: expected ‘=’, ‘,’, ‘;’, ‘asm’ or ‘__attribute__’ before ‘fread_unlocked’
  230. /usr/include/stdio.h:640: error: expected ‘=’, ‘,’, ‘;’, ‘asm’ or ‘__attribute__’ before ‘fwrite_unlocked’
  231. /usr/include/stdio.h:650: error: expected ‘)’ before ‘*’ token
  232. /usr/include/stdio.h:655: error: expected ‘)’ before ‘*’ token
  233. /usr/include/stdio.h:660: error: expected ‘)’ before ‘*’ token
  234. /usr/include/stdio.h:674: error: expected ‘)’ before ‘*’ token
  235. /usr/include/stdio.h:679: error: expected ‘=’, ‘,’, ‘;’, ‘asm’ or ‘__attribute__’ before ‘ftello’
  236. /usr/include/stdio.h:699: error: expected ‘)’ before ‘*’ token
  237. /usr/include/stdio.h:704: error: expected ‘)’ before ‘*’ token
  238. /usr/include/stdio.h:727: error: expected ‘)’ before ‘*’ token
  239. /usr/include/stdio.h:729: error: expected ‘)’ before ‘*’ token
  240. /usr/include/stdio.h:731: error: expected ‘)’ before ‘*’ token
  241. /usr/include/stdio.h:736: error: expected ‘)’ before ‘*’ token
  242. /usr/include/stdio.h:737: error: expected ‘)’ before ‘*’ token
  243. /usr/include/stdio.h:738: error: expected ‘)’ before ‘*’ token
  244. /usr/include/stdio.h:747: error: storage class specified for parameter ‘perror’
  245. In file included from /usr/include/stdio.h:754,
  246.                  from chan_skype.c:29:
  247. /usr/include/bits/sys_errlist.h:27: error: storage class specified for parameter ‘sys_nerr’
  248. /usr/include/bits/sys_errlist.h:28: error: storage class specified for parameter ‘sys_errlist’
  249. In file included from chan_skype.c:29:
  250. /usr/include/stdio.h:759: error: expected ‘)’ before ‘*’ token
  251. /usr/include/stdio.h:764: error: expected ‘)’ before ‘*’ token
  252. /usr/include/stdio.h:774: error: expected ‘=’, ‘,’, ‘;’, ‘asm’ or ‘__attribute__’ before ‘*’ token
  253. /usr/include/stdio.h:780: error: expected ‘)’ before ‘*’ token
  254. /usr/include/stdio.h:786: error: storage class specified for parameter ‘ctermid’
  255. /usr/include/stdio.h:814: error: expected ‘)’ before ‘*’ token
  256. /usr/include/stdio.h:818: error: expected ‘)’ before ‘*’ token
  257. /usr/include/stdio.h:821: error: expected ‘)’ before ‘*’ token
  258. In file included from chan_skype.c:30:
  259. /usr/include/string.h:39: error: expected declaration specifiers or ‘...’ before ‘size_t’
  260. /usr/include/string.h:40: error: storage class specified for parameter ‘memcpy’
  261. /usr/include/string.h:43: error: expected declaration specifiers or ‘...’ before ‘size_t’
  262. /usr/include/string.h:44: error: storage class specified for parameter ‘memmove’
  263. /usr/include/string.h:52: error: expected declaration specifiers or ‘...’ before ‘size_t’
  264. /usr/include/string.h:53: error: storage class specified for parameter ‘memccpy’
  265. /usr/include/string.h:59: error: expected declaration specifiers or ‘...’ before ‘size_t’
  266. /usr/include/string.h:59: error: storage class specified for parameter ‘memset’
  267. /usr/include/string.h:62: error: expected declaration specifiers or ‘...’ before ‘size_t’
  268. /usr/include/string.h:63: error: storage class specified for parameter ‘memcmp’
  269. /usr/include/string.h:66: error: expected declaration specifiers or ‘...’ before ‘size_t’
  270. /usr/include/string.h:67: error: storage class specified for parameter ‘memchr’
  271. /usr/include/string.h:85: error: storage class specified for parameter ‘strcpy’
  272. /usr/include/string.h:88: error: expected declaration specifiers or ‘...’ before ‘size_t’
  273. /usr/include/string.h:89: error: storage class specified for parameter ‘strncpy’
  274. /usr/include/string.h:93: error: storage class specified for parameter ‘strcat’
  275. /usr/include/string.h:96: error: expected declaration specifiers or ‘...’ before ‘size_t’
  276. /usr/include/string.h:96: error: storage class specified for parameter ‘strncat’
  277. /usr/include/string.h:100: error: storage class specified for parameter ‘strcmp’
  278. /usr/include/string.h:102: error: expected declaration specifiers or ‘...’ before ‘size_t’
  279. /usr/include/string.h:103: error: storage class specified for parameter ‘strncmp’
  280. /usr/include/string.h:107: error: storage class specified for parameter ‘strcoll’
  281. /usr/include/string.h:109: error: expected ‘=’, ‘,’, ‘;’, ‘asm’ or ‘__attribute__’ before ‘strxfrm’
  282. /usr/include/string.h:131: error: storage class specified for parameter ‘strdup’
  283. /usr/include/string.h:168: error: storage class specified for parameter ‘strchr’
  284. /usr/include/string.h:171: error: storage class specified for parameter ‘strrchr’
  285. /usr/include/string.h:184: error: expected ‘=’, ‘,’, ‘;’, ‘asm’ or ‘__attribute__’ before ‘strcspn’
  286. /usr/include/string.h:188: error: expected ‘=’, ‘,’, ‘;’, ‘asm’ or ‘__attribute__’ before ‘strspn’
  287. /usr/include/string.h:192: error: storage class specified for parameter ‘strpbrk’
  288. /usr/include/string.h:195: error: storage class specified for parameter ‘strstr’
  289. /usr/include/string.h:200: error: storage class specified for parameter ‘strtok’
  290. /usr/include/string.h:208: error: storage class specified for parameter ‘__strtok_r’
  291. /usr/include/string.h:212: error: storage class specified for parameter ‘strtok_r’
  292. /usr/include/string.h:242: error: expected ‘=’, ‘,’, ‘;’, ‘asm’ or ‘__attribute__’ before ‘strlen’
  293. /usr/include/string.h:256: error: storage class specified for parameter ‘strerror’
  294. /usr/include/string.h:270: error: expected declaration specifiers or ‘...’ before ‘size_t’
  295. /usr/include/string.h:270: error: storage class specified for parameter ‘strerror_r’
  296. /usr/include/string.h:288: error: expected declaration specifiers or ‘...’ before ‘size_t’
  297. /usr/include/string.h:288: error: storage class specified for parameter ‘__bzero’
  298. /usr/include/string.h:292: error: expected declaration specifiers or ‘...’ before ‘size_t’
  299. /usr/include/string.h:293: error: storage class specified for parameter ‘bcopy’
  300. /usr/include/string.h:296: error: expected declaration specifiers or ‘...’ before ‘size_t’
  301. /usr/include/string.h:296: error: storage class specified for parameter ‘bzero’
  302. /usr/include/string.h:299: error: expected declaration specifiers or ‘...’ before ‘size_t’
  303. /usr/include/string.h:300: error: storage class specified for parameter ‘bcmp’
  304. /usr/include/string.h:304: error: storage class specified for parameter ‘index’
  305. /usr/include/string.h:308: error: storage class specified for parameter ‘rindex’
  306. /usr/include/string.h:312: error: storage class specified for parameter ‘ffs’
  307. /usr/include/string.h:326: error: storage class specified for parameter ‘strcasecmp’
  308. /usr/include/string.h:329: error: expected declaration specifiers or ‘...’ before ‘size_t’
  309. /usr/include/string.h:330: error: storage class specified for parameter ‘strncasecmp’
  310. /usr/include/string.h:350: error: storage class specified for parameter ‘strsep’
  311. In file included from /usr/include/sys/time.h:27,
  312.                  from chan_skype.c:31:
  313. /usr/include/time.h:77: error: expected ‘=’, ‘,’, ‘;’, ‘asm’ or ‘__attribute__’ before ‘time_t’
  314. In file included from /usr/include/sys/time.h:29,
  315.                  from chan_skype.c:31:
  316. /usr/include/bits/time.h:71: error: expected specifier-qualifier-list before ‘__time_t’
  317. In file included from /usr/include/sys/select.h:34,
  318.                  from /usr/include/sys/time.h:31,
  319.                  from chan_skype.c:31:
  320. /usr/include/bits/sigset.h:23: error: storage class specified for parameter ‘__sig_atomic_t’
  321. /usr/include/bits/sigset.h:31: error: storage class specified for parameter ‘__sigset_t’
  322. In file included from /usr/include/sys/time.h:31,
  323.                  from chan_skype.c:31:
  324. /usr/include/sys/select.h:38: error: expected ‘=’, ‘,’, ‘;’, ‘asm’ or ‘__attribute__’ before ‘sigset_t’
  325. In file included from /usr/include/sys/select.h:44,
  326.                  from /usr/include/sys/time.h:31,
  327.                  from chan_skype.c:31:
  328. /usr/include/time.h:123: error: expected specifier-qualifier-list before ‘__time_t’
  329. In file included from /usr/include/sys/time.h:31,
  330.                  from chan_skype.c:31:
  331. /usr/include/sys/select.h:49: error: expected ‘=’, ‘,’, ‘;’, ‘asm’ or ‘__attribute__’ before ‘suseconds_t’
  332. /usr/include/sys/select.h:55: error: storage class specified for parameter ‘__fd_mask’
  333. /usr/include/sys/select.h:75: error: expected specifier-qualifier-list before ‘__fd_mask’
  334. /usr/include/sys/select.h:78: error: storage class specified for parameter ‘fd_set’
  335. /usr/include/sys/select.h:85: error: expected ‘=’, ‘,’, ‘;’, ‘asm’ or ‘__attribute__’ before ‘fd_mask’
  336. /usr/include/sys/select.h:109: error: expected declaration specifiers or ‘...’ before ‘fd_set’
  337. /usr/include/sys/select.h:110: error: expected declaration specifiers or ‘...’ before ‘fd_set’
  338. /usr/include/sys/select.h:111: error: expected declaration specifiers or ‘...’ before ‘fd_set’
  339. /usr/include/sys/select.h:112: error: storage class specified for parameter ‘select’
  340. /usr/include/sys/select.h:121: error: expected declaration specifiers or ‘...’ before ‘fd_set’
  341. /usr/include/sys/select.h:122: error: expected declaration specifiers or ‘...’ before ‘fd_set’
  342. /usr/include/sys/select.h:123: error: expected declaration specifiers or ‘...’ before ‘fd_set’
  343. /usr/include/sys/select.h:125: error: expected ‘;’, ‘,’ or ‘)’ before ‘*’ token
  344. In file included from chan_skype.c:31:
  345. /usr/include/sys/time.h:63: error: storage class specified for parameter ‘__timezone_ptr_t’
  346. /usr/include/sys/time.h:74: error: expected declaration specifiers or ‘...’ before ‘__timezone_ptr_t’
  347. /usr/include/sys/time.h:74: error: storage class specified for parameter ‘gettimeofday’
  348. /usr/include/sys/time.h:81: error: storage class specified for parameter ‘settimeofday’
  349. /usr/include/sys/time.h:88: error: storage class specified for parameter ‘adjtime’
  350. /usr/include/sys/time.h:122: error: storage class specified for parameter ‘__itimer_which_t’
  351. /usr/include/sys/time.h:127: error: expected ‘)’ before ‘__which’
  352. /usr/include/sys/time.h:133: error: expected ‘)’ before ‘__which’
  353. /usr/include/sys/time.h:141: error: storage class specified for parameter ‘utimes’
  354. /usr/include/sys/time.h:146: error: storage class specified for parameter ‘lutimes’
  355. /usr/include/sys/time.h:149: error: storage class specified for parameter ‘futimes’
  356. In file included from /usr/include/errno.h:36,
  357.                  from chan_skype.c:32:
  358. /usr/include/bits/errno.h:43: error: storage class specified for parameter ‘__errno_location’
  359. In file included from chan_skype.c:33:
  360. /usr/include/unistd.h:191: error: expected ‘=’, ‘,’, ‘;’, ‘asm’ or ‘__attribute__’ before ‘ssize_t’
  361. In file included from chan_skype.c:33:
  362. /usr/include/unistd.h:203: error: expected ‘=’, ‘,’, ‘;’, ‘asm’ or ‘__attribute__’ before ‘gid_t’
  363. /usr/include/unistd.h:208: error: expected ‘=’, ‘,’, ‘;’, ‘asm’ or ‘__attribute__’ before ‘uid_t’
  364. /usr/include/unistd.h:214: error: expected ‘=’, ‘,’, ‘;’, ‘asm’ or ‘__attribute__’ before ‘off_t’
  365. /usr/include/unistd.h:226: error: expected ‘=’, ‘,’, ‘;’, ‘asm’ or ‘__attribute__’ before ‘useconds_t’
  366. /usr/include/unistd.h:231: error: expected ‘=’, ‘,’, ‘;’, ‘asm’ or ‘__attribute__’ before ‘pid_t’
  367. /usr/include/unistd.h:238: error: expected ‘=’, ‘,’, ‘;’, ‘asm’ or ‘__attribute__’ before ‘intptr_t’
  368. /usr/include/unistd.h:245: error: expected ‘=’, ‘,’, ‘;’, ‘asm’ or ‘__attribute__’ before ‘socklen_t’
  369. /usr/include/unistd.h:258: error: storage class specified for parameter ‘access’
  370. /usr/include/unistd.h:301: error: expected ‘=’, ‘,’, ‘;’, ‘asm’ or ‘__attribute__’ before ‘lseek’
  371. /usr/include/unistd.h:320: error: storage class specified for parameter ‘close’
  372. /usr/include/unistd.h:327: error: expected ‘=’, ‘,’, ‘;’, ‘asm’ or ‘__attribute__’ before ‘read’
  373. /usr/include/unistd.h:333: error: expected ‘=’, ‘,’, ‘;’, ‘asm’ or ‘__attribute__’ before ‘write’
  374. /usr/include/unistd.h:384: error: storage class specified for parameter ‘pipe’
  375. /usr/include/unistd.h:393: error: storage class specified for parameter ‘alarm’
  376. /usr/include/unistd.h:405: error: storage class specified for parameter ‘sleep’
  377. /usr/include/unistd.h:412: error: expected ‘=’, ‘,’, ‘;’, ‘asm’ or ‘__attribute__’ before ‘ualarm’
  378. /usr/include/unistd.h:420: error: expected ‘)’ before ‘__useconds’
  379. /usr/include/unistd.h:429: error: storage class specified for parameter ‘pause’
  380. /usr/include/unistd.h:433: error: expected declaration specifiers or ‘...’ before ‘__uid_t’
  381. /usr/include/unistd.h:433: error: expected declaration specifiers or ‘...’ before ‘__gid_t’
  382. /usr/include/unistd.h:434: error: storage class specified for parameter ‘chown’
  383. /usr/include/unistd.h:438: error: expected declaration specifiers or ‘...’ before ‘__uid_t’
  384. /usr/include/unistd.h:438: error: expected declaration specifiers or ‘...’ before ‘__gid_t’
  385. /usr/include/unistd.h:438: error: storage class specified for parameter ‘fchown’
  386. /usr/include/unistd.h:443: error: expected declaration specifiers or ‘...’ before ‘__uid_t’
  387. /usr/include/unistd.h:443: error: expected declaration specifiers or ‘...’ before ‘__gid_t’
  388. /usr/include/unistd.h:444: error: storage class specified for parameter ‘lchown’
  389. /usr/include/unistd.h:457: error: storage class specified for parameter ‘chdir’
  390. /usr/include/unistd.h:461: error: storage class specified for parameter ‘fchdir’
  391. /usr/include/unistd.h:471: error: expected declaration specifiers or ‘...’ before ‘size_t’
  392. /usr/include/unistd.h:471: error: storage class specified for parameter ‘getcwd’
  393. /usr/include/unistd.h:485: error: storage class specified for parameter ‘getwd’
  394. /usr/include/unistd.h:490: error: storage class specified for parameter ‘dup’
  395. /usr/include/unistd.h:493: error: storage class specified for parameter ‘dup2’
  396. /usr/include/unistd.h:496: error: storage class specified for parameter ‘__environ’
  397. /usr/include/unistd.h:505: error: storage class specified for parameter ‘execve’
  398. /usr/include/unistd.h:517: error: storage class specified for parameter ‘execv’
  399. /usr/include/unistd.h:522: error: storage class specified for parameter ‘execle’
  400. /usr/include/unistd.h:527: error: storage class specified for parameter ‘execl’
  401. /usr/include/unistd.h:532: error: storage class specified for parameter ‘execvp’
  402. /usr/include/unistd.h:538: error: storage class specified for parameter ‘execlp’
  403. /usr/include/unistd.h:543: error: storage class specified for parameter ‘nice’
  404. /usr/include/unistd.h:548: error: storage class specified for parameter ‘_exit’
  405. In file included from chan_skype.c:33:
  406. /usr/include/unistd.h:558: error: storage class specified for parameter ‘pathconf’
  407. /usr/include/unistd.h:561: error: storage class specified for parameter ‘fpathconf’
  408. /usr/include/unistd.h:564: error: storage class specified for parameter ‘sysconf’
  409. /usr/include/unistd.h:568: error: expected ‘=’, ‘,’, ‘;’, ‘asm’ or ‘__attribute__’ before ‘confstr’
  410. /usr/include/unistd.h:573: error: expected ‘=’, ‘,’, ‘;’, ‘asm’ or ‘__attribute__’ before ‘getpid’
  411. /usr/include/unistd.h:576: error: expected ‘=’, ‘,’, ‘;’, ‘asm’ or ‘__attribute__’ before ‘getppid’
  412. /usr/include/unistd.h:581: error: expected ‘=’, ‘,’, ‘;’, ‘asm’ or ‘__attribute__’ before ‘getpgrp’
  413. /usr/include/unistd.h:591: error: expected ‘=’, ‘,’, ‘;’, ‘asm’ or ‘__attribute__’ before ‘__getpgid’
  414. /usr/include/unistd.h:600: error: expected ‘)’ before ‘__pid’
  415. /usr/include/unistd.h:617: error: storage class specified for parameter ‘setpgrp’
  416. /usr/include/unistd.h:634: error: expected ‘=’, ‘,’, ‘;’, ‘asm’ or ‘__attribute__’ before ‘setsid’
  417. /usr/include/unistd.h:642: error: expected ‘=’, ‘,’, ‘;’, ‘asm’ or ‘__attribute__’ before ‘getuid’
  418. /usr/include/unistd.h:645: error: expected ‘=’, ‘,’, ‘;’, ‘asm’ or ‘__attribute__’ before ‘geteuid’
  419. /usr/include/unistd.h:648: error: expected ‘=’, ‘,’, ‘;’, ‘asm’ or ‘__attribute__’ before ‘getgid’
  420. /usr/include/unistd.h:651: error: expected ‘=’, ‘,’, ‘;’, ‘asm’ or ‘__attribute__’ before ‘getegid’
  421. /usr/include/unistd.h:656: error: expected declaration specifiers or ‘...’ before ‘__gid_t’
  422. /usr/include/unistd.h:656: error: storage class specified for parameter ‘getgroups’
  423. /usr/include/unistd.h:667: error: expected ‘)’ before ‘__uid’
  424. /usr/include/unistd.h:672: error: expected ‘)’ before ‘__ruid’
  425. /usr/include/unistd.h:677: error: expected ‘)’ before ‘__uid’
  426. /usr/include/unistd.h:684: error: expected ‘)’ before ‘__gid’
  427. /usr/include/unistd.h:689: error: expected ‘)’ before ‘__rgid’
  428. /usr/include/unistd.h:694: error: expected ‘)’ before ‘__gid’
  429. /usr/include/unistd.h:723: error: expected ‘=’, ‘,’, ‘;’, ‘asm’ or ‘__attribute__’ before ‘fork’
  430. /usr/include/unistd.h:730: error: expected ‘=’, ‘,’, ‘;’, ‘asm’ or ‘__attribute__’ before ‘vfork’
  431. /usr/include/unistd.h:736: error: storage class specified for parameter ‘ttyname’
  432. /usr/include/unistd.h:740: error: expected declaration specifiers or ‘...’ before ‘size_t’
  433. /usr/include/unistd.h:741: error: storage class specified for parameter ‘ttyname_r’
  434. /usr/include/unistd.h:745: error: storage class specified for parameter ‘isatty’
  435. /usr/include/unistd.h:751: error: storage class specified for parameter ‘ttyslot’
  436. /usr/include/unistd.h:757: error: storage class specified for parameter ‘link’
  437. /usr/include/unistd.h:770: error: storage class specified for parameter ‘symlink’
  438. /usr/include/unistd.h:775: error: expected ‘=’, ‘,’, ‘;’, ‘asm’ or ‘__attribute__’ before ‘readlink’
  439. /usr/include/unistd.h:792: error: storage class specified for parameter ‘unlink’
  440. /usr/include/unistd.h:801: error: storage class specified for parameter ‘rmdir’
  441. /usr/include/unistd.h:805: error: expected ‘=’, ‘,’, ‘;’, ‘asm’ or ‘__attribute__’ before ‘tcgetpgrp’
  442. /usr/include/unistd.h:808: error: expected declaration specifiers or ‘...’ before ‘__pid_t’
  443. /usr/include/unistd.h:808: error: storage class specified for parameter ‘tcsetpgrp’
  444. /usr/include/unistd.h:815: error: storage class specified for parameter ‘getlogin’
  445. /usr/include/unistd.h:823: error: expected declaration specifiers or ‘...’ before ‘size_t’
  446. /usr/include/unistd.h:823: error: storage class specified for parameter ‘getlogin_r’
  447. /usr/include/unistd.h:828: error: storage class specified for parameter ‘setlogin’
  448. In file included from /usr/include/unistd.h:837,
  449.                  from chan_skype.c:33:
  450. /usr/include/getopt.h:59: error: storage class specified for parameter ‘optarg’
  451. /usr/include/getopt.h:73: error: storage class specified for parameter ‘optind’
  452. /usr/include/getopt.h:78: error: storage class specified for parameter ‘opterr’
  453. /usr/include/getopt.h:82: error: storage class specified for parameter ‘optopt’
  454. /usr/include/getopt.h:153: error: storage class specified for parameter ‘getopt’
  455. In file included from chan_skype.c:33:
  456. /usr/include/unistd.h:845: error: expected declaration specifiers or ‘...’ before ‘size_t’
  457. /usr/include/unistd.h:845: error: storage class specified for parameter ‘gethostname’
  458. /usr/include/unistd.h:852: error: expected declaration specifiers or ‘...’ before ‘size_t’
  459. /usr/include/unistd.h:853: error: storage class specified for parameter ‘sethostname’
  460. /usr/include/unistd.h:857: error: storage class specified for parameter ‘sethostid’
  461. /usr/include/unistd.h:863: error: expected declaration specifiers or ‘...’ before ‘size_t’
  462. /usr/include/unistd.h:864: error: storage class specified for parameter ‘getdomainname’
  463. /usr/include/unistd.h:865: error: expected declaration specifiers or ‘...’ before ‘size_t’
  464. /usr/include/unistd.h:866: error: storage class specified for parameter ‘setdomainname’
  465. /usr/include/unistd.h:872: error: storage class specified for parameter ‘vhangup’
  466. /usr/include/unistd.h:875: error: storage class specified for parameter ‘revoke’
  467. /usr/include/unistd.h:883: error: expected declaration specifiers or ‘...’ before ‘size_t’
  468. /usr/include/unistd.h:884: error: expected declaration specifiers or ‘...’ before ‘size_t’
  469. /usr/include/unistd.h:885: error: storage class specified for parameter ‘profil’
  470. /usr/include/unistd.h:891: error: storage class specified for parameter ‘acct’
  471. /usr/include/unistd.h:895: error: storage class specified for parameter ‘getusershell’
  472. /usr/include/unistd.h:896: error: storage class specified for parameter ‘endusershell’
  473. /usr/include/unistd.h:897: error: storage class specified for parameter ‘setusershell’
  474. /usr/include/unistd.h:903: error: storage class specified for parameter ‘daemon’
  475. /usr/include/unistd.h:910: error: storage class specified for parameter ‘chroot’
  476. /usr/include/unistd.h:914: error: storage class specified for parameter ‘getpass’
  477. /usr/include/unistd.h:923: error: storage class specified for parameter ‘fsync’
  478. /usr/include/unistd.h:930: error: storage class specified for parameter ‘gethostid’
  479. /usr/include/unistd.h:933: error: storage class specified for parameter ‘sync’
  480. /usr/include/unistd.h:938: error: storage class specified for parameter ‘getpagesize’
  481. /usr/include/unistd.h:943: error: storage class specified for parameter ‘getdtablesize’
  482. /usr/include/unistd.h:948: error: expected declaration specifiers or ‘...’ before ‘__off_t’
  483. /usr/include/unistd.h:949: error: storage class specified for parameter ‘truncate’
  484. /usr/include/unistd.h:970: error: expected declaration specifiers or ‘...’ before ‘__off_t’
  485. /usr/include/unistd.h:970: error: storage class specified for parameter ‘ftruncate’
  486. /usr/include/unistd.h:990: error: storage class specified for parameter ‘brk’
  487. /usr/include/unistd.h:996: error: expected ‘)’ before ‘__delta’
  488. /usr/include/unistd.h:1011: error: storage class specified for parameter ‘syscall’
  489. /usr/include/unistd.h:1034: error: expected declaration specifiers or ‘...’ before ‘__off_t’
  490. /usr/include/unistd.h:1034: error: storage class specified for parameter ‘lockf’
  491. /usr/include/unistd.h:1065: error: storage class specified for parameter ‘fdatasync’
  492. In file included from chan_skype.c:34:
  493. /usr/include/stdlib.h:102: error: storage class specified for parameter ‘div_t’
  494. /usr/include/stdlib.h:110: error: storage class specified for parameter ‘ldiv_t’
  495. /usr/include/stdlib.h:140: error: expected ‘=’, ‘,’, ‘;’, ‘asm’ or ‘__attribute__’ before ‘__ctype_get_mb_cur_max’
  496. /usr/include/stdlib.h:146: error: storage class specified for parameter ‘atof’
  497. /usr/include/stdlib.h:149: error: storage class specified for parameter ‘atoi’
  498. /usr/include/stdlib.h:152: error: storage class specified for parameter ‘atol’
  499. /usr/include/stdlib.h:158: error: expected declaration specifiers before ‘__extension__’
  500. /usr/include/stdlib.h:167: error: storage class specified for parameter ‘strtod’
  501. /usr/include/stdlib.h:186: error: storage class specified for parameter ‘strtol’
  502. /usr/include/stdlib.h:190: error: storage class specified for parameter ‘strtoul’
  503. /usr/include/stdlib.h:195: error: expected declaration specifiers before ‘__extension__’
  504. /usr/include/stdlib.h:200: error: expected declaration specifiers before ‘__extension__’
  505. /usr/include/stdlib.h:209: error: expected declaration specifiers before ‘__extension__’
  506. /usr/include/stdlib.h:214: error: expected declaration specifiers before ‘__extension__’
  507. /usr/include/stdlib.h:281: error: storage class specified for parameter ‘__strtod_internal’
  508. /usr/include/stdlib.h:284: error: storage class specified for parameter ‘__strtof_internal’
  509. /usr/include/stdlib.h:288: error: storage class specified for parameter ‘__strtold_internal’
  510. /usr/include/stdlib.h:293: error: storage class specified for parameter ‘__strtol_internal’
  511. /usr/include/stdlib.h:300: error: storage class specified for parameter ‘__strtoul_internal’
  512. /usr/include/stdlib.h:305: error: expected declaration specifiers before ‘__extension__’
  513. /usr/include/stdlib.h:313: error: expected declaration specifiers before ‘__extension__’
  514. /usr/include/stdlib.h:429: error: storage class specified for parameter ‘l64a’
  515. /usr/include/stdlib.h:433: error: storage class specified for parameter ‘a64l’
  516. In file included from /usr/include/stdlib.h:438,
  517.                  from chan_skype.c:34:
  518. /usr/include/sys/types.h:35: error: expected ‘=’, ‘,’, ‘;’, ‘asm’ or ‘__attribute__’ before ‘u_char’
  519. /usr/include/sys/types.h:36: error: expected ‘=’, ‘,’, ‘;’, ‘asm’ or ‘__attribute__’ before ‘u_short’
  520. /usr/include/sys/types.h:37: error: expected ‘=’, ‘,’, ‘;’, ‘asm’ or ‘__attribute__’ before ‘u_int’
  521. /usr/include/sys/types.h:38: error: expected ‘=’, ‘,’, ‘;’, ‘asm’ or ‘__attribute__’ before ‘u_long’
  522. /usr/include/sys/types.h:39: error: expected ‘=’, ‘,’, ‘;’, ‘asm’ or ‘__attribute__’ before ‘quad_t’
  523. /usr/include/sys/types.h:40: error: expected ‘=’, ‘,’, ‘;’, ‘asm’ or ‘__attribute__’ before ‘u_quad_t’
  524. /usr/include/sys/types.h:41: error: expected ‘=’, ‘,’, ‘;’, ‘asm’ or ‘__attribute__’ before ‘fsid_t’
  525. /usr/include/sys/types.h:46: error: expected ‘=’, ‘,’, ‘;’, ‘asm’ or ‘__attribute__’ before ‘loff_t’
  526. /usr/include/sys/types.h:50: error: expected ‘=’, ‘,’, ‘;’, ‘asm’ or ‘__attribute__’ before ‘ino_t’
  527. /usr/include/sys/types.h:62: error: expected ‘=’, ‘,’, ‘;’, ‘asm’ or ‘__attribute__’ before ‘dev_t’
  528. /usr/include/sys/types.h:72: error: expected ‘=’, ‘,’, ‘;’, ‘asm’ or ‘__attribute__’ before ‘mode_t’
  529. /usr/include/sys/types.h:77: error: expected ‘=’, ‘,’, ‘;’, ‘asm’ or ‘__attribute__’ before ‘nlink_t’
  530. /usr/include/sys/types.h:105: error: expected ‘=’, ‘,’, ‘;’, ‘asm’ or ‘__attribute__’ before ‘id_t’
  531. /usr/include/sys/types.h:116: error: expected ‘=’, ‘,’, ‘;’, ‘asm’ or ‘__attribute__’ before ‘daddr_t’
  532. /usr/include/sys/types.h:117: error: expected ‘=’, ‘,’, ‘;’, ‘asm’ or ‘__attribute__’ before ‘caddr_t’
  533. /usr/include/sys/types.h:123: error: expected ‘=’, ‘,’, ‘;’, ‘asm’ or ‘__attribute__’ before ‘key_t’
  534. In file included from /usr/include/sys/types.h:133,
  535.                  from /usr/include/stdlib.h:438,
  536.                  from chan_skype.c:34:
  537. /usr/include/time.h:93: error: expected ‘=’, ‘,’, ‘;’, ‘asm’ or ‘__attribute__’ before ‘clockid_t’
  538. /usr/include/time.h:105: error: expected ‘=’, ‘,’, ‘;’, ‘asm’ or ‘__attribute__’ before ‘timer_t’
  539. In file included from /usr/include/stdlib.h:438,
  540.                  from chan_skype.c:34:
  541. /usr/include/sys/types.h:151: error: storage class specified for parameter ‘ulong’
  542. /usr/include/sys/types.h:152: error: storage class specified for parameter ‘ushort’
  543. /usr/include/sys/types.h:153: error: storage class specified for parameter ‘uint’
  544. /usr/include/sys/types.h:195: error: storage class specified for parameter ‘int8_t’
  545. /usr/include/sys/types.h:196: error: storage class specified for parameter ‘int16_t’
  546. /usr/include/sys/types.h:197: error: storage class specified for parameter ‘int32_t’
  547. /usr/include/sys/types.h:198: error: storage class specified for parameter ‘int64_t’
  548. /usr/include/sys/types.h:201: error: storage class specified for parameter ‘u_int8_t’
  549. /usr/include/sys/types.h:202: error: storage class specified for parameter ‘u_int16_t’
  550. /usr/include/sys/types.h:203: error: storage class specified for parameter ‘u_int32_t’
  551. /usr/include/sys/types.h:204: error: storage class specified for parameter ‘u_int64_t’
  552. /usr/include/sys/types.h:206: error: storage class specified for parameter ‘register_t’
  553. In file included from /usr/include/sys/types.h:223,
  554.                  from /usr/include/stdlib.h:438,
  555.                  from chan_skype.c:34:
  556. /usr/include/sys/sysmacros.h:29: error: expected declaration specifiers before ‘__extension__’
  557. /usr/include/sys/sysmacros.h:32: error: expected declaration specifiers before ‘__extension__’
  558. /usr/include/sys/sysmacros.h:35: error: expected declaration specifiers before ‘__extension__’
  559. /usr/include/sys/sysmacros.h:41: error: expected declaration specifiers before ‘__extension__’
  560. /usr/include/sys/sysmacros.h:47: error: expected declaration specifiers before ‘__extension__’
  561. /usr/include/sys/sysmacros.h:53: error: expected declaration specifiers before ‘__extension__’
  562. In file included from /usr/include/stdlib.h:438,
  563.                  from chan_skype.c:34:
  564. /usr/include/sys/types.h:235: error: expected ‘=’, ‘,’, ‘;’, ‘asm’ or ‘__attribute__’ before ‘blkcnt_t’
  565. /usr/include/sys/types.h:239: error: expected ‘=’, ‘,’, ‘;’, ‘asm’ or ‘__attribute__’ before ‘fsblkcnt_t’
  566. /usr/include/sys/types.h:243: error: expected ‘=’, ‘,’, ‘;’, ‘asm’ or ‘__attribute__’ before ‘fsfilcnt_t’
  567. In file included from /usr/include/sys/types.h:270,
  568.                  from /usr/include/stdlib.h:438,
  569.                  from chan_skype.c:34:
  570. /usr/include/bits/pthreadtypes.h:36: error: storage class specified for parameter ‘pthread_t’
  571. /usr/include/bits/pthreadtypes.h:43: error: storage class specified for parameter ‘pthread_attr_t’
  572. /usr/include/bits/pthreadtypes.h:49: error: storage class specified for parameter ‘__pthread_slist_t’
  573. /usr/include/bits/pthreadtypes.h:68: error: expected specifier-qualifier-list before ‘__pthread_slist_t’
  574. /usr/include/bits/pthreadtypes.h:73: error: storage class specified for parameter ‘pthread_mutex_t’
  575. /usr/include/bits/pthreadtypes.h:79: error: storage class specified for parameter ‘pthread_mutexattr_t’
  576. /usr/include/bits/pthreadtypes.h:99: error: storage class specified for parameter ‘pthread_cond_t’
  577. /usr/include/bits/pthreadtypes.h:105: error: storage class specified for parameter ‘pthread_condattr_t’
  578. /usr/include/bits/pthreadtypes.h:109: error: storage class specified for parameter ‘pthread_key_t’
  579. /usr/include/bits/pthreadtypes.h:113: error: storage class specified for parameter ‘pthread_once_t’
  580. /usr/include/bits/pthreadtypes.h:139: error: storage class specified for parameter ‘pthread_rwlock_t’
  581. /usr/include/bits/pthreadtypes.h:145: error: storage class specified for parameter ‘pthread_rwlockattr_t’
  582. /usr/include/bits/pthreadtypes.h:151: error: storage class specified for parameter ‘pthread_spinlock_t’
  583. /usr/include/bits/pthreadtypes.h:160: error: storage class specified for parameter ‘pthread_barrier_t’
  584. /usr/include/bits/pthreadtypes.h:166: error: storage class specified for parameter ‘pthread_barrierattr_t’
  585. In file included from chan_skype.c:34:
  586. /usr/include/stdlib.h:445: error: storage class specified for parameter ‘random’
  587. /usr/include/stdlib.h:448: error: storage class specified for parameter ‘srandom’
  588. /usr/include/stdlib.h:455: error: expected declaration specifiers or ‘...’ before ‘size_t’
  589. /usr/include/stdlib.h:455: error: storage class specified for parameter ‘initstate’
  590. /usr/include/stdlib.h:459: error: storage class specified for parameter ‘setstate’
  591. /usr/include/stdlib.h:469: error: expected specifier-qualifier-list before ‘int32_t’
  592. /usr/include/stdlib.h:479: error: expected declaration specifiers or ‘...’ before ‘int32_t’
  593. /usr/include/stdlib.h:479: error: storage class specified for parameter ‘random_r’
  594. /usr/include/stdlib.h:479: error: nonnull argument with out-of-range operand number (argument 1, operand 2)
  595. /usr/include/stdlib.h:482: error: storage class specified for parameter ‘srandom_r’
  596. /usr/include/stdlib.h:485: error: expected declaration specifiers or ‘...’ before ‘size_t’
  597. /usr/include/stdlib.h:487: error: storage class specified for parameter ‘initstate_r’
  598. /usr/include/stdlib.h:487: error: nonnull argument with out-of-range operand number (argument 1, operand 4)
  599. /usr/include/stdlib.h:491: error: storage class specified for parameter ‘setstate_r’
  600. /usr/include/stdlib.h:498: error: storage class specified for parameter ‘rand’
  601. /usr/include/stdlib.h:500: error: storage class specified for parameter ‘srand’
  602. /usr/include/stdlib.h:505: error: storage class specified for parameter ‘rand_r’
  603. /usr/include/stdlib.h:513: error: storage class specified for parameter ‘drand48’
  604. /usr/include/stdlib.h:514: error: storage class specified for parameter ‘erand48’
  605. /usr/include/stdlib.h:517: error: storage class specified for parameter ‘lrand48’
  606. /usr/include/stdlib.h:519: error: storage class specified for parameter ‘nrand48’
  607. /usr/include/stdlib.h:522: error: storage class specified for parameter ‘mrand48’
  608. /usr/include/stdlib.h:524: error: storage class specified for parameter ‘jrand48’
  609. /usr/include/stdlib.h:527: error: storage class specified for parameter ‘srand48’
  610. /usr/include/stdlib.h:529: error: storage class specified for parameter ‘seed48’
  611. /usr/include/stdlib.h:530: error: storage class specified for parameter ‘lcong48’
  612. /usr/include/stdlib.h:547: error: storage class specified for parameter ‘drand48_r’
  613. /usr/include/stdlib.h:550: error: storage class specified for parameter ‘erand48_r’
  614. /usr/include/stdlib.h:555: error: storage class specified for parameter ‘lrand48_r’
  615. /usr/include/stdlib.h:559: error: storage class specified for parameter ‘nrand48_r’
  616. /usr/include/stdlib.h:564: error: storage class specified for parameter ‘mrand48_r’
  617. /usr/include/stdlib.h:568: error: storage class specified for parameter ‘jrand48_r’
  618. /usr/include/stdlib.h:572: error: storage class specified for parameter ‘srand48_r’
  619. /usr/include/stdlib.h:575: error: storage class specified for parameter ‘seed48_r’
  620. /usr/include/stdlib.h:579: error: storage class specified for parameter ‘lcong48_r’
  621. /usr/include/stdlib.h:589: error: expected ‘)’ before ‘__size’
  622. /usr/include/stdlib.h:591: error: expected ‘)’ before ‘__nmemb’
  623. /usr/include/stdlib.h:600: error: expected declaration specifiers or ‘...’ before ‘size_t’
  624. /usr/include/stdlib.h:601: error: storage class specified for parameter ‘realloc’
  625. /usr/include/stdlib.h:603: error: storage class specified for parameter ‘free’
  626. /usr/include/stdlib.h:608: error: storage class specified for parameter ‘cfree’
  627. In file included from /usr/include/stdlib.h:612,
  628.                  from chan_skype.c:34:
  629. /usr/include/alloca.h:33: error: expected ‘)’ before ‘__size’
  630. In file included from chan_skype.c:34:
  631. /usr/include/stdlib.h:617: error: expected ‘)’ before ‘__size’
  632. /usr/include/stdlib.h:622: error: expected declaration specifiers or ‘...’ before ‘size_t’
  633. /usr/include/stdlib.h:622: error: expected declaration specifiers or ‘...’ before ‘size_t’
  634. /usr/include/stdlib.h:623: error: storage class specified for parameter ‘posix_memalign’
  635. /usr/include/stdlib.h:628: error: storage class specified for parameter ‘abort’
  636. /usr/include/stdlib.h:632: error: storage class specified for parameter ‘atexit’
  637. /usr/include/stdlib.h:639: error: storage class specified for parameter ‘on_exit’
  638. /usr/include/stdlib.h:646: error: storage class specified for parameter ‘exit’
  639. /usr/include/stdlib.h:660: error: storage class specified for parameter ‘getenv’
  640. /usr/include/stdlib.h:666: error: storage class specified for parameter ‘__secure_getenv’
  641. /usr/include/stdlib.h:672: error: storage class specified for parameter ‘putenv’
  642. /usr/include/stdlib.h:679: error: storage class specified for parameter ‘setenv’
  643. /usr/include/stdlib.h:682: error: storage class specified for parameter ‘unsetenv’
  644. /usr/include/stdlib.h:689: error: storage class specified for parameter ‘clearenv’
  645. /usr/include/stdlib.h:698: error: storage class specified for parameter ‘mktemp’
  646. /usr/include/stdlib.h:709: error: storage class specified for parameter ‘mkstemp’
  647. /usr/include/stdlib.h:729: error: storage class specified for parameter ‘mkdtemp’
  648. /usr/include/stdlib.h:738: error: storage class specified for parameter ‘system’
  649. /usr/include/stdlib.h:757: error: storage class specified for parameter ‘realpath’
  650. /usr/include/stdlib.h:764: error: storage class specified for parameter ‘__compar_fn_t’
  651. /usr/include/stdlib.h:775: error: expected declaration specifiers or ‘...’ before ‘size_t’
  652. /usr/include/stdlib.h:775: error: expected declaration specifiers or ‘...’ before ‘size_t’
  653. /usr/include/stdlib.h:775: error: expected declaration specifiers or ‘...’ before ‘__compar_fn_t’
  654. /usr/include/stdlib.h:776: error: storage class specified for parameter ‘bsearch’
  655. /usr/include/stdlib.h:776: error: nonnull argument with out-of-range operand number (argument 1, operand 5)
  656. /usr/include/stdlib.h:780: error: expected declaration specifiers or ‘...’ before ‘size_t’
  657. /usr/include/stdlib.h:780: error: expected declaration specifiers or ‘...’ before ‘size_t’
  658. /usr/include/stdlib.h:781: error: expected declaration specifiers or ‘...’ before ‘__compar_fn_t’
  659. /usr/include/stdlib.h:781: error: storage class specified for parameter ‘qsort’
  660. /usr/include/stdlib.h:781: error: nonnull argument with out-of-range operand number (argument 1, operand 4)
  661. /usr/include/stdlib.h:785: error: storage class specified for parameter ‘abs’
  662. /usr/include/stdlib.h:786: error: storage class specified for parameter ‘labs’
  663. /usr/include/stdlib.h:799: error: expected ‘=’, ‘,’, ‘;’, ‘asm’ or ‘__attribute__’ before ‘div’
  664. /usr/include/stdlib.h:801: error: expected ‘=’, ‘,’, ‘;’, ‘asm’ or ‘__attribute__’ before ‘ldiv’
  665. /usr/include/stdlib.h:822: error: storage class specified for parameter ‘ecvt’
  666. /usr/include/stdlib.h:828: error: storage class specified for parameter ‘fcvt’
  667. /usr/include/stdlib.h:834: error: storage class specified for parameter ‘gcvt’
  668. /usr/include/stdlib.h:841: error: storage class specified for parameter ‘qecvt’
  669. /usr/include/stdlib.h:844: error: storage class specified for parameter ‘qfcvt’
  670. /usr/include/stdlib.h:846: error: storage class specified for parameter ‘qgcvt’
  671. /usr/include/stdlib.h:853: error: expected declaration specifiers or ‘...’ before ‘size_t’
  672. /usr/include/stdlib.h:853: error: storage class specified for parameter ‘ecvt_r’
  673. /usr/include/stdlib.h:856: error: expected declaration specifiers or ‘...’ before ‘size_t’
  674. /usr/include/stdlib.h:856: error: storage class specified for parameter ‘fcvt_r’
  675. /usr/include/stdlib.h:860: error: expected declaration specifiers or ‘...’ before ‘size_t’
  676. /usr/include/stdlib.h:861: error: storage class specified for parameter ‘qecvt_r’
  677. /usr/include/stdlib.h:864: error: expected declaration specifiers or ‘...’ before ‘size_t’
  678. /usr/include/stdlib.h:865: error: storage class specified for parameter ‘qfcvt_r’
  679. /usr/include/stdlib.h:873: error: expected declaration specifiers or ‘...’ before ‘size_t’
  680. /usr/include/stdlib.h:873: error: storage class specified for parameter ‘mblen’
  681. /usr/include/stdlib.h:876: error: expected ‘)’ before ‘*’ token
  682. /usr/include/stdlib.h:880: error: expected declaration specifiers or ‘...’ before ‘wchar_t’
  683. /usr/include/stdlib.h:880: error: storage class specified for parameter ‘wctomb’
  684. /usr/include/stdlib.h:884: error: expected ‘=’, ‘,’, ‘;’, ‘asm’ or ‘__attribute__’ before ‘mbstowcs’
  685. /usr/include/stdlib.h:887: error: expected ‘=’, ‘,’, ‘;’, ‘asm’ or ‘__attribute__’ before ‘wcstombs’
  686. /usr/include/stdlib.h:898: error: storage class specified for parameter ‘rpmatch’
  687. /usr/include/stdlib.h:926: error: storage class specified for parameter ‘posix_openpt’
  688. /usr/include/stdlib.h:962: error: storage class specified for parameter ‘getloadavg’
  689. In file included from /usr/include/fcntl.h:34,
  690.                  from chan_skype.c:35:
  691. /usr/include/bits/fcntl.h:146: error: expected specifier-qualifier-list before ‘__off_t’
  692. In file included from chan_skype.c:35:
  693. /usr/include/fcntl.h:76: error: storage class specified for parameter ‘fcntl’
  694. /usr/include/fcntl.h:85: error: storage class specified for parameter ‘open’
  695. /usr/include/fcntl.h:130: error: expected declaration specifiers or ‘...’ before ‘__mode_t’
  696. /usr/include/fcntl.h:130: error: storage class specified for parameter ‘creat’
  697. /usr/include/fcntl.h:176: error: expected declaration specifiers or ‘...’ before ‘__off_t’
  698. /usr/include/fcntl.h:176: error: expected declaration specifiers or ‘...’ before ‘__off_t’
  699. /usr/include/fcntl.h:177: error: storage class specified for parameter ‘posix_fadvise’
  700. /usr/include/fcntl.h:198: error: expected declaration specifiers or ‘...’ before ‘__off_t’
  701. /usr/include/fcntl.h:198: error: expected declaration specifiers or ‘...’ before ‘__off_t’
  702. /usr/include/fcntl.h:198: error: storage class specified for parameter ‘posix_fallocate’
  703. In file included from /usr/include/asm/ioctl.h:1,
  704.                  from /usr/include/asm/ioctls.h:4,
  705.                  from /usr/include/bits/ioctls.h:24,
  706.                  from /usr/include/sys/ioctl.h:27,
  707.                  from chan_skype.c:36:
  708. /usr/include/asm-generic/ioctl.h:51: error: storage class specified for parameter ‘__invalid_size_argument_for_IOC’
  709. In file included from chan_skype.c:36:
  710. /usr/include/sys/ioctl.h:42: error: storage class specified for parameter ‘ioctl’
  711. In file included from /usr/include/signal.h:33,
  712.                  from /usr/include/sys/signal.h:1,
  713.                  from chan_skype.c:37:
  714. /usr/include/bits/sigset.h:103: error: expected ‘;’, ‘,’ or ‘)’ before ‘*’ token
  715. /usr/include/bits/sigset.h:104: error: expected ‘)’ before ‘*’ token
  716. /usr/include/bits/sigset.h:105: error: expected ‘)’ before ‘*’ token
  717. In file included from /usr/include/sys/signal.h:1,
  718.                  from chan_skype.c:37:
  719. /usr/include/signal.h:41: error: expected ‘=’, ‘,’, ‘;’, ‘asm’ or ‘__attribute__’ before ‘sig_atomic_t’
  720. In file included from /usr/include/sys/signal.h:1,
  721.                  from chan_skype.c:37:
  722. /usr/include/signal.h:75: error: storage class specified for parameter ‘__sighandler_t’
  723. /usr/include/signal.h:80: error: expected ‘=’, ‘,’, ‘;’, ‘asm’ or ‘__attribute__’ before ‘__sysv_signal’
  724. /usr/include/signal.h:92: error: expected ‘=’, ‘,’, ‘;’, ‘asm’ or ‘__attribute__’ before ‘signal’
  725. /usr/include/signal.h:117: error: expected ‘)’ before ‘__pid’
  726. /usr/include/signal.h:124: error: expected ‘)’ before ‘__pgrp’
  727. /usr/include/signal.h:129: error: storage class specified for parameter ‘raise’
  728. /usr/include/signal.h:134: error: expected ‘=’, ‘,’, ‘;’, ‘asm’ or ‘__attribute__’ before ‘ssignal’
  729. /usr/include/signal.h:136: error: storage class specified for parameter ‘gsignal’
  730. /usr/include/signal.h:141: error: storage class specified for parameter ‘psignal’
  731. /usr/include/signal.h:153: error: storage class specified for parameter ‘__sigpause’
  732. /usr/include/signal.h:181: error: storage class specified for parameter ‘sigblock’
  733. /usr/include/signal.h:184: error: storage class specified for parameter ‘sigsetmask’
  734. /usr/include/signal.h:187: error: storage class specified for parameter ‘siggetmask’
  735. /usr/include/signal.h:201: error: expected ‘=’, ‘,’, ‘;’, ‘asm’ or ‘__attribute__’ before ‘sig_t’
  736. In file included from /usr/include/signal.h:212,
  737.                  from /usr/include/sys/signal.h:1,
  738.                  from chan_skype.c:37:
  739. /usr/include/bits/siginfo.h:37: error: storage class specified for parameter ‘sigval_t’
  740. /usr/include/bits/siginfo.h:65: error: expected specifier-qualifier-list before ‘__pid_t’
  741. /usr/include/bits/siginfo.h:74: error: expected specifier-qualifier-list before ‘sigval_t’
  742. /usr/include/bits/siginfo.h:80: error: expected specifier-qualifier-list before ‘__pid_t’
  743. /usr/include/bits/siginfo.h:88: error: expected specifier-qualifier-list before ‘__pid_t’
  744. /usr/include/bits/siginfo.h:108: error: storage class specified for parameter ‘siginfo_t’
  745. /usr/include/bits/siginfo.h:275: error: expected specifier-qualifier-list before ‘sigval_t’
  746. /usr/include/bits/siginfo.h:293: error: storage class specified for parameter ‘sigevent_t’
  747. In file included from /usr/include/sys/signal.h:1,
  748.                  from chan_skype.c:37:
  749. /usr/include/signal.h:216: error: expected ‘)’ before ‘*’ token
  750. /usr/include/signal.h:219: error: expected ‘)’ before ‘*’ token
  751. /usr/include/signal.h:222: error: expected ‘)’ before ‘*’ token
  752. /usr/include/signal.h:225: error: expected ‘)’ before ‘*’ token
  753. /usr/include/signal.h:228: error: expected ‘;’, ‘,’ or ‘)’ before ‘*’ token
  754. In file included from /usr/include/signal.h:246,
  755.                  from /usr/include/sys/signal.h:1,
  756.                  from chan_skype.c:37:
  757. /usr/include/bits/sigaction.h:32: error: expected specifier-qualifier-list before ‘__sighandler_t’
  758. /usr/include/bits/sigaction.h:44: error: expected specifier-qualifier-list before ‘__sigset_t’
  759. In file included from /usr/include/sys/signal.h:1,
  760.                  from chan_skype.c:37:
  761. /usr/include/signal.h:249: error: expected ‘;’, ‘,’ or ‘)’ before ‘*’ token
  762. /usr/include/signal.h:257: error: expected ‘;’, ‘,’ or ‘)’ before ‘*’ token
  763. /usr/include/signal.h:261: error: storage class specified for parameter ‘sigaction’
  764. /usr/include/signal.h:264: error: expected ‘)’ before ‘*’ token
  765. /usr/include/signal.h:271: error: expected ‘;’, ‘,’ or ‘)’ before ‘*’ token
  766. /usr/include/signal.h:279: error: expected ‘;’, ‘,’ or ‘)’ before ‘*’ token
  767. /usr/include/signal.h:287: error: expected ‘;’, ‘,’ or ‘)’ before ‘*’ token
  768. /usr/include/signal.h:294: error: expected ‘)’ before ‘__pid’
  769. /usr/include/signal.h:304: error: storage class specified for parameter ‘_sys_siglist’
  770. /usr/include/signal.h:305: error: storage class specified for parameter ‘sys_siglist’
  771. /usr/include/signal.h:310: error: expected specifier-qualifier-list before ‘__sighandler_t’
  772. /usr/include/signal.h:329: error: storage class specified for parameter ‘sigvec’
  773. In file included from /usr/include/sys/signal.h:1,
  774.                  from chan_skype.c:37:
  775. /usr/include/signal.h:336: error: storage class specified for parameter ‘sigreturn’
  776. /usr/include/signal.h:346: error: storage class specified for parameter ‘siginterrupt’
  777. In file included from /usr/include/signal.h:348,
  778.                  from /usr/include/sys/signal.h:1,
  779.                  from chan_skype.c:37:
  780. /usr/include/bits/sigstack.h:54: error: expected specifier-qualifier-list before ‘size_t’
  781. /usr/include/bits/sigstack.h:55: error: storage class specified for parameter ‘stack_t’
  782. In file included from /usr/include/sys/signal.h:1,
  783.                  from chan_skype.c:37:
  784. /usr/include/signal.h:358: error: storage class specified for parameter ‘sigstack’
  785. /usr/include/signal.h:363: error: storage class specified for parameter ‘sigaltstack’
  786. In file included from /usr/include/signal.h:387,
  787.                  from /usr/include/sys/signal.h:1,
  788.                  from chan_skype.c:37:
  789. /usr/include/bits/sigthread.h:32: error: expected ‘;’, ‘,’ or ‘)’ before ‘*’ token
  790. /usr/include/bits/sigthread.h:36: error: expected ‘)’ before ‘__threadid’
  791. In file included from /usr/include/sys/signal.h:1,
  792.                  from chan_skype.c:37:
  793. /usr/include/signal.h:394: error: storage class specified for parameter ‘__libc_current_sigrtmin’
  794. /usr/include/signal.h:396: error: storage class specified for parameter ‘__libc_current_sigrtmax’
  795. In file included from chan_skype.c:38:
  796. /usr/include/ctype.h:82: error: storage class specified for parameter ‘__ctype_b_loc’
  797. /usr/include/ctype.h:83: error: expected ‘=’, ‘,’, ‘;’, ‘asm’ or ‘__attribute__’ before ‘*’ token
  798. /usr/include/ctype.h:85: error: expected ‘=’, ‘,’, ‘;’, ‘asm’ or ‘__attribute__’ before ‘*’ token
  799. /usr/include/ctype.h:102: error: storage class specified for parameter ‘isalnum’
  800. /usr/include/ctype.h:103: error: storage class specified for parameter ‘isalpha’
  801. /usr/include/ctype.h:104: error: storage class specified for parameter ‘iscntrl’
  802. /usr/include/ctype.h:105: error: storage class specified for parameter ‘isdigit’
  803. /usr/include/ctype.h:106: error: storage class specified for parameter ‘islower’
  804. /usr/include/ctype.h:107: error: storage class specified for parameter ‘isgraph’
  805. /usr/include/ctype.h:108: error: storage class specified for parameter ‘isprint’
  806. /usr/include/ctype.h:109: error: storage class specified for parameter ‘ispunct’
  807. /usr/include/ctype.h:110: error: storage class specified for parameter ‘isspace’
  808. /usr/include/ctype.h:111: error: storage class specified for parameter ‘isupper’
  809. /usr/include/ctype.h:112: error: storage class specified for parameter ‘isxdigit’
  810. /usr/include/ctype.h:116: error: storage class specified for parameter ‘tolower’
  811. /usr/include/ctype.h:119: error: storage class specified for parameter ‘toupper’
  812. /usr/include/ctype.h:142: error: storage class specified for parameter ‘isascii’
  813. /usr/include/ctype.h:146: error: storage class specified for parameter ‘toascii’
  814. /usr/include/ctype.h:150: error: storage class specified for parameter ‘_toupper’
  815. /usr/include/ctype.h:151: error: storage class specified for parameter ‘_tolower’
  816. In file included from /usr/include/sys/stat.h:105,
  817.                  from chan_skype.c:40:
  818. /usr/include/bits/stat.h:38: error: expected specifier-qualifier-list before ‘__dev_t’
  819. In file included from chan_skype.c:40:
  820. /usr/include/sys/stat.h:208: error: storage class specified for parameter ‘stat’
  821. /usr/include/sys/stat.h:212: error: storage class specified for parameter ‘fstat’
  822. /usr/include/sys/stat.h:260: error: storage class specified for parameter ‘lstat’
  823. /usr/include/sys/stat.h:280: error: expected declaration specifiers or ‘...’ before ‘__mode_t’
  824. /usr/include/sys/stat.h:281: error: storage class specified for parameter ‘chmod’
  825. /usr/include/sys/stat.h:287: error: expected declaration specifiers or ‘...’ before ‘__mode_t’
  826. /usr/include/sys/stat.h:288: error: storage class specified for parameter ‘lchmod’
  827. /usr/include/sys/stat.h:293: error: expected declaration specifiers or ‘...’ before ‘__mode_t’
  828. /usr/include/sys/stat.h:293: error: storage class specified for parameter ‘fchmod’
  829. /usr/include/sys/stat.h:307: error: expected ‘=’, ‘,’, ‘;’, ‘asm’ or ‘__attribute__’ before ‘umask’
  830. /usr/include/sys/stat.h:316: error: expected declaration specifiers or ‘...’ before ‘__mode_t’
  831. /usr/include/sys/stat.h:317: error: storage class specified for parameter ‘mkdir’
  832. /usr/include/sys/stat.h:331: error: expected declaration specifiers or ‘...’ before ‘__mode_t’
  833. /usr/include/sys/stat.h:331: error: expected declaration specifiers or ‘...’ before ‘__dev_t’
  834. /usr/include/sys/stat.h:332: error: storage class specified for parameter ‘mknod’
  835. /usr/include/sys/stat.h:345: error: expected declaration specifiers or ‘...’ before ‘__mode_t’
  836. /usr/include/sys/stat.h:346: error: storage class specified for parameter ‘mkfifo’
  837. /usr/include/sys/stat.h:381: error: storage class specified for parameter ‘__fxstat’
  838. /usr/include/sys/stat.h:383: error: storage class specified for parameter ‘__xstat’
  839. /usr/include/sys/stat.h:385: error: storage class specified for parameter ‘__lxstat’
  840. /usr/include/sys/stat.h:388: error: storage class specified for parameter ‘__fxstatat’
  841. /usr/include/sys/stat.h:423: error: expected declaration specifiers or ‘...’ before ‘__mode_t’
  842. /usr/include/sys/stat.h:424: error: expected declaration specifiers or ‘...’ before ‘__dev_t’
  843. /usr/include/sys/stat.h:424: error: storage class specified for parameter ‘__xmknod’
  844. /usr/include/sys/stat.h:424: error: nonnull argument with out-of-range operand number (argument 1, operand 4)
  845. /usr/include/sys/stat.h:427: error: expected declaration specifiers or ‘...’ before ‘__mode_t’
  846. /usr/include/sys/stat.h:427: error: expected declaration specifiers or ‘...’ before ‘__dev_t’
  847. /usr/include/sys/stat.h:428: error: storage class specified for parameter ‘__xmknodat’
  848. /usr/include/sys/stat.h:428: error: nonnull argument with out-of-range operand number (argument 1, operand 5)
  849. /usr/include/sys/stat.h:435: error: expected ‘=’, ‘,’, ‘;’, ‘asm’ or ‘__attribute__’ before ‘{’ token
  850. /usr/include/sys/stat.h:442: error: expected ‘=’, ‘,’, ‘;’, ‘asm’ or ‘__attribute__’ before ‘{’ token
  851. /usr/include/sys/stat.h:449: error: expected ‘=’, ‘,’, ‘;’, ‘asm’ or ‘__attribute__’ before ‘{’ token
  852. /usr/include/sys/stat.h:464: error: expected declaration specifiers or ‘...’ before ‘__mode_t’
  853. /usr/include/sys/stat.h:464: error: expected declaration specifiers or ‘...’ before ‘__dev_t’
  854. /usr/include/sys/stat.h:465: error: expected ‘=’, ‘,’, ‘;’, ‘asm’ or ‘__attribute__’ before ‘{’ token
  855. In file included from chan_skype.c:41:
  856. /usr/include/dlfcn.h:58: error: storage class specified for parameter ‘dlopen’
  857. /usr/include/dlfcn.h:62: error: storage class specified for parameter ‘dlclose’
  858. /usr/include/dlfcn.h:67: error: storage class specified for parameter ‘dlsym’
  859. /usr/include/dlfcn.h:84: error: storage class specified for parameter ‘dlerror’
  860. chan_skype.c:43:32: error: asterisk/localtime.h: No such file or directory
  861. chan_skype.c:44:27: error: asterisk/lock.h: No such file or directory
  862. chan_skype.c:45:28: error: asterisk/utils.h: No such file or directory
  863. chan_skype.c:46:30: error: asterisk/channel.h: No such file or directory
  864. chan_skype.c:47:29: error: asterisk/config.h: No such file or directory
  865. chan_skype.c:48:29: error: asterisk/logger.h: No such file or directory
  866. chan_skype.c:49:29: error: asterisk/module.h: No such file or directory
  867. chan_skype.c:50:26: error: asterisk/pbx.h: No such file or directory
  868. chan_skype.c:51:30: error: asterisk/options.h: No such file or directory
  869. chan_skype.c:52:26: error: asterisk/cli.h: No such file or directory
  870. chan_skype.c:53:31: error: asterisk/callerid.h: No such file or directory
  871. chan_skype.c:54:31: error: asterisk/features.h: No such file or directory
  872. chan_skype.c:55:30: error: asterisk/astobj2.h: No such file or directory
  873. chan_skype.c:56:34: error: asterisk/musiconhold.h: No such file or directory
  874. chan_skype.c:57:34: error: asterisk/devicestate.h: No such file or directory
  875. chan_skype.c:58:28: error: asterisk/paths.h: No such file or directory
  876. chan_skype.c:59:30: error: asterisk/manager.h: No such file or directory
  877. chan_skype.c:60:26: error: asterisk/rtp.h: No such file or directory
  878. chan_skype.c:61:26: error: asterisk/app.h: No such file or directory
  879. chan_skype.c:62:28: error: asterisk/astdb.h: No such file or directory
  880. chan_skype.c:63:29: error: asterisk/causes.h: No such file or directory
  881. In file included from /usr/include/netinet/in.h:23,
  882.                  from skypeforasterisk.h:8,
  883.                  from chan_skype.c:66:
  884. /usr/include/stdint.h:49: error: storage class specified for parameter ‘uint8_t’
  885. /usr/include/stdint.h:50: error: storage class specified for parameter ‘uint16_t’
  886. /usr/include/stdint.h:52: error: storage class specified for parameter ‘uint32_t’
  887. /usr/include/stdint.h:58: error: expected declaration specifiers before ‘__extension__’
  888. /usr/include/stdint.h:66: error: storage class specified for parameter ‘int_least8_t’
  889. /usr/include/stdint.h:67: error: storage class specified for parameter ‘int_least16_t’
  890. /usr/include/stdint.h:68: error: storage class specified for parameter ‘int_least32_t’
  891. /usr/include/stdint.h:72: error: expected declaration specifiers before ‘__extension__’
  892. /usr/include/stdint.h:77: error: storage class specified for parameter ‘uint_least8_t’
  893. /usr/include/stdint.h:78: error: storage class specified for parameter ‘uint_least16_t’
  894. /usr/include/stdint.h:79: error: storage class specified for parameter ‘uint_least32_t’
  895. /usr/include/stdint.h:83: error: expected declaration specifiers before ‘__extension__’
  896. /usr/include/stdint.h:91: error: storage class specified for parameter ‘int_fast8_t’
  897. /usr/include/stdint.h:97: error: storage class specified for parameter ‘int_fast16_t’
  898. /usr/include/stdint.h:98: error: storage class specified for parameter ‘int_fast32_t’
  899. /usr/include/stdint.h:99: error: expected declaration specifiers before ‘__extension__’
  900. /usr/include/stdint.h:104: error: storage class specified for parameter ‘uint_fast8_t’
  901. /usr/include/stdint.h:110: error: storage class specified for parameter ‘uint_fast16_t’
  902. /usr/include/stdint.h:111: error: storage class specified for parameter ‘uint_fast32_t’
  903. /usr/include/stdint.h:112: error: expected declaration specifiers before ‘__extension__’
  904. /usr/include/stdint.h:129: error: storage class specified for parameter ‘uintptr_t’
  905. /usr/include/stdint.h:138: error: expected declaration specifiers before ‘__extension__’
  906. /usr/include/stdint.h:140: error: expected declaration specifiers before ‘__extension__’
  907. In file included from /usr/include/sys/uio.h:29,
  908.                  from /usr/include/sys/socket.h:27,
  909.                  from /usr/include/netinet/in.h:24,
  910.                  from skypeforasterisk.h:8,
  911.                  from chan_skype.c:66:
  912. /usr/include/bits/uio.h:47: error: expected specifier-qualifier-list before ‘size_t’
  913. In file included from /usr/include/sys/socket.h:27,
  914.                  from /usr/include/netinet/in.h:24,
  915.                  from skypeforasterisk.h:8,
  916.                  from chan_skype.c:66:
  917. /usr/include/sys/uio.h:40: error: expected ‘=’, ‘,’, ‘;’, ‘asm’ or ‘__attribute__’ before ‘readv’
  918. /usr/include/sys/uio.h:50: error: expected ‘=’, ‘,’, ‘;’, ‘asm’ or ‘__attribute__’ before ‘writev’
  919. In file included from /usr/include/bits/socket.h:142,
  920.                  from /usr/include/sys/socket.h:35,
  921.                  from /usr/include/netinet/in.h:24,
  922.                  from skypeforasterisk.h:8,
  923.                  from chan_skype.c:66:
  924. /usr/include/bits/sockaddr.h:29: error: storage class specified for parameter ‘sa_family_t’
  925. In file included from /usr/include/sys/socket.h:35,
  926.                  from /usr/include/netinet/in.h:24,
  927.                  from skypeforasterisk.h:8,
  928.                  from chan_skype.c:66:
  929. /usr/include/bits/socket.h:147: error: expected specifier-qualifier-list before ‘sa_family_t’
  930. /usr/include/bits/socket.h:164: error: expected specifier-qualifier-list before ‘sa_family_t’
  931. /usr/include/bits/socket.h:218: error: expected specifier-qualifier-list before ‘socklen_t’
  932. /usr/include/bits/socket.h:235: error: expected specifier-qualifier-list before ‘size_t’
  933. /usr/include/bits/socket.h:264: error: storage class specified for parameter ‘__cmsg_nxthdr’
  934. /usr/include/bits/socket.h:304: error: expected specifier-qualifier-list before ‘pid_t’
  935. In file included from /usr/include/netinet/in.h:24,
  936.                  from skypeforasterisk.h:8,
  937.                  from chan_skype.c:66:
  938. /usr/include/sys/socket.h:100: error: storage class specified for parameter ‘socket’
  939. /usr/include/sys/socket.h:107: error: storage class specified for parameter ‘socketpair’
  940. /usr/include/sys/socket.h:110: error: expected declaration specifiers or ‘...’ before ‘socklen_t’
  941. /usr/include/sys/socket.h:111: error: storage class specified for parameter ‘bind’
  942. /usr/include/sys/socket.h:115: error: expected declaration specifiers or ‘...’ before ‘socklen_t’
  943. /usr/include/sys/socket.h:115: error: storage class specified for parameter ‘getsockname’
  944. /usr/include/sys/socket.h:124: error: expected declaration specifiers or ‘...’ before ‘socklen_t’
  945. /usr/include/sys/socket.h:124: error: storage class specified for parameter ‘connect’
  946. /usr/include/sys/socket.h:129: error: expected declaration specifiers or ‘...’ before ‘socklen_t’
  947. /usr/include/sys/socket.h:129: error: storage class specified for parameter ‘getpeername’
  948. /usr/include/sys/socket.h:136: error: expected ‘=’, ‘,’, ‘;’, ‘asm’ or ‘__attribute__’ before ‘send’
  949. /usr/include/sys/socket.h:143: error: expected ‘=’, ‘,’, ‘;’, ‘asm’ or ‘__attribute__’ before ‘recv’
  950. /usr/include/sys/socket.h:150: error: expected ‘=’, ‘,’, ‘;’, ‘asm’ or ‘__attribute__’ before ‘sendto’
  951. /usr/include/sys/socket.h:161: error: expected ‘=’, ‘,’, ‘;’, ‘asm’ or ‘__attribute__’ before ‘recvfrom’
  952. /usr/include/sys/socket.h:171: error: expected ‘=’, ‘,’, ‘;’, ‘asm’ or ‘__attribute__’ before ‘sendmsg’
  953. /usr/include/sys/socket.h:179: error: expected ‘=’, ‘,’, ‘;’, ‘asm’ or ‘__attribute__’ before ‘recvmsg’
  954. /usr/include/sys/socket.h:187: error: expected declaration specifiers or ‘...’ before ‘socklen_t’
  955. /usr/include/sys/socket.h:187: error: storage class specified for parameter ‘getsockopt’
  956. /usr/include/sys/socket.h:193: error: expected declaration specifiers or ‘...’ before ‘socklen_t’
  957. /usr/include/sys/socket.h:193: error: storage class specified for parameter ‘setsockopt’
  958. /usr/include/sys/socket.h:199: error: storage class specified for parameter ‘listen’
  959. /usr/include/sys/socket.h:210: error: expected declaration specifiers or ‘...’ before ‘socklen_t’
  960. /usr/include/sys/socket.h:210: error: storage class specified for parameter ‘accept’
  961. /usr/include/sys/socket.h:218: error: storage class specified for parameter ‘shutdown’
  962. /usr/include/sys/socket.h:223: error: storage class specified for parameter ‘sockatmark’
  963. /usr/include/sys/socket.h:231: error: storage class specified for parameter ‘isfdtype’
  964. In file included from skypeforasterisk.h:8,
  965.                  from chan_skype.c:66:
  966. /usr/include/netinet/in.h:92: error: expected ‘=’, ‘,’, ‘;’, ‘asm’ or ‘__attribute__’ before ‘in_port_t’
  967. /usr/include/netinet/in.h:136: error: expected ‘=’, ‘,’, ‘;’, ‘asm’ or ‘__attribute__’ before ‘in_addr_t’
  968. /usr/include/netinet/in.h:139: error: expected specifier-qualifier-list before ‘in_addr_t’
  969. /usr/include/netinet/in.h:197: error: expected specifier-qualifier-list before ‘uint8_t’
  970. /usr/include/netinet/in.h:206: error: storage class specified for parameter ‘in6addr_any’
  971. /usr/include/netinet/in.h:207: error: storage class specified for parameter ‘in6addr_loopback’
  972. /usr/include/netinet/in.h:221: error: expected specifier-qualifier-list before ‘sa_family_t’
  973. /usr/include/netinet/in.h:235: error: expected specifier-qualifier-list before ‘sa_family_t’
  974. /usr/include/netinet/in.h:280: error: expected specifier-qualifier-list before ‘uint32_t’
  975. /usr/include/netinet/in.h:289: error: expected specifier-qualifier-list before ‘uint32_t’
  976. /usr/include/netinet/in.h:309: error: expected specifier-qualifier-list before ‘uint32_t’
  977. /usr/include/netinet/in.h:324: error: expected specifier-qualifier-list before ‘uint32_t’
  978. In file included from skypeforasterisk.h:8,
  979.                  from chan_skype.c:66:
  980. /usr/include/netinet/in.h:354: error: expected ‘=’, ‘,’, ‘;’, ‘asm’ or ‘__attribute__’ before ‘ntohl’
  981. /usr/include/netinet/in.h:355: error: expected ‘=’, ‘,’, ‘;’, ‘asm’ or ‘__attribute__’ before ‘ntohs’
  982. /usr/include/netinet/in.h:357: error: expected ‘=’, ‘,’, ‘;’, ‘asm’ or ‘__attribute__’ before ‘htonl’
  983. /usr/include/netinet/in.h:359: error: expected ‘=’, ‘,’, ‘;’, ‘asm’ or ‘__attribute__’ before ‘htons’
  984. In file included from skypeforasterisk.h:8,
  985.                  from chan_skype.c:66:
  986. /usr/include/netinet/in.h:428: error: storage class specified for parameter ‘bindresvport’
  987. /usr/include/netinet/in.h:432: error: storage class specified for parameter ‘bindresvport6’
  988. /usr/include/netinet/in.h:466: error: expected specifier-qualifier-list before ‘uint32_t’
  989. In file included from chan_skype.c:66:
  990. skypeforasterisk.h:16: warning: empty declaration
  991. skypeforasterisk.h:17: warning: empty declaration
  992. skypeforasterisk.h:18: warning: empty declaration
  993. skypeforasterisk.h:19: warning: empty declaration
  994. skypeforasterisk.h:89: warning: ‘malloc’ attribute ignored
  995. skypeforasterisk.h:188: warning: empty declaration
  996. skypeforasterisk.h:206: warning: empty declaration
  997. skypeforasterisk.h:208: error: expected declaration specifiers or ‘...’ before ‘size_t’
  998. skypeforasterisk.h:210: error: expected declaration specifiers or ‘...’ before ‘size_t’
  999. skypeforasterisk.h:211: error: expected declaration specifiers or ‘...’ before ‘size_t’
  1000. skypeforasterisk.h:218: warning: ‘malloc’ attribute ignored
  1001. skypeforasterisk.h:229: warning: empty declaration
  1002. skypeforasterisk.h:233: error: expected declaration specifiers or ‘...’ before ‘size_t’
  1003. skypeforasterisk.h:243: warning: empty declaration
  1004. skypeforasterisk.h:260: warning: empty declaration
  1005. skypeforasterisk.h:290: warning: empty declaration
  1006. skypeforasterisk.h:310: error: expected declaration specifiers or ‘...’ before ‘uint8_t’
  1007. skypeforasterisk.h:316: warning: empty declaration
  1008. skypeforasterisk.h:331: warning: empty declaration
  1009. skypeforasterisk.h:340: warning: empty declaration
  1010. skypeforasterisk.h:341: warning: empty declaration
  1011. chan_skype.c:82: warning: empty declaration
  1012. chan_skype.c:90: warning: empty declaration
  1013. chan_skype.c:95: error: expected specifier-qualifier-list before ‘AST_LIST_ENTRY’
  1014. chan_skype.c:96: warning: empty declaration
  1015. chan_skype.c:107: error: expected specifier-qualifier-list before ‘AST_DECLARE_STRING_FIELDS’
  1016. chan_skype.c:151: warning: empty declaration
  1017. chan_skype.c:163: error: field ‘cid’ has incomplete type
  1018. chan_skype.c:170: error: field ‘f’ has incomplete type
  1019. chan_skype.c:172: warning: empty declaration
  1020. chan_skype.c:192: warning: empty declaration
  1021. chan_skype.c:194: error: storage class specified for parameter ‘global_defaults’
  1022. chan_skype.c:194: error: parameter ‘global_defaults’ is initialized
  1023. chan_skype.c:201: error: storage class specified for parameter ‘global_config’
  1024. chan_skype.c:202: error: storage class specified for parameter ‘broken’
  1025. chan_skype.c:204: error: storage class specified for parameter ‘call_datastore_free’
  1026. chan_skype.c:205: error: storage class specified for parameter ‘call_datastore_duplicate’
  1027. chan_skype.c:207: error: storage class specified for parameter ‘skype_call_datastore’
  1028. chan_skype.c:207: error: parameter ‘skype_call_datastore’ is initialized
  1029. chan_skype.c:208: error: unknown field ‘type’ specified in initializer
  1030. chan_skype.c:208: warning: excess elements in struct initializer
  1031. chan_skype.c:208: warning: (near initialization for ‘skype_call_datastore’)
  1032. chan_skype.c:209: error: unknown field ‘destroy’ specified in initializer
  1033. chan_skype.c:209: warning: excess elements in struct initializer
  1034. chan_skype.c:209: warning: (near initialization for ‘skype_call_datastore’)
  1035. chan_skype.c:210: error: unknown field ‘duplicate’ specified in initializer
  1036. chan_skype.c:210: warning: excess elements in struct initializer
  1037. chan_skype.c:210: warning: (near initialization for ‘skype_call_datastore’)
  1038. chan_skype.c:214: error: expected ‘=’, ‘,’, ‘;’, ‘asm’ or ‘__attribute__’ before ‘{’ token
  1039. chan_skype.c:225: error: expected ‘=’, ‘,’, ‘;’, ‘asm’ or ‘__attribute__’ before ‘{’ token
  1040. chan_skype.c:240: error: storage class specified for parameter ‘default_prefs’
  1041. chan_skype.c:241: error: storage class specified for parameter ‘default_capability’
  1042. chan_skype.c:241: error: parameter ‘default_capability’ is initialized
  1043. chan_skype.c:241: error: ‘AST_FORMAT_ULAW’ undeclared (first use in this function)
  1044. chan_skype.c:241: error: (Each undeclared identifier is reported only once
  1045. chan_skype.c:241: error: for each function it appears in.)
  1046. chan_skype.c:241: error: ‘AST_FORMAT_G729A’ undeclared (first use in this function)
  1047. chan_skype.c:247: error: expected ‘=’, ‘,’, ‘;’, ‘asm’ or ‘__attribute__’ before ‘monitor_thread’
  1048. chan_skype.c:248: error: storage class specified for parameter ‘monitor_shutdown’
  1049. chan_skype.c:249: error: storage class specified for parameter ‘monitor_reload’
  1050. chan_skype.c:250: error: storage class specified for parameter ‘monitor_alert’
  1051. chan_skype.c:252: error: storage class specified for parameter ‘dynamic_codec_change’
  1052. chan_skype.c:254: warning: ‘enum ast_channel_state’ declared inside parameter list
  1053. chan_skype.c:254: warning: its scope is only this definition or declaration, which is probably not what you want
  1054. chan_skype.c:254: error: storage class specified for parameter ‘new_ast_channel’
  1055. chan_skype.c:255: error: storage class specified for parameter ‘request’
  1056. chan_skype.c:256: error: storage class specified for parameter ‘digit_begin’
  1057. chan_skype.c:257: error: storage class specified for parameter ‘digit_end’
  1058. chan_skype.c:258: error: storage class specified for parameter ‘call’
  1059. chan_skype.c:259: error: storage class specified for parameter ‘hangup’
  1060. chan_skype.c:260: error: storage class specified for parameter ‘answer’
  1061. chan_skype.c:261: error: storage class specified for parameter ‘frame_read’
  1062. chan_skype.c:262: error: storage class specified for parameter ‘frame_write’
  1063. chan_skype.c:263: error: expected declaration specifiers or ‘...’ before ‘size_t’
  1064. chan_skype.c:263: error: storage class specified for parameter ‘indicate’
  1065. chan_skype.c:264: error: storage class specified for parameter ‘fixup’
  1066. chan_skype.c:265: error: expected declaration specifiers or ‘...’ before ‘size_t’
  1067. chan_skype.c:265: error: storage class specified for parameter ‘channel_read’
  1068. chan_skype.c:266: error: storage class specified for parameter ‘transfer’
  1069. chan_skype.c:268: error: storage class specified for parameter ‘destroy_client_call’
  1070. chan_skype.c:269: error: storage class specified for parameter ‘destroy_client_user’
  1071. chan_skype.c:270: error: storage class specified for parameter ‘unlink_client_call’
  1072. chan_skype.c:271: error: storage class specified for parameter ‘do_monitor’
  1073. chan_skype.c:273: error: storage class specified for parameter ‘rtp_get_info’
  1074. chan_skype.c:274: error: storage class specified for parameter ‘rtp_set_peer’
  1075. chan_skype.c:275: error: storage class specified for parameter ‘rtp_get_codec’
  1076. chan_skype.c:277: error: storage class specified for parameter ‘chan_tech’
  1077. chan_skype.c:277: error: parameter ‘chan_tech’ is initialized
  1078. chan_skype.c:278: error: unknown field ‘type’ specified in initializer
  1079. chan_skype.c:278: warning: excess elements in struct initializer
  1080. chan_skype.c:278: warning: (near initialization for ‘chan_tech’)
  1081. chan_skype.c:279: error: unknown field ‘description’ specified in initializer
  1082. chan_skype.c:279: warning: excess elements in struct initializer
  1083. chan_skype.c:279: warning: (near initialization for ‘chan_tech’)
  1084. chan_skype.c:280: error: unknown field ‘capabilities’ specified in initializer
  1085. chan_skype.c:280: error: ‘AST_FORMAT_SLINEAR’ undeclared (first use in this function)
  1086. chan_skype.c:280: warning: excess elements in struct initializer
  1087. chan_skype.c:280: warning: (near initialization for ‘chan_tech’)
  1088. chan_skype.c:281: error: unknown field ‘requester’ specified in initializer
  1089. chan_skype.c:281: warning: excess elements in struct initializer
  1090. chan_skype.c:281: warning: (near initialization for ‘chan_tech’)
  1091. chan_skype.c:282: error: unknown field ‘send_digit_begin’ specified in initializer
  1092. chan_skype.c:282: warning: excess elements in struct initializer
  1093. chan_skype.c:282: warning: (near initialization for ‘chan_tech’)
  1094. chan_skype.c:283: error: unknown field ‘send_digit_end’ specified in initializer
  1095. chan_skype.c:283: warning: excess elements in struct initializer
  1096. chan_skype.c:283: warning: (near initialization for ‘chan_tech’)
  1097. chan_skype.c:284: error: unknown field ‘call’ specified in initializer
  1098. chan_skype.c:284: warning: excess elements in struct initializer
  1099. chan_skype.c:284: warning: (near initialization for ‘chan_tech’)
  1100. chan_skype.c:285: error: unknown field ‘hangup’ specified in initializer
  1101. chan_skype.c:285: warning: excess elements in struct initializer
  1102. chan_skype.c:285: warning: (near initialization for ‘chan_tech’)
  1103. chan_skype.c:286: error: unknown field ‘answer’ specified in initializer
  1104. chan_skype.c:286: warning: excess elements in struct initializer
  1105. chan_skype.c:286: warning: (near initialization for ‘chan_tech’)
  1106. chan_skype.c:287: error: unknown field ‘read’ specified in initializer
  1107. chan_skype.c:287: warning: excess elements in struct initializer
  1108. chan_skype.c:287: warning: (near initialization for ‘chan_tech’)
  1109. chan_skype.c:288: error: unknown field ‘write’ specified in initializer
  1110. chan_skype.c:288: warning: excess elements in struct initializer
  1111. chan_skype.c:288: warning: (near initialization for ‘chan_tech’)
  1112. chan_skype.c:289: error: unknown field ‘indicate’ specified in initializer
  1113. chan_skype.c:289: warning: excess elements in struct initializer
  1114. chan_skype.c:289: warning: (near initialization for ‘chan_tech’)
  1115. chan_skype.c:290: error: unknown field ‘fixup’ specified in initializer
  1116. chan_skype.c:290: warning: excess elements in struct initializer
  1117. chan_skype.c:290: warning: (near initialization for ‘chan_tech’)
  1118. chan_skype.c:291: error: unknown field ‘func_channel_read’ specified in initializer
  1119. chan_skype.c:291: warning: excess elements in struct initializer
  1120. chan_skype.c:291: warning: (near initialization for ‘chan_tech’)
  1121. chan_skype.c:292: error: unknown field ‘bridge’ specified in initializer
  1122. chan_skype.c:292: error: ‘ast_rtp_bridge’ undeclared (first use in this function)
  1123. chan_skype.c:292: warning: excess elements in struct initializer
  1124. chan_skype.c:292: warning: (near initialization for ‘chan_tech’)
  1125. chan_skype.c:293: error: unknown field ‘transfer’ specified in initializer
  1126. chan_skype.c:293: warning: excess elements in struct initializer
  1127. chan_skype.c:293: warning: (near initialization for ‘chan_tech’)
  1128. chan_skype.c:296: error: storage class specified for parameter ‘chan_rtp’
  1129. chan_skype.c:296: error: parameter ‘chan_rtp’ is initialized
  1130. chan_skype.c:297: error: unknown field ‘type’ specified in initializer
  1131. chan_skype.c:297: warning: excess elements in struct initializer
  1132. chan_skype.c:297: warning: (near initialization for ‘chan_rtp’)
  1133. chan_skype.c:298: error: unknown field ‘get_rtp_info’ specified in initializer
  1134. chan_skype.c:298: warning: excess elements in struct initializer
  1135. chan_skype.c:298: warning: (near initialization for ‘chan_rtp’)
  1136. chan_skype.c:299: error: unknown field ‘set_rtp_peer’ specified in initializer
  1137. chan_skype.c:299: warning: excess elements in struct initializer
  1138. chan_skype.c:299: warning: (near initialization for ‘chan_rtp’)
  1139. chan_skype.c:300: error: unknown field ‘get_codec’ specified in initializer
  1140. chan_skype.c:300: warning: excess elements in struct initializer
  1141. chan_skype.c:300: warning: (near initialization for ‘chan_rtp’)
  1142. chan_skype.c:304: error: expected ‘=’, ‘,’, ‘;’, ‘asm’ or ‘__attribute__’ before ‘{’ token
  1143. chan_skype.c:310: error: expected ‘=’, ‘,’, ‘;’, ‘asm’ or ‘__attribute__’ before ‘{’ token
  1144. chan_skype.c:317: error: expected ‘=’, ‘,’, ‘;’, ‘asm’ or ‘__attribute__’ before ‘{’ token
  1145. chan_skype.c:330: error: expected ‘=’, ‘,’, ‘;’, ‘asm’ or ‘__attribute__’ before ‘{’ token
  1146. chan_skype.c:337: error: expected ‘=’, ‘,’, ‘;’, ‘asm’ or ‘__attribute__’ before ‘{’ token
  1147. chan_skype.c:347: error: expected ‘=’, ‘,’, ‘;’, ‘asm’ or ‘__attribute__’ before ‘{’ token
  1148. chan_skype.c:353: error: expected ‘=’, ‘,’, ‘;’, ‘asm’ or ‘__attribute__’ before ‘{’ token
  1149. chan_skype.c:357: error: expected declaration specifiers or ‘...’ before ‘size_t’
  1150. chan_skype.c:358: error: expected ‘=’, ‘,’, ‘;’, ‘asm’ or ‘__attribute__’ before ‘{’ token
  1151. chan_skype.c:411: error: expected ‘=’, ‘,’, ‘;’, ‘asm’ or ‘__attribute__’ before ‘{’ token
  1152. chan_skype.c:417: error: expected ‘=’, ‘,’, ‘;’, ‘asm’ or ‘__attribute__’ before ‘{’ token
  1153. chan_skype.c:426: error: expected ‘=’, ‘,’, ‘;’, ‘asm’ or ‘__attribute__’ before ‘{’ token
  1154. chan_skype.c:435: error: expected ‘=’, ‘,’, ‘;’, ‘asm’ or ‘__attribute__’ before ‘{’ token
  1155. chan_skype.c:443: error: expected declaration specifiers or ‘...’ before ‘size_t’
  1156. chan_skype.c:444: error: expected ‘=’, ‘,’, ‘;’, ‘asm’ or ‘__attribute__’ before ‘{’ token
  1157. chan_skype.c:473: error: expected ‘=’, ‘,’, ‘;’, ‘asm’ or ‘__attribute__’ before ‘{’ token
  1158. chan_skype.c:478: error: expected ‘=’, ‘,’, ‘;’, ‘asm’ or ‘__attribute__’ before ‘{’ token
  1159. chan_skype.c:485: error: expected ‘=’, ‘,’, ‘;’, ‘asm’ or ‘__attribute__’ before ‘{’ token
  1160. chan_skype.c:504: error: expected ‘=’, ‘,’, ‘;’, ‘asm’ or ‘__attribute__’ before ‘{’ token
  1161. chan_skype.c:515: error: expected ‘=’, ‘,’, ‘;’, ‘asm’ or ‘__attribute__’ before ‘{’ token
  1162. chan_skype.c:554: error: expected ‘=’, ‘,’, ‘;’, ‘asm’ or ‘__attribute__’ before ‘{’ token
  1163. chan_skype.c:568: error: expected ‘=’, ‘,’, ‘;’, ‘asm’ or ‘__attribute__’ before ‘{’ token
  1164. chan_skype.c:577: error: expected ‘=’, ‘,’, ‘;’, ‘asm’ or ‘__attribute__’ before ‘{’ token
  1165. chan_skype.c:596: error: expected ‘=’, ‘,’, ‘;’, ‘asm’ or ‘__attribute__’ before ‘{’ token
  1166. chan_skype.c:607: warning: ‘enum ast_channel_state’ declared inside parameter list
  1167. chan_skype.c:608: error: expected ‘=’, ‘,’, ‘;’, ‘asm’ or ‘__attribute__’ before ‘{’ token
  1168. chan_skype.c:642: error: expected ‘=’, ‘,’, ‘;’, ‘asm’ or ‘__attribute__’ before ‘{’ token
  1169. chan_skype.c:689: error: expected ‘=’, ‘,’, ‘;’, ‘asm’ or ‘__attribute__’ before ‘{’ token
  1170. chan_skype.c:732: error: expected ‘=’, ‘,’, ‘;’, ‘asm’ or ‘__attribute__’ before ‘{’ token
  1171. chan_skype.c:801: error: expected ‘=’, ‘,’, ‘;’, ‘asm’ or ‘__attribute__’ before ‘{’ token
  1172. chan_skype.c:850: error: expected ‘=’, ‘,’, ‘;’, ‘asm’ or ‘__attribute__’ before ‘{’ token
  1173. chan_skype.c:859: error: expected ‘=’, ‘,’, ‘;’, ‘asm’ or ‘__attribute__’ before ‘{’ token
  1174. chan_skype.c:866: error: expected ‘=’, ‘,’, ‘;’, ‘asm’ or ‘__attribute__’ before ‘{’ token
  1175. chan_skype.c:939: error: expected ‘=’, ‘,’, ‘;’, ‘asm’ or ‘__attribute__’ before ‘{’ token
  1176. chan_skype.c:946: error: expected ‘=’, ‘,’, ‘;’, ‘asm’ or ‘__attribute__’ before ‘{’ token
  1177. chan_skype.c:963: error: expected ‘=’, ‘,’, ‘;’, ‘asm’ or ‘__attribute__’ before ‘{’ token
  1178. chan_skype.c:996: error: expected ‘=’, ‘,’, ‘;’, ‘asm’ or ‘__attribute__’ before ‘{’ token
  1179. chan_skype.c:1022: error: expected ‘=’, ‘,’, ‘;’, ‘asm’ or ‘__attribute__’ before ‘{’ token
  1180. chan_skype.c:1071: error: expected ‘=’, ‘,’, ‘;’, ‘asm’ or ‘__attribute__’ before ‘{’ token
  1181. chan_skype.c:1088: warning: ‘struct ast_variable’ declared inside parameter list
  1182. chan_skype.c:1089: error: expected ‘=’, ‘,’, ‘;’, ‘asm’ or ‘__attribute__’ before ‘{’ token
  1183. chan_skype.c:1303: error: expected ‘=’, ‘,’, ‘;’, ‘asm’ or ‘__attribute__’ before ‘{’ token
  1184. chan_skype.c:1326: warning: ‘struct ast_cli_args’ declared inside parameter list
  1185. chan_skype.c:1326: warning: ‘struct ast_cli_entry’ declared inside parameter list
  1186. chan_skype.c:1327: error: expected ‘=’, ‘,’, ‘;’, ‘asm’ or ‘__attribute__’ before ‘{’ token
  1187. chan_skype.c:1363: warning: ‘struct ast_cli_args’ declared inside parameter list
  1188. chan_skype.c:1363: warning: ‘struct ast_cli_entry’ declared inside parameter list
  1189. chan_skype.c:1364: error: expected ‘=’, ‘,’, ‘;’, ‘asm’ or ‘__attribute__’ before ‘{’ token
  1190. chan_skype.c:1387: warning: ‘struct ast_cli_args’ declared inside parameter list
  1191. chan_skype.c:1387: warning: ‘struct ast_cli_entry’ declared inside parameter list
  1192. chan_skype.c:1388: error: expected ‘=’, ‘,’, ‘;’, ‘asm’ or ‘__attribute__’ before ‘{’ token
  1193. chan_skype.c:1426: error: expected ‘=’, ‘,’, ‘;’, ‘asm’ or ‘__attribute__’ before ‘{’ token
  1194. chan_skype.c:1451: warning: ‘struct ast_cli_args’ declared inside parameter list
  1195. chan_skype.c:1451: warning: ‘struct ast_cli_entry’ declared inside parameter list
  1196. chan_skype.c:1452: error: expected ‘=’, ‘,’, ‘;’, ‘asm’ or ‘__attribute__’ before ‘{’ token
  1197. chan_skype.c:1517: error: expected ‘=’, ‘,’, ‘;’, ‘asm’ or ‘__attribute__’ before ‘{’ token
  1198. chan_skype.c:1525: warning: ‘struct ast_cli_args’ declared inside parameter list
  1199. chan_skype.c:1525: warning: ‘struct ast_cli_entry’ declared inside parameter list
  1200. chan_skype.c:1526: error: expected ‘=’, ‘,’, ‘;’, ‘asm’ or ‘__attribute__’ before ‘{’ token
  1201. chan_skype.c:1619: error: expected ‘=’, ‘,’, ‘;’, ‘asm’ or ‘__attribute__’ before ‘{’ token
  1202. chan_skype.c:1632: warning: ‘struct ast_cli_args’ declared inside parameter list
  1203. chan_skype.c:1632: warning: ‘struct ast_cli_entry’ declared inside parameter list
  1204. chan_skype.c:1633: error: expected ‘=’, ‘,’, ‘;’, ‘asm’ or ‘__attribute__’ before ‘{’ token
  1205. chan_skype.c:1666: warning: ‘struct ast_cli_args’ declared inside parameter list
  1206. chan_skype.c:1666: warning: ‘struct ast_cli_entry’ declared inside parameter list
  1207. chan_skype.c:1667: error: expected ‘=’, ‘,’, ‘;’, ‘asm’ or ‘__attribute__’ before ‘{’ token
  1208. chan_skype.c:1688: warning: ‘struct ast_cli_args’ declared inside parameter list
  1209. chan_skype.c:1688: warning: ‘struct ast_cli_entry’ declared inside parameter list
  1210. chan_skype.c:1689: error: expected ‘=’, ‘,’, ‘;’, ‘asm’ or ‘__attribute__’ before ‘{’ token
  1211. chan_skype.c:1730: warning: ‘struct ast_cli_args’ declared inside parameter list
  1212. chan_skype.c:1730: warning: ‘struct ast_cli_entry’ declared inside parameter list
  1213. chan_skype.c:1731: error: expected ‘=’, ‘,’, ‘;’, ‘asm’ or ‘__attribute__’ before ‘{’ token
  1214. chan_skype.c:1769: warning: ‘struct ast_cli_args’ declared inside parameter list
  1215. chan_skype.c:1769: warning: ‘struct ast_cli_entry’ declared inside parameter list
  1216. chan_skype.c:1770: error: expected ‘=’, ‘,’, ‘;’, ‘asm’ or ‘__attribute__’ before ‘{’ token
  1217. chan_skype.c:1808: error: storage class specified for parameter ‘cli’
  1218. chan_skype.c:1808: error: array type has incomplete element type
  1219. chan_skype.c:1808: error: parameter ‘cli’ is initialized
  1220. chan_skype.c:1809: error: ‘show_settings_cli’ undeclared (first use in this function)
  1221. chan_skype.c:1810: error: ‘show_version_cli’ undeclared (first use in this function)
  1222. chan_skype.c:1811: error: ‘show_users_cli’ undeclared (first use in this function)
  1223. chan_skype.c:1812: error: ‘show_user_cli’ undeclared (first use in this function)
  1224. chan_skype.c:1813: error: ‘show_hostid_cli’ undeclared (first use in this function)
  1225. chan_skype.c:1814: error: ‘show_licenses_cli’ undeclared (first use in this function)
  1226. chan_skype.c:1815: error: ‘set_debug_cli’ undeclared (first use in this function)
  1227. chan_skype.c:1816: error: ‘show_buddies_cli’ undeclared (first use in this function)
  1228. chan_skype.c:1817: error: ‘logout_user_cli’ undeclared (first use in this function)
  1229. chan_skype.c:1818: error: ‘login_user_cli’ undeclared (first use in this function)
  1230. chan_skype.c:1821: warning: ‘struct message’ declared inside parameter list
  1231. chan_skype.c:1822: error: expected ‘=’, ‘,’, ‘;’, ‘asm’ or ‘__attribute__’ before ‘{’ token
  1232. chan_skype.c:1843: error: expected specifier-qualifier-list before ‘size_t’
  1233. chan_skype.c:1844: warning: empty declaration
  1234. chan_skype.c:1847: error: expected ‘=’, ‘,’, ‘;’, ‘asm’ or ‘__attribute__’ before ‘{’ token
  1235. chan_skype.c:1870: warning: ‘struct message’ declared inside parameter list
  1236. chan_skype.c:1871: error: expected ‘=’, ‘,’, ‘;’, ‘asm’ or ‘__attribute__’ before ‘{’ token
  1237. chan_skype.c:1906: warning: ‘struct message’ declared inside parameter list
  1238. chan_skype.c:1907: error: expected ‘=’, ‘,’, ‘;’, ‘asm’ or ‘__attribute__’ before ‘{’ token
  1239. chan_skype.c:1935: warning: ‘struct message’ declared inside parameter list
  1240. chan_skype.c:1936: error: expected ‘=’, ‘,’, ‘;’, ‘asm’ or ‘__attribute__’ before ‘{’ token
  1241. chan_skype.c:1964: error: expected ‘=’, ‘,’, ‘;’, ‘asm’ or ‘__attribute__’ before ‘{’ token
  1242. chan_skype.c:1978: warning: ‘struct message’ declared inside parameter list
  1243. chan_skype.c:1979: error: expected ‘=’, ‘,’, ‘;’, ‘asm’ or ‘__attribute__’ before ‘{’ token
  1244. chan_skype.c:2008: warning: ‘struct message’ declared inside parameter list
  1245. chan_skype.c:2009: error: expected ‘=’, ‘,’, ‘;’, ‘asm’ or ‘__attribute__’ before ‘{’ token
  1246. chan_skype.c:2041: warning: ‘struct message’ declared inside parameter list
  1247. chan_skype.c:2042: error: expected ‘=’, ‘,’, ‘;’, ‘asm’ or ‘__attribute__’ before ‘{’ token
  1248. chan_skype.c:2059: warning: ‘struct message’ declared inside parameter list
  1249. chan_skype.c:2060: error: expected ‘=’, ‘,’, ‘;’, ‘asm’ or ‘__attribute__’ before ‘{’ token
  1250. chan_skype.c:2101: error: expected ‘=’, ‘,’, ‘;’, ‘asm’ or ‘__attribute__’ before ‘{’ token
  1251. chan_skype.c:2152: error: expected ‘=’, ‘,’, ‘;’, ‘asm’ or ‘__attribute__’ before ‘{’ token
  1252. chan_skype.c:2156: error: storage class specified for parameter ‘skype_callprop_function’
  1253. chan_skype.c:2156: error: parameter ‘skype_callprop_function’ is initialized
  1254. chan_skype.c:2157: error: unknown field ‘name’ specified in initializer
  1255. chan_skype.c:2157: warning: excess elements in struct initializer
  1256. chan_skype.c:2157: warning: (near initialization for ‘skype_callprop_function’)
  1257. chan_skype.c:2158: error: unknown field ‘synopsis’ specified in initializer
  1258. chan_skype.c:2158: warning: excess elements in struct initializer
  1259. chan_skype.c:2158: warning: (near initialization for ‘skype_callprop_function’)
  1260. chan_skype.c:2159: error: unknown field ‘syntax’ specified in initializer
  1261. chan_skype.c:2159: warning: excess elements in struct initializer
  1262. chan_skype.c:2159: warning: (near initialization for ‘skype_callprop_function’)
  1263. chan_skype.c:2160: error: unknown field ‘desc’ specified in initializer
  1264. chan_skype.c:2180: warning: excess elements in struct initializer
  1265. chan_skype.c:2180: warning: (near initialization for ‘skype_callprop_function’)
  1266. chan_skype.c:2181: error: unknown field ‘read’ specified in initializer
  1267. chan_skype.c:2181: warning: excess elements in struct initializer
  1268. chan_skype.c:2181: warning: (near initialization for ‘skype_callprop_function’)
  1269. chan_skype.c:2182: error: unknown field ‘write’ specified in initializer
  1270. chan_skype.c:2182: error: ‘acf_skype_callprop_write’ undeclared (first use in this function)
  1271. chan_skype.c:2182: warning: excess elements in struct initializer
  1272. chan_skype.c:2182: warning: (near initialization for ‘skype_callprop_function’)
  1273. chan_skype.c:2185: error: expected declaration specifiers or ‘...’ before ‘size_t’
  1274. chan_skype.c:2186: error: expected ‘=’, ‘,’, ‘;’, ‘asm’ or ‘__attribute__’ before ‘{’ token
  1275. chan_skype.c:2219: error: expected ‘=’, ‘,’, ‘;’, ‘asm’ or ‘__attribute__’ before ‘{’ token
  1276. chan_skype.c:2249: error: storage class specified for parameter ‘skype_accountprop_function’
  1277. chan_skype.c:2249: error: parameter ‘skype_accountprop_function’ is initialized
  1278. chan_skype.c:2250: error: unknown field ‘name’ specified in initializer
  1279. chan_skype.c:2250: warning: excess elements in struct initializer
  1280. chan_skype.c:2250: warning: (near initialization for ‘skype_accountprop_function’)
  1281. chan_skype.c:2251: error: unknown field ‘synopsis’ specified in initializer
  1282. chan_skype.c:2251: warning: excess elements in struct initializer
  1283. chan_skype.c:2251: warning: (near initialization for ‘skype_accountprop_function’)
  1284. chan_skype.c:2252: error: unknown field ‘syntax’ specified in initializer
  1285. chan_skype.c:2252: warning: excess elements in struct initializer
  1286. chan_skype.c:2252: warning: (near initialization for ‘skype_accountprop_function’)
  1287. chan_skype.c:2253: error: unknown field ‘desc’ specified in initializer
  1288. chan_skype.c:2269: warning: excess elements in struct initializer
  1289. chan_skype.c:2269: warning: (near initialization for ‘skype_accountprop_function’)
  1290. chan_skype.c:2270: error: unknown field ‘read’ specified in initializer
  1291. chan_skype.c:2270: error: ‘acf_skype_accountprop_read’ undeclared (first use in this function)
  1292. chan_skype.c:2270: warning: excess elements in struct initializer
  1293. chan_skype.c:2270: warning: (near initialization for ‘skype_accountprop_function’)
  1294. chan_skype.c:2271: error: unknown field ‘write’ specified in initializer
  1295. chan_skype.c:2271: error: ‘acf_skype_accountprop_write’ undeclared (first use in this function)
  1296. chan_skype.c:2271: warning: excess elements in struct initializer
  1297. chan_skype.c:2271: warning: (near initialization for ‘skype_accountprop_function’)
  1298. chan_skype.c:2275: error: expected ‘=’, ‘,’, ‘;’, ‘asm’ or ‘__attribute__’ before ‘{’ token
  1299. chan_skype.c:2283: error: expected declaration specifiers or ‘...’ before ‘size_t’
  1300. chan_skype.c:2284: error: expected ‘=’, ‘,’, ‘;’, ‘asm’ or ‘__attribute__’ before ‘{’ token
  1301. chan_skype.c:2304: error: storage class specified for parameter ‘skype_buddies_function’
  1302. chan_skype.c:2304: error: parameter ‘skype_buddies_function’ is initialized
  1303. chan_skype.c:2305: error: unknown field ‘name’ specified in initializer
  1304. chan_skype.c:2305: warning: excess elements in struct initializer
  1305. chan_skype.c:2305: warning: (near initialization for ‘skype_buddies_function’)
  1306. chan_skype.c:2306: error: unknown field ‘synopsis’ specified in initializer
  1307. chan_skype.c:2306: warning: excess elements in struct initializer
  1308. chan_skype.c:2306: warning: (near initialization for ‘skype_buddies_function’)
  1309. chan_skype.c:2307: error: unknown field ‘syntax’ specified in initializer
  1310. chan_skype.c:2307: warning: excess elements in struct initializer
  1311. chan_skype.c:2307: warning: (near initialization for ‘skype_buddies_function’)
  1312. chan_skype.c:2308: error: unknown field ‘desc’ specified in initializer
  1313. chan_skype.c:2309: warning: excess elements in struct initializer
  1314. chan_skype.c:2309: warning: (near initialization for ‘skype_buddies_function’)
  1315. chan_skype.c:2310: error: unknown field ‘read’ specified in initializer
  1316. chan_skype.c:2310: error: ‘acf_skype_buddies’ undeclared (first use in this function)
  1317. chan_skype.c:2310: warning: excess elements in struct initializer
  1318. chan_skype.c:2310: warning: (near initialization for ‘skype_buddies_function’)
  1319. chan_skype.c:2313: error: expected declaration specifiers or ‘...’ before ‘size_t’
  1320. chan_skype.c:2314: error: expected ‘=’, ‘,’, ‘;’, ‘asm’ or ‘__attribute__’ before ‘{’ token
  1321. chan_skype.c:2341: error: storage class specified for parameter ‘skype_buddy_fetch_function’
  1322. chan_skype.c:2341: error: parameter ‘skype_buddy_fetch_function’ is initialized
  1323. chan_skype.c:2342: error: unknown field ‘name’ specified in initializer
  1324. chan_skype.c:2342: warning: excess elements in struct initializer
  1325. chan_skype.c:2342: warning: (near initialization for ‘skype_buddy_fetch_function’)
  1326. chan_skype.c:2343: error: unknown field ‘synopsis’ specified in initializer
  1327. chan_skype.c:2343: warning: excess elements in struct initializer
  1328. chan_skype.c:2343: warning: (near initialization for ‘skype_buddy_fetch_function’)
  1329. chan_skype.c:2344: error: unknown field ‘syntax’ specified in initializer
  1330. chan_skype.c:2344: warning: excess elements in struct initializer
  1331. chan_skype.c:2344: warning: (near initialization for ‘skype_buddy_fetch_function’)
  1332. chan_skype.c:2345: error: unknown field ‘desc’ specified in initializer
  1333. chan_skype.c:2351: warning: excess elements in struct initializer
  1334. chan_skype.c:2351: warning: (near initialization for ‘skype_buddy_fetch_function’)
  1335. chan_skype.c:2352: error: unknown field ‘read’ specified in initializer
  1336. chan_skype.c:2352: error: ‘acf_skype_fetch_buddy’ undeclared (first use in this function)
  1337. chan_skype.c:2352: warning: excess elements in struct initializer
  1338. chan_skype.c:2352: warning: (near initialization for ‘skype_buddy_fetch_function’)
  1339. chan_skype.c:2356: error: expected ‘=’, ‘,’, ‘;’, ‘asm’ or ‘__attribute__’ before ‘{’ token
  1340. chan_skype.c:2381: error: expected ‘=’, ‘,’, ‘;’, ‘asm’ or ‘__attribute__’ before ‘{’ token
  1341. chan_skype.c:2419: error: expected ‘=’, ‘,’, ‘;’, ‘asm’ or ‘__attribute__’ before ‘{’ token
  1342. chan_skype.c:2434: error: expected ‘=’, ‘,’, ‘;’, ‘asm’ or ‘__attribute__’ before ‘{’ token
  1343. chan_skype.c:2623: error: expected ‘=’, ‘,’, ‘;’, ‘asm’ or ‘__attribute__’ before ‘{’ token
  1344. chan_skype.c:2648: error: expected ‘=’, ‘,’, ‘;’, ‘asm’ or ‘__attribute__’ before ‘{’ token
  1345. chan_skype.c:2657: error: expected ‘=’, ‘,’, ‘;’, ‘asm’ or ‘__attribute__’ before ‘{’ token
  1346. chan_skype.c:2662: error: expected ‘=’, ‘,’, ‘;’, ‘asm’ or ‘__attribute__’ before ‘{’ token
  1347. chan_skype.c:2668: error: expected ‘=’, ‘,’, ‘;’, ‘asm’ or ‘__attribute__’ before ‘{’ token
  1348. chan_skype.c:2682: error: expected ‘=’, ‘,’, ‘;’, ‘asm’ or ‘__attribute__’ before ‘{’ token
  1349. chan_skype.c:2688: error: expected ‘=’, ‘,’, ‘;’, ‘asm’ or ‘__attribute__’ before ‘{’ token
  1350. chan_skype.c:2695: error: expected ‘=’, ‘,’, ‘;’, ‘asm’ or ‘__attribute__’ before ‘{’ token
  1351. chan_skype.c:2739: error: expected ‘=’, ‘,’, ‘;’, ‘asm’ or ‘__attribute__’ before ‘{’ token
  1352. chan_skype.c:2746: error: expected declaration specifiers or ‘...’ before ‘uint8_t’
  1353. chan_skype.c:2747: error: expected ‘=’, ‘,’, ‘;’, ‘asm’ or ‘__attribute__’ before ‘{’ token
  1354. chan_skype.c:2756: error: expected ‘=’, ‘,’, ‘;’, ‘asm’ or ‘__attribute__’ before ‘{’ token
  1355. chan_skype.c:2768: error: expected ‘=’, ‘,’, ‘;’, ‘asm’ or ‘__attribute__’ before ‘{’ token
  1356. chan_skype.c:2827: error: expected ‘=’, ‘,’, ‘;’, ‘asm’ or ‘__attribute__’ before ‘{’ token
  1357. chan_skype.c:2848: error: expected ‘=’, ‘,’, ‘;’, ‘asm’ or ‘__attribute__’ before ‘{’ token
  1358. chan_skype.c:2872: error: expected ‘=’, ‘,’, ‘;’, ‘asm’ or ‘__attribute__’ before ‘{’ token
  1359. chan_skype.c:2883: error: expected ‘=’, ‘,’, ‘;’, ‘asm’ or ‘__attribute__’ before ‘{’ token
  1360. chan_skype.c:2957: error: storage class specified for parameter ‘manshowbuddies_usage’
  1361. chan_skype.c:2957: error: parameter ‘manshowbuddies_usage’ is initialized
  1362. chan_skype.c:2962: error: storage class specified for parameter ‘manshowbuddy_usage’
  1363. chan_skype.c:2962: error: parameter ‘manshowbuddy_usage’ is initialized
  1364. chan_skype.c:2969: error: storage class specified for parameter ‘manaccountprop_usage’
  1365. chan_skype.c:2969: error: parameter ‘manaccountprop_usage’ is initialized
  1366. chan_skype.c:2976: error: storage class specified for parameter ‘manaddbuddy_usage’
  1367. chan_skype.c:2976: error: parameter ‘manaddbuddy_usage’ is initialized
  1368. chan_skype.c:2983: error: storage class specified for parameter ‘manremovebuddy_usage’
  1369. chan_skype.c:2983: error: parameter ‘manremovebuddy_usage’ is initialized
  1370. chan_skype.c:2990: error: storage class specified for parameter ‘manlicenselist_usage’
  1371. chan_skype.c:2990: error: parameter ‘manlicenselist_usage’ is initialized
  1372. chan_skype.c:2995: error: storage class specified for parameter ‘manlicensestatus_usage’
  1373. chan_skype.c:2995: error: parameter ‘manlicensestatus_usage’ is initialized
  1374. chan_skype.c:3001: error: expected ‘=’, ‘,’, ‘;’, ‘asm’ or ‘__attribute__’ before ‘{’ token
  1375. chan_skype.c:3118: error: storage class specified for parameter ‘monitor_array_used’
  1376. chan_skype.c:3118: error: parameter ‘monitor_array_used’ is initialized
  1377. chan_skype.c:3119: error: storage class specified for parameter ‘monitor_pfds’
  1378. chan_skype.c:3119: error: parameter ‘monitor_pfds’ is initialized
  1379. chan_skype.c:3120: error: storage class specified for parameter ‘monitor_users’
  1380. chan_skype.c:3120: error: parameter ‘monitor_users’ is initialized
  1381. chan_skype.c:3123: error: expected ‘=’, ‘,’, ‘;’, ‘asm’ or ‘__attribute__’ before ‘{’ token
  1382. chan_skype.c:3139: error: expected ‘=’, ‘,’, ‘;’, ‘asm’ or ‘__attribute__’ before ‘{’ token
  1383. chan_skype.c:3299: error: expected ‘=’, ‘,’, ‘;’, ‘asm’ or ‘__attribute__’ before ‘{’ token
  1384. chan_skype.c:3311: error: expected ‘=’, ‘,’, ‘;’, ‘asm’ or ‘__attribute__’ before ‘{’ token
  1385. chan_skype.c:3337: error: expected declaration specifiers before ‘AST_MODULE_INFO’
  1386. chan_skype.c:3120: error: declaration for parameter ‘monitor_users’ but no such parameter
  1387. chan_skype.c:3119: error: declaration for parameter ‘monitor_pfds’ but no such parameter
  1388. chan_skype.c:3118: error: declaration for parameter ‘monitor_array_used’ but no such parameter
  1389. chan_skype.c:2995: error: declaration for parameter ‘manlicensestatus_usage’ but no such parameter
  1390. chan_skype.c:2990: error: declaration for parameter ‘manlicenselist_usage’ but no such parameter
  1391. chan_skype.c:2983: error: declaration for parameter ‘manremovebuddy_usage’ but no such parameter
  1392. chan_skype.c:2976: error: declaration for parameter ‘manaddbuddy_usage’ but no such parameter
  1393. chan_skype.c:2969: error: declaration for parameter ‘manaccountprop_usage’ but no such parameter
  1394. chan_skype.c:2962: error: declaration for parameter ‘manshowbuddy_usage’ but no such parameter
  1395. chan_skype.c:2957: error: declaration for parameter ‘manshowbuddies_usage’ but no such parameter
  1396. chan_skype.c:2341: error: parameter ‘skype_buddy_fetch_function’ has incomplete type
  1397. chan_skype.c:2341: error: declaration for parameter ‘skype_buddy_fetch_function’ but no such parameter
  1398. chan_skype.c:2304: error: parameter ‘skype_buddies_function’ has incomplete type
  1399. chan_skype.c:2304: error: declaration for parameter ‘skype_buddies_function’ but no such parameter
  1400. chan_skype.c:2249: error: parameter ‘skype_accountprop_function’ has incomplete type
  1401. chan_skype.c:2249: error: declaration for parameter ‘skype_accountprop_function’ but no such parameter
  1402. chan_skype.c:2156: error: parameter ‘skype_callprop_function’ has incomplete type
  1403. chan_skype.c:2156: error: declaration for parameter ‘skype_callprop_function’ but no such parameter
  1404. chan_skype.c:1808: error: declaration for parameter ‘cli’ but no such parameter
  1405. chan_skype.c:296: error: parameter ‘chan_rtp’ has incomplete type
  1406. chan_skype.c:296: error: declaration for parameter ‘chan_rtp’ but no such parameter
  1407. chan_skype.c:277: error: parameter ‘chan_tech’ has incomplete type
  1408. chan_skype.c:277: error: declaration for parameter ‘chan_tech’ but no such parameter
  1409. chan_skype.c:275: error: declaration for parameter ‘rtp_get_codec’ but no such parameter
  1410. chan_skype.c:274: error: declaration for parameter ‘rtp_set_peer’ but no such parameter
  1411. chan_skype.c:273: error: declaration for parameter ‘rtp_get_info’ but no such parameter
  1412. chan_skype.c:271: error: declaration for parameter ‘do_monitor’ but no such parameter
  1413. chan_skype.c:270: error: declaration for parameter ‘unlink_client_call’ but no such parameter
  1414. chan_skype.c:269: error: declaration for parameter ‘destroy_client_user’ but no such parameter
  1415. chan_skype.c:268: error: declaration for parameter ‘destroy_client_call’ but no such parameter
  1416. chan_skype.c:266: error: declaration for parameter ‘transfer’ but no such parameter
  1417. chan_skype.c:265: error: declaration for parameter ‘channel_read’ but no such parameter
  1418. chan_skype.c:264: error: declaration for parameter ‘fixup’ but no such parameter
  1419. chan_skype.c:263: error: declaration for parameter ‘indicate’ but no such parameter
  1420. chan_skype.c:262: error: declaration for parameter ‘frame_write’ but no such parameter
  1421. chan_skype.c:261: error: declaration for parameter ‘frame_read’ but no such parameter
  1422. chan_skype.c:260: error: declaration for parameter ‘answer’ but no such parameter
  1423. chan_skype.c:259: error: declaration for parameter ‘hangup’ but no such parameter
  1424. chan_skype.c:258: error: declaration for parameter ‘call’ but no such parameter
  1425. chan_skype.c:257: error: declaration for parameter ‘digit_end’ but no such parameter
  1426. chan_skype.c:256: error: declaration for parameter ‘digit_begin’ but no such parameter
  1427. chan_skype.c:255: error: declaration for parameter ‘request’ but no such parameter
  1428. chan_skype.c:254: error: declaration for parameter ‘new_ast_channel’ but no such parameter
  1429. chan_skype.c:252: error: declaration for parameter ‘dynamic_codec_change’ but no such parameter
  1430. chan_skype.c:250: error: declaration for parameter ‘monitor_alert’ but no such parameter
  1431. chan_skype.c:249: error: declaration for parameter ‘monitor_reload’ but no such parameter
  1432. chan_skype.c:248: error: declaration for parameter ‘monitor_shutdown’ but no such parameter
  1433. chan_skype.c:241: error: declaration for parameter ‘default_capability’ but no such parameter
  1434. chan_skype.c:240: error: parameter ‘default_prefs’ has incomplete type
  1435. chan_skype.c:240: error: declaration for parameter ‘default_prefs’ but no such parameter
  1436. chan_skype.c:207: error: parameter ‘skype_call_datastore’ has incomplete type
  1437. chan_skype.c:207: error: declaration for parameter ‘skype_call_datastore’ but no such parameter
  1438. chan_skype.c:205: error: declaration for parameter ‘call_datastore_duplicate’ but no such parameter
  1439. chan_skype.c:204: error: declaration for parameter ‘call_datastore_free’ but no such parameter
  1440. chan_skype.c:202: error: declaration for parameter ‘broken’ but no such parameter
  1441. chan_skype.c:201: error: declaration for parameter ‘global_config’ but no such parameter
  1442. chan_skype.c:194: error: declaration for parameter ‘global_defaults’ but no such parameter
  1443. chan_skype.c:76: error: declaration for parameter ‘users’ but no such parameter
  1444. skypeforasterisk.h:411: error: declaration for parameter ‘sfa_on_reload’ but no such parameter
  1445. skypeforasterisk.h:406: error: declaration for parameter ‘sfa_get_maxcalls’ but no such parameter
  1446. skypeforasterisk.h:401: error: declaration for parameter ‘sfa_get_hostid’ but no such parameter
  1447. skypeforasterisk.h:396: error: declaration for parameter ‘sfa_license_status’ but no such parameter
  1448. skypeforasterisk.h:390: error: declaration for parameter ‘sfa_license_channels’ but no such parameter
  1449. skypeforasterisk.h:384: error: declaration for parameter ‘sfa_license_expires’ but no such parameter
  1450. skypeforasterisk.h:378: error: declaration for parameter ‘sfa_license_hostid’ but no such parameter
  1451. skypeforasterisk.h:372: error: declaration for parameter ‘sfa_license_key’ but no such parameter
  1452. skypeforasterisk.h:366: error: declaration for parameter ‘sfa_license_filename’ but no such parameter
  1453. skypeforasterisk.h:360: error: declaration for parameter ‘sfa_license_iterator_next’ but no such parameter
  1454. skypeforasterisk.h:354: error: declaration for parameter ‘sfa_license_iterator_destroy’ but no such parameter
  1455. skypeforasterisk.h:348: error: declaration for parameter ‘sfa_license_iterator_new’ but no such parameter
  1456. skypeforasterisk.h:338: error: declaration for parameter ‘sfa_get_online_count’ but no such parameter
  1457. skypeforasterisk.h:337: error: declaration for parameter ‘sfa_set_global_debug’ but no such parameter
  1458. skypeforasterisk.h:335: error: declaration for parameter ‘sfa_get_version’ but no such parameter
  1459. skypeforasterisk.h:334: error: declaration for parameter ‘sfa_shutdown’ but no such parameter
  1460. skypeforasterisk.h:333: error: declaration for parameter ‘sfa_startup’ but no such parameter
  1461. skypeforasterisk.h:327: error: declaration for parameter ‘sfa_set_socks_proxy’ but no such parameter
  1462. skypeforasterisk.h:326: error: declaration for parameter ‘sfa_set_https_proxy’ but no such parameter
  1463. skypeforasterisk.h:325: error: declaration for parameter ‘sfa_set_disable_udp’ but no such parameter
  1464. skypeforasterisk.h:324: error: declaration for parameter ‘sfa_set_disable_tcpauto’ but no such parameter
  1465. skypeforasterisk.h:323: error: declaration for parameter ‘sfa_set_rtp_address’ but no such parameter
  1466. skypeforasterisk.h:322: error: declaration for parameter ‘sfa_set_local_address’ but no such parameter
  1467. skypeforasterisk.h:321: error: declaration for parameter ‘sfa_set_license_directory’ but no such parameter
  1468. skypeforasterisk.h:320: error: declaration for parameter ‘sfa_set_data_directory’ but no such parameter
  1469. skypeforasterisk.h:319: error: declaration for parameter ‘sfa_set_engine_directory’ but no such parameter
  1470. skypeforasterisk.h:318: error: declaration for parameter ‘sfa_set_callbacks’ but no such parameter
  1471. skypeforasterisk.h:282: error: declaration for parameter ‘sfa_user_set_vedebug’ but no such parameter
  1472. skypeforasterisk.h:281: error: declaration for parameter ‘sfa_user_set_debug’ but no such parameter
  1473. skypeforasterisk.h:279: error: declaration for parameter ‘sfa_user_account_status’ but no such parameter
  1474. skypeforasterisk.h:278: error: declaration for parameter ‘sfa_user_loggedout’ but no such parameter
  1475. skypeforasterisk.h:277: error: declaration for parameter ‘sfa_user_loggedin’ but no such parameter
  1476. skypeforasterisk.h:275: error: declaration for parameter ‘sfa_user_get_active_port’ but no such parameter
  1477. skypeforasterisk.h:274: error: declaration for parameter ‘sfa_user_stopped’ but no such parameter
  1478. skypeforasterisk.h:273: error: declaration for parameter ‘sfa_user_connected’ but no such parameter
  1479. skypeforasterisk.h:272: error: declaration for parameter ‘sfa_account_status2str’ but no such parameter
  1480. skypeforasterisk.h:270: error: declaration for parameter ‘sfa_buddy_property_iterate’ but no such parameter
  1481. skypeforasterisk.h:269: error: declaration for parameter ‘sfa_buddylist_iterate’ but no such parameter
  1482. skypeforasterisk.h:248: error: declaration for parameter ‘sfa_remove_contact’ but no such parameter
  1483. skypeforasterisk.h:247: error: declaration for parameter ‘sfa_add_contact’ but no such parameter
  1484. skypeforasterisk.h:245: error: declaration for parameter ‘sfa_user_set_buddy_state_updates’ but no such parameter
  1485. skypeforasterisk.h:237: error: declaration for parameter ‘sfa_user_get_buddy_state’ but no such parameter
  1486. skypeforasterisk.h:236: error: declaration for parameter ‘sfa_str2buddy_state’ but no such parameter
  1487. skypeforasterisk.h:235: error: declaration for parameter ‘sfa_buddy_state2str’ but no such parameter
  1488. skypeforasterisk.h:233: error: declaration for parameter ‘sfa_user_get_balance’ but no such parameter
  1489. skypeforasterisk.h:232: error: declaration for parameter ‘sfa_user_get_socket’ but no such parameter
  1490. skypeforasterisk.h:231: error: declaration for parameter ‘sfa_user_run’ but no such parameter
  1491. skypeforasterisk.h:224: error: declaration for parameter ‘sfa_user_set_codecs’ but no such parameter
  1492. skypeforasterisk.h:222: error: declaration for parameter ‘sfa_user_destroy’ but no such parameter
  1493. skypeforasterisk.h:221: error: declaration for parameter ‘sfa_user_shutdown’ but no such parameter
  1494. skypeforasterisk.h:220: error: declaration for parameter ‘sfa_user_logout’ but no such parameter
  1495. skypeforasterisk.h:219: error: declaration for parameter ‘sfa_user_login’ but no such parameter
  1496. skypeforasterisk.h:218: error: declaration for parameter ‘sfa_user_new’ but no such parameter
  1497. skypeforasterisk.h:215: error: declaration for parameter ‘sfa_call_set_audio_socket_address’ but no such parameter
  1498. skypeforasterisk.h:213: error: declaration for parameter ‘sfa_str2property’ but no such parameter
  1499. skypeforasterisk.h:212: error: declaration for parameter ‘sfa_account_commit_properties’ but no such parameter
  1500. skypeforasterisk.h:211: error: declaration for parameter ‘sfa_account_set_property’ but no such parameter
  1501. skypeforasterisk.h:210: error: declaration for parameter ‘sfa_account_get_property’ but no such parameter
  1502. skypeforasterisk.h:209: error: declaration for parameter ‘sfa_call_set_property’ but no such parameter
  1503. skypeforasterisk.h:208: error: declaration for parameter ‘sfa_call_get_property’ but no such parameter
  1504. skypeforasterisk.h:130: error: declaration for parameter ‘sfa_call_process’ but no such parameter
  1505. skypeforasterisk.h:113: error: declaration for parameter ‘sfa_call_unhold’ but no such parameter
  1506. skypeforasterisk.h:105: error: declaration for parameter ‘sfa_call_hold’ but no such parameter
  1507. skypeforasterisk.h:97: error: declaration for parameter ‘sfa_call_active’ but no such parameter
  1508. skypeforasterisk.h:89: error: declaration for parameter ‘sfa_call_new’ but no such parameter
  1509. skypeforasterisk.h:80: error: declaration for parameter ‘sfa_call_hangup’ but no such parameter
  1510. skypeforasterisk.h:69: error: declaration for parameter ‘sfa_call_ring’ but no such parameter
  1511. skypeforasterisk.h:58: error: declaration for parameter ‘sfa_call_set_client_call’ but no such parameter
  1512. skypeforasterisk.h:46: error: declaration for parameter ‘sfa_call_send_dtmf’ but no such parameter
  1513. skypeforasterisk.h:35: error: declaration for parameter ‘sfa_call_answer’ but no such parameter
  1514. skypeforasterisk.h:27: error: declaration for parameter ‘sfa_call_ringback’ but no such parameter
  1515. /usr/include/netinet/in.h:432: error: declaration for parameter ‘bindresvport6’ but no such parameter
  1516. /usr/include/netinet/in.h:428: error: declaration for parameter ‘bindresvport’ but no such parameter
  1517. /usr/include/netinet/in.h:207: error: declaration for parameter ‘in6addr_loopback’ but no such parameter
  1518. /usr/include/netinet/in.h:206: error: declaration for parameter ‘in6addr_any’ but no such parameter
  1519. /usr/include/sys/socket.h:231: error: declaration for parameter ‘isfdtype’ but no such parameter
  1520. /usr/include/sys/socket.h:223: error: declaration for parameter ‘sockatmark’ but no such parameter
  1521. /usr/include/sys/socket.h:218: error: declaration for parameter ‘shutdown’ but no such parameter
  1522. /usr/include/sys/socket.h:210: error: declaration for parameter ‘accept’ but no such parameter
  1523. /usr/include/sys/socket.h:199: error: declaration for parameter ‘listen’ but no such parameter
  1524. /usr/include/sys/socket.h:193: error: declaration for parameter ‘setsockopt’ but no such parameter
  1525. /usr/include/sys/socket.h:187: error: declaration for parameter ‘getsockopt’ but no such parameter
  1526. /usr/include/sys/socket.h:129: error: declaration for parameter ‘getpeername’ but no such parameter
  1527. /usr/include/sys/socket.h:124: error: declaration for parameter ‘connect’ but no such parameter
  1528. /usr/include/sys/socket.h:115: error: declaration for parameter ‘getsockname’ but no such parameter
  1529. /usr/include/sys/socket.h:111: error: declaration for parameter ‘bind’ but no such parameter
  1530. /usr/include/sys/socket.h:107: error: declaration for parameter ‘socketpair’ but no such parameter
  1531. /usr/include/sys/socket.h:100: error: declaration for parameter ‘socket’ but no such parameter
  1532. /usr/include/bits/socket.h:264: error: declaration for parameter ‘__cmsg_nxthdr’ but no such parameter
  1533. /usr/include/bits/sockaddr.h:29: error: declaration for parameter ‘sa_family_t’ but no such parameter
  1534. /usr/include/stdint.h:129: error: declaration for parameter ‘uintptr_t’ but no such parameter
  1535. /usr/include/stdint.h:111: error: declaration for parameter ‘uint_fast32_t’ but no such parameter
  1536. /usr/include/stdint.h:110: error: declaration for parameter ‘uint_fast16_t’ but no such parameter
  1537. /usr/include/stdint.h:104: error: declaration for parameter ‘uint_fast8_t’ but no such parameter
  1538. /usr/include/stdint.h:98: error: declaration for parameter ‘int_fast32_t’ but no such parameter
  1539. /usr/include/stdint.h:97: error: declaration for parameter ‘int_fast16_t’ but no such parameter
  1540. /usr/include/stdint.h:91: error: declaration for parameter ‘int_fast8_t’ but no such parameter
  1541. /usr/include/stdint.h:79: error: declaration for parameter ‘uint_least32_t’ but no such parameter
  1542. /usr/include/stdint.h:78: error: declaration for parameter ‘uint_least16_t’ but no such parameter
  1543. /usr/include/stdint.h:77: error: declaration for parameter ‘uint_least8_t’ but no such parameter
  1544. /usr/include/stdint.h:68: error: declaration for parameter ‘int_least32_t’ but no such parameter
  1545. /usr/include/stdint.h:67: error: declaration for parameter ‘int_least16_t’ but no such parameter
  1546. /usr/include/stdint.h:66: error: declaration for parameter ‘int_least8_t’ but no such parameter
  1547. /usr/include/stdint.h:52: error: declaration for parameter ‘uint32_t’ but no such parameter
  1548. /usr/include/stdint.h:50: error: declaration for parameter ‘uint16_t’ but no such parameter
  1549. /usr/include/stdint.h:49: error: declaration for parameter ‘uint8_t’ but no such parameter
  1550. /usr/include/dlfcn.h:84: error: declaration for parameter ‘dlerror’ but no such parameter
  1551. /usr/include/dlfcn.h:67: error: declaration for parameter ‘dlsym’ but no such parameter
  1552. /usr/include/dlfcn.h:62: error: declaration for parameter ‘dlclose’ but no such parameter
  1553. /usr/include/dlfcn.h:58: error: declaration for parameter ‘dlopen’ but no such parameter
  1554. /usr/include/sys/stat.h:428: error: declaration for parameter ‘__xmknodat’ but no such parameter
  1555. /usr/include/sys/stat.h:424: error: declaration for parameter ‘__xmknod’ but no such parameter
  1556. /usr/include/sys/stat.h:388: error: declaration for parameter ‘__fxstatat’ but no such parameter
  1557. /usr/include/sys/stat.h:385: error: declaration for parameter ‘__lxstat’ but no such parameter
  1558. /usr/include/sys/stat.h:383: error: declaration for parameter ‘__xstat’ but no such parameter
  1559. /usr/include/sys/stat.h:381: error: declaration for parameter ‘__fxstat’ but no such parameter
  1560. /usr/include/sys/stat.h:346: error: declaration for parameter ‘mkfifo’ but no such parameter
  1561. /usr/include/sys/stat.h:332: error: declaration for parameter ‘mknod’ but no such parameter
  1562. /usr/include/sys/stat.h:317: error: declaration for parameter ‘mkdir’ but no such parameter
  1563. /usr/include/sys/stat.h:293: error: declaration for parameter ‘fchmod’ but no such parameter
  1564. /usr/include/sys/stat.h:288: error: declaration for parameter ‘lchmod’ but no such parameter
  1565. /usr/include/sys/stat.h:281: error: declaration for parameter ‘chmod’ but no such parameter
  1566. /usr/include/sys/stat.h:260: error: declaration for parameter ‘lstat’ but no such parameter
  1567. /usr/include/sys/stat.h:212: error: declaration for parameter ‘fstat’ but no such parameter
  1568. /usr/include/sys/stat.h:208: error: declaration for parameter ‘stat’ but no such parameter
  1569. /usr/include/ctype.h:151: error: declaration for parameter ‘_tolower’ but no such parameter
  1570. /usr/include/ctype.h:150: error: declaration for parameter ‘_toupper’ but no such parameter
  1571. /usr/include/ctype.h:146: error: declaration for parameter ‘toascii’ but no such parameter
  1572. /usr/include/ctype.h:142: error: declaration for parameter ‘isascii’ but no such parameter
  1573. /usr/include/ctype.h:119: error: declaration for parameter ‘toupper’ but no such parameter
  1574. /usr/include/ctype.h:116: error: declaration for parameter ‘tolower’ but no such parameter
  1575. /usr/include/ctype.h:112: error: declaration for parameter ‘isxdigit’ but no such parameter
  1576. /usr/include/ctype.h:111: error: declaration for parameter ‘isupper’ but no such parameter
  1577. /usr/include/ctype.h:110: error: declaration for parameter ‘isspace’ but no such parameter
  1578. /usr/include/ctype.h:109: error: declaration for parameter ‘ispunct’ but no such parameter
  1579. /usr/include/ctype.h:108: error: declaration for parameter ‘isprint’ but no such parameter
  1580. /usr/include/ctype.h:107: error: declaration for parameter ‘isgraph’ but no such parameter
  1581. /usr/include/ctype.h:106: error: declaration for parameter ‘islower’ but no such parameter
  1582. /usr/include/ctype.h:105: error: declaration for parameter ‘isdigit’ but no such parameter
  1583. /usr/include/ctype.h:104: error: declaration for parameter ‘iscntrl’ but no such parameter
  1584. /usr/include/ctype.h:103: error: declaration for parameter ‘isalpha’ but no such parameter
  1585. /usr/include/ctype.h:102: error: declaration for parameter ‘isalnum’ but no such parameter
  1586. /usr/include/ctype.h:82: error: declaration for parameter ‘__ctype_b_loc’ but no such parameter
  1587. /usr/include/signal.h:396: error: declaration for parameter ‘__libc_current_sigrtmax’ but no such parameter
  1588. /usr/include/signal.h:394: error: declaration for parameter ‘__libc_current_sigrtmin’ but no such parameter
  1589. /usr/include/signal.h:363: error: declaration for parameter ‘sigaltstack’ but no such parameter
  1590. /usr/include/signal.h:358: error: declaration for parameter ‘sigstack’ but no such parameter
  1591. /usr/include/bits/sigstack.h:55: error: declaration for parameter ‘stack_t’ but no such parameter
  1592. /usr/include/signal.h:346: error: declaration for parameter ‘siginterrupt’ but no such parameter
  1593. /usr/include/signal.h:336: error: declaration for parameter ‘sigreturn’ but no such parameter
  1594. /usr/include/signal.h:329: error: declaration for parameter ‘sigvec’ but no such parameter
  1595. /usr/include/signal.h:305: error: declaration for parameter ‘sys_siglist’ but no such parameter
  1596. /usr/include/signal.h:304: error: declaration for parameter ‘_sys_siglist’ but no such parameter
  1597. /usr/include/signal.h:261: error: declaration for parameter ‘sigaction’ but no such parameter
  1598. /usr/include/bits/siginfo.h:293: error: declaration for parameter ‘sigevent_t’ but no such parameter
  1599. /usr/include/bits/siginfo.h:108: error: declaration for parameter ‘siginfo_t’ but no such parameter
  1600. /usr/include/bits/siginfo.h:37: error: declaration for parameter ‘sigval_t’ but no such parameter
  1601. /usr/include/signal.h:187: error: declaration for parameter ‘siggetmask’ but no such parameter
  1602. /usr/include/signal.h:184: error: declaration for parameter ‘sigsetmask’ but no such parameter
  1603. /usr/include/signal.h:181: error: declaration for parameter ‘sigblock’ but no such parameter
  1604. /usr/include/signal.h:153: error: declaration for parameter ‘__sigpause’ but no such parameter
  1605. /usr/include/signal.h:141: error: declaration for parameter ‘psignal’ but no such parameter
  1606. /usr/include/signal.h:136: error: declaration for parameter ‘gsignal’ but no such parameter
  1607. /usr/include/signal.h:129: error: declaration for parameter ‘raise’ but no such parameter
  1608. /usr/include/signal.h:75: error: declaration for parameter ‘__sighandler_t’ but no such parameter
  1609. /usr/include/sys/ioctl.h:42: error: declaration for parameter ‘ioctl’ but no such parameter
  1610. /usr/include/asm-generic/ioctl.h:51: error: declaration for parameter ‘__invalid_size_argument_for_IOC’ but no such parameter
  1611. /usr/include/fcntl.h:198: error: declaration for parameter ‘posix_fallocate’ but no such parameter
  1612. /usr/include/fcntl.h:177: error: declaration for parameter ‘posix_fadvise’ but no such parameter
  1613. /usr/include/fcntl.h:130: error: declaration for parameter ‘creat’ but no such parameter
  1614. /usr/include/fcntl.h:85: error: declaration for parameter ‘open’ but no such parameter
  1615. /usr/include/fcntl.h:76: error: declaration for parameter ‘fcntl’ but no such parameter
  1616. /usr/include/stdlib.h:962: error: declaration for parameter ‘getloadavg’ but no such parameter
  1617. /usr/include/stdlib.h:926: error: declaration for parameter ‘posix_openpt’ but no such parameter
  1618. /usr/include/stdlib.h:898: error: declaration for parameter ‘rpmatch’ but no such parameter
  1619. /usr/include/stdlib.h:880: error: declaration for parameter ‘wctomb’ but no such parameter
  1620. /usr/include/stdlib.h:873: error: declaration for parameter ‘mblen’ but no such parameter
  1621. /usr/include/stdlib.h:865: error: declaration for parameter ‘qfcvt_r’ but no such parameter
  1622. /usr/include/stdlib.h:861: error: declaration for parameter ‘qecvt_r’ but no such parameter
  1623. /usr/include/stdlib.h:856: error: declaration for parameter ‘fcvt_r’ but no such parameter
  1624. /usr/include/stdlib.h:853: error: declaration for parameter ‘ecvt_r’ but no such parameter
  1625. /usr/include/stdlib.h:846: error: declaration for parameter ‘qgcvt’ but no such parameter
  1626. /usr/include/stdlib.h:844: error: declaration for parameter ‘qfcvt’ but no such parameter
  1627. /usr/include/stdlib.h:841: error: declaration for parameter ‘qecvt’ but no such parameter
  1628. /usr/include/stdlib.h:834: error: declaration for parameter ‘gcvt’ but no such parameter
  1629. /usr/include/stdlib.h:828: error: declaration for parameter ‘fcvt’ but no such parameter
  1630. /usr/include/stdlib.h:822: error: declaration for parameter ‘ecvt’ but no such parameter
  1631. /usr/include/stdlib.h:786: error: declaration for parameter ‘labs’ but no such parameter
  1632. /usr/include/stdlib.h:785: error: declaration for parameter ‘abs’ but no such parameter
  1633. /usr/include/stdlib.h:781: error: declaration for parameter ‘qsort’ but no such parameter
  1634. /usr/include/stdlib.h:776: error: declaration for parameter ‘bsearch’ but no such parameter
  1635. /usr/include/stdlib.h:764: error: declaration for parameter ‘__compar_fn_t’ but no such parameter
  1636. /usr/include/stdlib.h:757: error: declaration for parameter ‘realpath’ but no such parameter
  1637. /usr/include/stdlib.h:738: error: declaration for parameter ‘system’ but no such parameter
  1638. /usr/include/stdlib.h:729: error: declaration for parameter ‘mkdtemp’ but no such parameter
  1639. /usr/include/stdlib.h:709: error: declaration for parameter ‘mkstemp’ but no such parameter
  1640. /usr/include/stdlib.h:698: error: declaration for parameter ‘mktemp’ but no such parameter
  1641. /usr/include/stdlib.h:689: error: declaration for parameter ‘clearenv’ but no such parameter
  1642. /usr/include/stdlib.h:682: error: declaration for parameter ‘unsetenv’ but no such parameter
  1643. /usr/include/stdlib.h:679: error: declaration for parameter ‘setenv’ but no such parameter
  1644. /usr/include/stdlib.h:672: error: declaration for parameter ‘putenv’ but no such parameter
  1645. /usr/include/stdlib.h:666: error: declaration for parameter ‘__secure_getenv’ but no such parameter
  1646. /usr/include/stdlib.h:660: error: declaration for parameter ‘getenv’ but no such parameter
  1647. /usr/include/stdlib.h:646: error: declaration for parameter ‘exit’ but no such parameter
  1648. /usr/include/stdlib.h:639: error: declaration for parameter ‘on_exit’ but no such parameter
  1649. /usr/include/stdlib.h:632: error: declaration for parameter ‘atexit’ but no such parameter
  1650. /usr/include/stdlib.h:628: error: declaration for parameter ‘abort’ but no such parameter
  1651. /usr/include/stdlib.h:623: error: declaration for parameter ‘posix_memalign’ but no such parameter
  1652. /usr/include/stdlib.h:608: error: declaration for parameter ‘cfree’ but no such parameter
  1653. /usr/include/stdlib.h:603: error: declaration for parameter ‘free’ but no such parameter
  1654. /usr/include/stdlib.h:601: error: declaration for parameter ‘realloc’ but no such parameter
  1655. /usr/include/stdlib.h:579: error: declaration for parameter ‘lcong48_r’ but no such parameter
  1656. /usr/include/stdlib.h:575: error: declaration for parameter ‘seed48_r’ but no such parameter
  1657. /usr/include/stdlib.h:572: error: declaration for parameter ‘srand48_r’ but no such parameter
  1658. /usr/include/stdlib.h:568: error: declaration for parameter ‘jrand48_r’ but no such parameter
  1659. /usr/include/stdlib.h:564: error: declaration for parameter ‘mrand48_r’ but no such parameter
  1660. /usr/include/stdlib.h:559: error: declaration for parameter ‘nrand48_r’ but no such parameter
  1661. /usr/include/stdlib.h:555: error: declaration for parameter ‘lrand48_r’ but no such parameter
  1662. /usr/include/stdlib.h:550: error: declaration for parameter ‘erand48_r’ but no such parameter
  1663. /usr/include/stdlib.h:547: error: declaration for parameter ‘drand48_r’ but no such parameter
  1664. /usr/include/stdlib.h:530: error: declaration for parameter ‘lcong48’ but no such parameter
  1665. /usr/include/stdlib.h:529: error: declaration for parameter ‘seed48’ but no such parameter
  1666. /usr/include/stdlib.h:527: error: declaration for parameter ‘srand48’ but no such parameter
  1667. /usr/include/stdlib.h:524: error: declaration for parameter ‘jrand48’ but no such parameter
  1668. /usr/include/stdlib.h:522: error: declaration for parameter ‘mrand48’ but no such parameter
  1669. /usr/include/stdlib.h:519: error: declaration for parameter ‘nrand48’ but no such parameter
  1670. /usr/include/stdlib.h:517: error: declaration for parameter ‘lrand48’ but no such parameter
  1671. /usr/include/stdlib.h:514: error: declaration for parameter ‘erand48’ but no such parameter
  1672. /usr/include/stdlib.h:513: error: declaration for parameter ‘drand48’ but no such parameter
  1673. /usr/include/stdlib.h:505: error: declaration for parameter ‘rand_r’ but no such parameter
  1674. /usr/include/stdlib.h:500: error: declaration for parameter ‘srand’ but no such parameter
  1675. /usr/include/stdlib.h:498: error: declaration for parameter ‘rand’ but no such parameter
  1676. /usr/include/stdlib.h:491: error: declaration for parameter ‘setstate_r’ but no such parameter
  1677. /usr/include/stdlib.h:487: error: declaration for parameter ‘initstate_r’ but no such parameter
  1678. /usr/include/stdlib.h:482: error: declaration for parameter ‘srandom_r’ but no such parameter
  1679. /usr/include/stdlib.h:479: error: declaration for parameter ‘random_r’ but no such parameter
  1680. /usr/include/stdlib.h:459: error: declaration for parameter ‘setstate’ but no such parameter
  1681. /usr/include/stdlib.h:455: error: declaration for parameter ‘initstate’ but no such parameter
  1682. /usr/include/stdlib.h:448: error: declaration for parameter ‘srandom’ but no such parameter
  1683. /usr/include/stdlib.h:445: error: declaration for parameter ‘random’ but no such parameter
  1684. /usr/include/bits/pthreadtypes.h:166: error: declaration for parameter ‘pthread_barrierattr_t’ but no such parameter
  1685. /usr/include/bits/pthreadtypes.h:160: error: declaration for parameter ‘pthread_barrier_t’ but no such parameter
  1686. /usr/include/bits/pthreadtypes.h:151: error: declaration for parameter ‘pthread_spinlock_t’ but no such parameter
  1687. /usr/include/bits/pthreadtypes.h:145: error: declaration for parameter ‘pthread_rwlockattr_t’ but no such parameter
  1688. /usr/include/bits/pthreadtypes.h:139: error: declaration for parameter ‘pthread_rwlock_t’ but no such parameter
  1689. /usr/include/bits/pthreadtypes.h:113: error: declaration for parameter ‘pthread_once_t’ but no such parameter
  1690. /usr/include/bits/pthreadtypes.h:109: error: declaration for parameter ‘pthread_key_t’ but no such parameter
  1691. /usr/include/bits/pthreadtypes.h:105: error: declaration for parameter ‘pthread_condattr_t’ but no such parameter
  1692. /usr/include/bits/pthreadtypes.h:99: error: declaration for parameter ‘pthread_cond_t’ but no such parameter
  1693. /usr/include/bits/pthreadtypes.h:79: error: declaration for parameter ‘pthread_mutexattr_t’ but no such parameter
  1694. /usr/include/bits/pthreadtypes.h:73: error: declaration for parameter ‘pthread_mutex_t’ but no such parameter
  1695. /usr/include/bits/pthreadtypes.h:49: error: declaration for parameter ‘__pthread_slist_t’ but no such parameter
  1696. /usr/include/bits/pthreadtypes.h:43: error: declaration for parameter ‘pthread_attr_t’ but no such parameter
  1697. /usr/include/bits/pthreadtypes.h:36: error: declaration for parameter ‘pthread_t’ but no such parameter
  1698. /usr/include/sys/types.h:206: error: declaration for parameter ‘register_t’ but no such parameter
  1699. /usr/include/sys/types.h:204: error: declaration for parameter ‘u_int64_t’ but no such parameter
  1700. /usr/include/sys/types.h:203: error: declaration for parameter ‘u_int32_t’ but no such parameter
  1701. /usr/include/sys/types.h:202: error: declaration for parameter ‘u_int16_t’ but no such parameter
  1702. /usr/include/sys/types.h:201: error: declaration for parameter ‘u_int8_t’ but no such parameter
  1703. /usr/include/sys/types.h:198: error: declaration for parameter ‘int64_t’ but no such parameter
  1704. /usr/include/sys/types.h:197: error: declaration for parameter ‘int32_t’ but no such parameter
  1705. /usr/include/sys/types.h:196: error: declaration for parameter ‘int16_t’ but no such parameter
  1706. /usr/include/sys/types.h:195: error: declaration for parameter ‘int8_t’ but no such parameter
  1707. /usr/include/sys/types.h:153: error: declaration for parameter ‘uint’ but no such parameter
  1708. /usr/include/sys/types.h:152: error: declaration for parameter ‘ushort’ but no such parameter
  1709. /usr/include/sys/types.h:151: error: declaration for parameter ‘ulong’ but no such parameter
  1710. /usr/include/stdlib.h:433: error: declaration for parameter ‘a64l’ but no such parameter
  1711. /usr/include/stdlib.h:429: error: declaration for parameter ‘l64a’ but no such parameter
  1712. /usr/include/stdlib.h:300: error: declaration for parameter ‘__strtoul_internal’ but no such parameter
  1713. /usr/include/stdlib.h:293: error: declaration for parameter ‘__strtol_internal’ but no such parameter
  1714. /usr/include/stdlib.h:288: error: declaration for parameter ‘__strtold_internal’ but no such parameter
  1715. /usr/include/stdlib.h:284: error: declaration for parameter ‘__strtof_internal’ but no such parameter
  1716. /usr/include/stdlib.h:281: error: declaration for parameter ‘__strtod_internal’ but no such parameter
  1717. /usr/include/stdlib.h:190: error: declaration for parameter ‘strtoul’ but no such parameter
  1718. /usr/include/stdlib.h:186: error: declaration for parameter ‘strtol’ but no such parameter
  1719. /usr/include/stdlib.h:167: error: declaration for parameter ‘strtod’ but no such parameter
  1720. /usr/include/stdlib.h:152: error: declaration for parameter ‘atol’ but no such parameter
  1721. /usr/include/stdlib.h:149: error: declaration for parameter ‘atoi’ but no such parameter
  1722. /usr/include/stdlib.h:146: error: declaration for parameter ‘atof’ but no such parameter
  1723. /usr/include/stdlib.h:110: error: declaration for parameter ‘ldiv_t’ but no such parameter
  1724. /usr/include/stdlib.h:102: error: declaration for parameter ‘div_t’ but no such parameter
  1725. /usr/include/unistd.h:1065: error: declaration for parameter ‘fdatasync’ but no such parameter
  1726. /usr/include/unistd.h:1034: error: declaration for parameter ‘lockf’ but no such parameter
  1727. /usr/include/unistd.h:1011: error: declaration for parameter ‘syscall’ but no such parameter
  1728. /usr/include/unistd.h:990: error: declaration for parameter ‘brk’ but no such parameter
  1729. /usr/include/unistd.h:970: error: declaration for parameter ‘ftruncate’ but no such parameter
  1730. /usr/include/unistd.h:949: error: declaration for parameter ‘truncate’ but no such parameter
  1731. /usr/include/unistd.h:943: error: declaration for parameter ‘getdtablesize’ but no such parameter
  1732. /usr/include/unistd.h:938: error: declaration for parameter ‘getpagesize’ but no such parameter
  1733. /usr/include/unistd.h:933: error: declaration for parameter ‘sync’ but no such parameter
  1734. /usr/include/unistd.h:930: error: declaration for parameter ‘gethostid’ but no such parameter
  1735. /usr/include/unistd.h:923: error: declaration for parameter ‘fsync’ but no such parameter
  1736. /usr/include/unistd.h:914: error: declaration for parameter ‘getpass’ but no such parameter
  1737. /usr/include/unistd.h:910: error: declaration for parameter ‘chroot’ but no such parameter
  1738. /usr/include/unistd.h:903: error: declaration for parameter ‘daemon’ but no such parameter
  1739. /usr/include/unistd.h:897: error: declaration for parameter ‘setusershell’ but no such parameter
  1740. /usr/include/unistd.h:896: error: declaration for parameter ‘endusershell’ but no such parameter
  1741. /usr/include/unistd.h:895: error: declaration for parameter ‘getusershell’ but no such parameter
  1742. /usr/include/unistd.h:891: error: declaration for parameter ‘acct’ but no such parameter
  1743. /usr/include/unistd.h:885: error: declaration for parameter ‘profil’ but no such parameter
  1744. /usr/include/unistd.h:875: error: declaration for parameter ‘revoke’ but no such parameter
  1745. /usr/include/unistd.h:872: error: declaration for parameter ‘vhangup’ but no such parameter
  1746. /usr/include/unistd.h:866: error: declaration for parameter ‘setdomainname’ but no such parameter
  1747. /usr/include/unistd.h:864: error: declaration for parameter ‘getdomainname’ but no such parameter
  1748. /usr/include/unistd.h:857: error: declaration for parameter ‘sethostid’ but no such parameter
  1749. /usr/include/unistd.h:853: error: declaration for parameter ‘sethostname’ but no such parameter
  1750. /usr/include/unistd.h:845: error: declaration for parameter ‘gethostname’ but no such parameter
  1751. /usr/include/getopt.h:153: error: declaration for parameter ‘getopt’ but no such parameter
  1752. /usr/include/getopt.h:82: error: declaration for parameter ‘optopt’ but no such parameter
  1753. /usr/include/getopt.h:78: error: declaration for parameter ‘opterr’ but no such parameter
  1754. /usr/include/getopt.h:73: error: declaration for parameter ‘optind’ but no such parameter
  1755. /usr/include/getopt.h:59: error: declaration for parameter ‘optarg’ but no such parameter
  1756. /usr/include/unistd.h:828: error: declaration for parameter ‘setlogin’ but no such parameter
  1757. /usr/include/unistd.h:823: error: declaration for parameter ‘getlogin_r’ but no such parameter
  1758. /usr/include/unistd.h:815: error: declaration for parameter ‘getlogin’ but no such parameter
  1759. /usr/include/unistd.h:808: error: declaration for parameter ‘tcsetpgrp’ but no such parameter
  1760. /usr/include/unistd.h:801: error: declaration for parameter ‘rmdir’ but no such parameter
  1761. /usr/include/unistd.h:792: error: declaration for parameter ‘unlink’ but no such parameter
  1762. /usr/include/unistd.h:770: error: declaration for parameter ‘symlink’ but no such parameter
  1763. /usr/include/unistd.h:757: error: declaration for parameter ‘link’ but no such parameter
  1764. /usr/include/unistd.h:751: error: declaration for parameter ‘ttyslot’ but no such parameter
  1765. /usr/include/unistd.h:745: error: declaration for parameter ‘isatty’ but no such parameter
  1766. /usr/include/unistd.h:741: error: declaration for parameter ‘ttyname_r’ but no such parameter
  1767. /usr/include/unistd.h:736: error: declaration for parameter ‘ttyname’ but no such parameter
  1768. /usr/include/unistd.h:656: error: declaration for parameter ‘getgroups’ but no such parameter
  1769. /usr/include/unistd.h:617: error: declaration for parameter ‘setpgrp’ but no such parameter
  1770. /usr/include/unistd.h:564: error: declaration for parameter ‘sysconf’ but no such parameter
  1771. /usr/include/unistd.h:561: error: declaration for parameter ‘fpathconf’ but no such parameter
  1772. /usr/include/unistd.h:558: error: declaration for parameter ‘pathconf’ but no such parameter
  1773. /usr/include/unistd.h:548: error: declaration for parameter ‘_exit’ but no such parameter
  1774. /usr/include/unistd.h:543: error: declaration for parameter ‘nice’ but no such parameter
  1775. /usr/include/unistd.h:538: error: declaration for parameter ‘execlp’ but no such parameter
  1776. /usr/include/unistd.h:532: error: declaration for parameter ‘execvp’ but no such parameter
  1777. /usr/include/unistd.h:527: error: declaration for parameter ‘execl’ but no such parameter
  1778. /usr/include/unistd.h:522: error: declaration for parameter ‘execle’ but no such parameter
  1779. /usr/include/unistd.h:517: error: declaration for parameter ‘execv’ but no such parameter
  1780. /usr/include/unistd.h:505: error: declaration for parameter ‘execve’ but no such parameter
  1781. /usr/include/unistd.h:496: error: declaration for parameter ‘__environ’ but no such parameter
  1782. /usr/include/unistd.h:493: error: declaration for parameter ‘dup2’ but no such parameter
  1783. /usr/include/unistd.h:490: error: declaration for parameter ‘dup’ but no such parameter
  1784. /usr/include/unistd.h:485: error: declaration for parameter ‘getwd’ but no such parameter
  1785. /usr/include/unistd.h:471: error: declaration for parameter ‘getcwd’ but no such parameter
  1786. /usr/include/unistd.h:461: error: declaration for parameter ‘fchdir’ but no such parameter
  1787. /usr/include/unistd.h:457: error: declaration for parameter ‘chdir’ but no such parameter
  1788. /usr/include/unistd.h:444: error: declaration for parameter ‘lchown’ but no such parameter
  1789. /usr/include/unistd.h:438: error: declaration for parameter ‘fchown’ but no such parameter
  1790. /usr/include/unistd.h:434: error: declaration for parameter ‘chown’ but no such parameter
  1791. /usr/include/unistd.h:429: error: declaration for parameter ‘pause’ but no such parameter
  1792. /usr/include/unistd.h:405: error: declaration for parameter ‘sleep’ but no such parameter
  1793. /usr/include/unistd.h:393: error: declaration for parameter ‘alarm’ but no such parameter
  1794. /usr/include/unistd.h:384: error: declaration for parameter ‘pipe’ but no such parameter
  1795. /usr/include/unistd.h:320: error: declaration for parameter ‘close’ but no such parameter
  1796. /usr/include/unistd.h:258: error: declaration for parameter ‘access’ but no such parameter
  1797. /usr/include/bits/errno.h:43: error: declaration for parameter ‘__errno_location’ but no such parameter
  1798. /usr/include/sys/time.h:149: error: declaration for parameter ‘futimes’ but no such parameter
  1799. /usr/include/sys/time.h:146: error: declaration for parameter ‘lutimes’ but no such parameter
  1800. /usr/include/sys/time.h:141: error: declaration for parameter ‘utimes’ but no such parameter
  1801. /usr/include/sys/time.h:122: error: declaration for parameter ‘__itimer_which_t’ but no such parameter
  1802. /usr/include/sys/time.h:88: error: declaration for parameter ‘adjtime’ but no such parameter
  1803. /usr/include/sys/time.h:81: error: declaration for parameter ‘settimeofday’ but no such parameter
  1804. /usr/include/sys/time.h:74: error: declaration for parameter ‘gettimeofday’ but no such parameter
  1805. /usr/include/sys/time.h:63: error: declaration for parameter ‘__timezone_ptr_t’ but no such parameter
  1806. /usr/include/sys/select.h:112: error: declaration for parameter ‘select’ but no such parameter
  1807. /usr/include/sys/select.h:78: error: declaration for parameter ‘fd_set’ but no such parameter
  1808. /usr/include/sys/select.h:55: error: declaration for parameter ‘__fd_mask’ but no such parameter
  1809. /usr/include/bits/sigset.h:31: error: declaration for parameter ‘__sigset_t’ but no such parameter
  1810. /usr/include/bits/sigset.h:23: error: declaration for parameter ‘__sig_atomic_t’ but no such parameter
  1811. /usr/include/string.h:350: error: declaration for parameter ‘strsep’ but no such parameter
  1812. /usr/include/string.h:330: error: declaration for parameter ‘strncasecmp’ but no such parameter
  1813. /usr/include/string.h:326: error: declaration for parameter ‘strcasecmp’ but no such parameter
  1814. /usr/include/string.h:312: error: declaration for parameter ‘ffs’ but no such parameter
  1815. /usr/include/string.h:308: error: declaration for parameter ‘rindex’ but no such parameter
  1816. /usr/include/string.h:304: error: declaration for parameter ‘index’ but no such parameter
  1817. /usr/include/string.h:300: error: declaration for parameter ‘bcmp’ but no such parameter
  1818. /usr/include/string.h:296: error: declaration for parameter ‘bzero’ but no such parameter
  1819. /usr/include/string.h:293: error: declaration for parameter ‘bcopy’ but no such parameter
  1820. /usr/include/string.h:288: error: declaration for parameter ‘__bzero’ but no such parameter
  1821. /usr/include/string.h:270: error: declaration for parameter ‘strerror_r’ but no such parameter
  1822. /usr/include/string.h:256: error: declaration for parameter ‘strerror’ but no such parameter
  1823. /usr/include/string.h:212: error: declaration for parameter ‘strtok_r’ but no such parameter
  1824. /usr/include/string.h:208: error: declaration for parameter ‘__strtok_r’ but no such parameter
  1825. /usr/include/string.h:200: error: declaration for parameter ‘strtok’ but no such parameter
  1826. /usr/include/string.h:195: error: declaration for parameter ‘strstr’ but no such parameter
  1827. /usr/include/string.h:192: error: declaration for parameter ‘strpbrk’ but no such parameter
  1828. /usr/include/string.h:171: error: declaration for parameter ‘strrchr’ but no such parameter
  1829. /usr/include/string.h:168: error: declaration for parameter ‘strchr’ but no such parameter
  1830. /usr/include/string.h:131: error: declaration for parameter ‘strdup’ but no such parameter
  1831. /usr/include/string.h:107: error: declaration for parameter ‘strcoll’ but no such parameter
  1832. /usr/include/string.h:103: error: declaration for parameter ‘strncmp’ but no such parameter
  1833. /usr/include/string.h:100: error: declaration for parameter ‘strcmp’ but no such parameter
  1834. /usr/include/string.h:96: error: declaration for parameter ‘strncat’ but no such parameter
  1835. /usr/include/string.h:93: error: declaration for parameter ‘strcat’ but no such parameter
  1836. /usr/include/string.h:89: error: declaration for parameter ‘strncpy’ but no such parameter
  1837. /usr/include/string.h:85: error: declaration for parameter ‘strcpy’ but no such parameter
  1838. /usr/include/string.h:67: error: declaration for parameter ‘memchr’ but no such parameter
  1839. /usr/include/string.h:63: error: declaration for parameter ‘memcmp’ but no such parameter
  1840. /usr/include/string.h:59: error: declaration for parameter ‘memset’ but no such parameter
  1841. /usr/include/string.h:53: error: declaration for parameter ‘memccpy’ but no such parameter
  1842. /usr/include/string.h:44: error: declaration for parameter ‘memmove’ but no such parameter
  1843. /usr/include/string.h:40: error: declaration for parameter ‘memcpy’ but no such parameter
  1844. /usr/include/stdio.h:786: error: declaration for parameter ‘ctermid’ but no such parameter
  1845. /usr/include/bits/sys_errlist.h:28: error: declaration for parameter ‘sys_errlist’ but no such parameter
  1846. /usr/include/bits/sys_errlist.h:27: error: declaration for parameter ‘sys_nerr’ but no such parameter
  1847. /usr/include/stdio.h:747: error: declaration for parameter ‘perror’ but no such parameter
  1848. /usr/include/stdio.h:603: error: declaration for parameter ‘ungetc’ but no such parameter
  1849. /usr/include/stdio.h:596: error: declaration for parameter ‘puts’ but no such parameter
  1850. /usr/include/stdio.h:590: error: declaration for parameter ‘fputs’ but no such parameter
  1851. /usr/include/stdio.h:540: error: declaration for parameter ‘gets’ but no such parameter
  1852. /usr/include/stdio.h:533: error: declaration for parameter ‘fgets’ but no such parameter
  1853. /usr/include/stdio.h:523: error: declaration for parameter ‘putw’ but no such parameter
  1854. /usr/include/stdio.h:513: error: declaration for parameter ‘putchar_unlocked’ but no such parameter
  1855. /usr/include/stdio.h:512: error: declaration for parameter ‘putc_unlocked’ but no such parameter
  1856. /usr/include/stdio.h:504: error: declaration for parameter ‘fputc_unlocked’ but no such parameter
  1857. /usr/include/stdio.h:490: error: declaration for parameter ‘putchar’ but no such parameter
  1858. /usr/include/stdio.h:484: error: declaration for parameter ‘putc’ but no such parameter
  1859. /usr/include/stdio.h:483: error: declaration for parameter ‘fputc’ but no such parameter
  1860. /usr/include/stdio.h:461: error: declaration for parameter ‘getchar_unlocked’ but no such parameter
  1861. /usr/include/stdio.h:448: error: declaration for parameter ‘getchar’ but no such parameter
  1862. /usr/include/stdio.h:408: error: declaration for parameter ‘sscanf’ but no such parameter
  1863. /usr/include/stdio.h:405: error: declaration for parameter ‘scanf’ but no such parameter
  1864. /usr/include/stdio.h:363: error: declaration for parameter ‘vsnprintf’ but no such parameter
  1865. /usr/include/stdio.h:359: error: declaration for parameter ‘snprintf’ but no such parameter
  1866. /usr/include/stdio.h:351: error: declaration for parameter ‘vsprintf’ but no such parameter
  1867. /usr/include/stdio.h:348: error: declaration for parameter ‘vprintf’ but no such parameter
  1868. /usr/include/stdio.h:336: error: declaration for parameter ‘sprintf’ but no such parameter
  1869. /usr/include/stdio.h:333: error: declaration for parameter ‘printf’ but no such parameter
  1870. /usr/include/stdio.h:204: error: declaration for parameter ‘tempnam’ but no such parameter
  1871. /usr/include/stdio.h:191: error: declaration for parameter ‘tmpnam_r’ but no such parameter
  1872. /usr/include/stdio.h:185: error: declaration for parameter ‘tmpnam’ but no such parameter
  1873. /usr/include/stdio.h:156: error: declaration for parameter ‘rename’ but no such parameter
  1874. /usr/include/stdio.h:154: error: declaration for parameter ‘remove’ but no such parameter
  1875. /usr/include/stdio.h:144: error: declaration for parameter ‘stderr’ but no such parameter
  1876. /usr/include/stdio.h:143: error: declaration for parameter ‘stdout’ but no such parameter
  1877. /usr/include/stdio.h:142: error: declaration for parameter ‘stdin’ but no such parameter
  1878. /usr/include/libio.h:452: error: declaration for parameter ‘_IO_putc’ but no such parameter
  1879. /usr/include/libio.h:381: error: declaration for parameter ‘__io_close_fn’ but no such parameter
  1880. /usr/include/libio.h:378: error: declaration for parameter ‘__io_seek_fn’ but no such parameter
  1881. /usr/include/libio.h:345: error: parameter ‘_IO_2_1_stderr_’ has incomplete type
  1882. /usr/include/libio.h:345: error: declaration for parameter ‘_IO_2_1_stderr_’ but no such parameter
  1883. /usr/include/libio.h:344: error: parameter ‘_IO_2_1_stdout_’ has incomplete type
  1884. /usr/include/libio.h:344: error: declaration for parameter ‘_IO_2_1_stdout_’ but no such parameter
  1885. /usr/include/libio.h:343: error: parameter ‘_IO_2_1_stdin_’ has incomplete type
  1886. /usr/include/libio.h:343: error: declaration for parameter ‘_IO_2_1_stdin_’ but no such parameter
  1887. /usr/include/libio.h:338: error: declaration for parameter ‘_IO_FILE’ but no such parameter
  1888. /usr/include/libio.h:177: error: parameter ‘_IO_lock_t’ has incomplete type
  1889. /usr/include/libio.h:177: error: declaration for parameter ‘_IO_lock_t’ but no such parameter
  1890. /usr/lib/gcc/i386-redhat-linux/4.1.2/include/stdarg.h:43: error: declaration for parameter ‘__gnuc_va_list’ but no such parameter
  1891. /usr/include/_G_config.h:58: error: declaration for parameter ‘_G_uint32_t’ but no such parameter
  1892. /usr/include/_G_config.h:57: error: declaration for parameter ‘_G_uint16_t’ but no such parameter
  1893. /usr/include/_G_config.h:56: error: declaration for parameter ‘_G_int32_t’ but no such parameter
  1894. /usr/include/_G_config.h:55: error: declaration for parameter ‘_G_int16_t’ but no such parameter
  1895. /usr/include/_G_config.h:53: error: declaration for parameter ‘_G_iconv_t’ but no such parameter
  1896. /usr/include/gconv.h:177: error: declaration for parameter ‘__gconv_t’ but no such parameter
  1897. /usr/include/gconv.h:101: error: declaration for parameter ‘__gconv_trans_end_fct’ but no such parameter
  1898. /usr/include/gconv.h:100: error: declaration for parameter ‘__gconv_trans_init_fct’ but no such parameter
  1899. /usr/include/gconv.h:97: error: declaration for parameter ‘__gconv_trans_query_fct’ but no such parameter
  1900. /usr/include/gconv.h:93: error: declaration for parameter ‘__gconv_trans_context_fct’ but no such parameter
  1901. /usr/include/gconv.h:88: error: declaration for parameter ‘__gconv_trans_fct’ but no such parameter
  1902. /usr/include/gconv.h:79: error: declaration for parameter ‘__gconv_end_fct’ but no such parameter
  1903. /usr/include/gconv.h:78: error: declaration for parameter ‘__gconv_init_fct’ but no such parameter
  1904. /usr/include/gconv.h:75: error: declaration for parameter ‘wint_t’ but no such parameter
  1905. /usr/include/gconv.h:72: error: declaration for parameter ‘__gconv_fct’ but no such parameter
  1906. /usr/include/_G_config.h:35: error: declaration for parameter ‘_G_fpos64_t’ but no such parameter
  1907. /usr/include/_G_config.h:30: error: declaration for parameter ‘_G_fpos_t’ but no such parameter
  1908. /usr/include/wchar.h:84: error: declaration for parameter ‘__mbstate_t’ but no such parameter
  1909. /usr/lib/gcc/i386-redhat-linux/4.1.2/include/stddef.h:355: error: declaration for parameter ‘wint_t’ but no such parameter
  1910. /usr/lib/gcc/i386-redhat-linux/4.1.2/include/stddef.h:326: error: declaration for parameter ‘wchar_t’ but no such parameter
  1911. /usr/include/stdio.h:62: error: declaration for parameter ‘__FILE’ but no such parameter
  1912. /usr/include/stdio.h:46: error: declaration for parameter ‘FILE’ but no such parameter
  1913. /usr/include/bits/types.h:189: error: declaration for parameter ‘__caddr_t’ but no such parameter
  1914. /usr/include/bits/types.h:45: error: declaration for parameter ‘__uint32_t’ but no such parameter
  1915. /usr/include/bits/types.h:44: error: declaration for parameter ‘__int32_t’ but no such parameter
  1916. /usr/include/bits/types.h:43: error: declaration for parameter ‘__uint16_t’ but no such parameter
  1917. /usr/include/bits/types.h:42: error: declaration for parameter ‘__int16_t’ but no such parameter
  1918. /usr/include/bits/types.h:41: error: declaration for parameter ‘__uint8_t’ but no such parameter
  1919. /usr/include/bits/types.h:40: error: declaration for parameter ‘__int8_t’ but no such parameter
  1920. /usr/include/bits/types.h:37: error: declaration for parameter ‘__u_long’ but no such parameter
  1921. /usr/include/bits/types.h:36: error: declaration for parameter ‘__u_int’ but no such parameter
  1922. /usr/include/bits/types.h:35: error: declaration for parameter ‘__u_short’ but no such parameter
  1923. /usr/include/bits/types.h:34: error: declaration for parameter ‘__u_char’ but no such parameter
  1924. /usr/lib/gcc/i386-redhat-linux/4.1.2/include/stddef.h:214: error: declaration for parameter ‘size_t’ but no such parameter
  1925. chan_skype.c:3341: error: expected ‘{’ at end of input
  1926. make: *** [chan_skype.o] Error 1
  1927. root@trixbox:~/skypeforasterisk-1.6.0_1.0.1-x86_32 [trixbox.prossiveit.lan skypeforasterisk-1.6.0_1.0.1-x86_32]#
clone this paste RAW Paste Data