Guest User

rvi_core release-0.4.0 ==> bt (compile) error

a guest
Jul 22nd, 2015
268
0
Never
Not a member of Pastebin yet? Sign Up, it unlocks many cool features!
Bash 4.84 KB | None | 0 0
  1. [ec2-user rvi_core]$ git branch -a
  2. * release-0.4.0
  3.   remotes/origin/HEAD -> origin/master
  4.   remotes/origin/master
  5.   remotes/origin/release-0.3
  6.   remotes/origin/release-0.4.0
  7.   remotes/origin/release-next
  8. [ec2-user rvi_core]$ make
  9. ./rebar get-deps
  10. ==> lager (get-deps)
  11. ==> src (get-deps)
  12. ==> exo (get-deps)
  13. ==> edown (get-deps)
  14. ==> setup (get-deps)
  15. ==> resource (get-deps)
  16. ==> src (get-deps)
  17. ==> dthread (get-deps)
  18. ==> bt (get-deps)
  19. ==> src (get-deps)
  20. ==> uart (get-deps)
  21. ==> src (get-deps)
  22. ==> gsms (get-deps)
  23. ==> rel (get-deps)
  24. ==> rvi_common (get-deps)
  25. ==> authorize (get-deps)
  26. ==> dlink_bt (get-deps)
  27. ==> dlink_tcp (get-deps)
  28. ==> proto_bert (get-deps)
  29. ==> proto_json (get-deps)
  30. ==> schedule (get-deps)
  31. ==> service_discovery (get-deps)
  32. ==> service_edge (get-deps)
  33. ==> rvi_core (get-deps)
  34. ./rebar  compile
  35. ==> lager (compile)
  36. Compiled src/lager_util.erl
  37. Compiled src/lager_transform.erl
  38. Compiled src/lager_sup.erl
  39. Compiled src/lager_handler_watcher.erl
  40. Compiled src/lager_app.erl
  41. Compiled src/lager_trunc_io.erl
  42. Compiled src/lager_mochiglobal.erl
  43. Compiled src/lager_file_backend.erl
  44. Compiled src/lager_stdlib.erl
  45. Compiled src/lager_crash_log.erl
  46. Compiled src/lager_handler_watcher_sup.erl
  47. Compiled src/lager.erl
  48. Compiled src/error_logger_lager_h.erl
  49. Compiled src/lager_console_backend.erl
  50. Compiled src/lager_format.erl
  51. ==> src (compile)
  52. ==> exo (compile)
  53. Compiled src/exo_socket_server.erl
  54. Compiled src/exo_app.erl
  55. Compiled src/exo_http_server.erl
  56. Compiled src/exo_socket_cache.erl
  57. Compiled src/exo_socket.erl
  58. /home/ec2-user/rvi_core/deps/exo/src/exo_ssh.erl:18: Warning: undefined callback function code_change/3 (behaviour 'ssh_channel')
  59. /home/ec2-user/rvi_core/deps/exo/src/exo_ssh.erl:18: Warning: undefined callback function handle_call/3 (behaviour 'ssh_channel')
  60. /home/ec2-user/rvi_core/deps/exo/src/exo_ssh.erl:18: Warning: undefined callback function handle_cast/2 (behaviour 'ssh_channel')
  61. Compiled src/exo_ssh.erl
  62. Compiled src/exo_http.erl
  63. Compiled src/exo_sup.erl
  64. Compiled src/exo_json.erl
  65. Compiled src/exo_url.erl
  66. Compiled src/exo_socket_session.erl
  67. ==> edown (compile)
  68. Compiled src/edown_lib.erl
  69. Compiled src/edown_make.erl
  70. Compiled src/edown_xmerl.erl
  71. Compiled src/edown_doclet.erl
  72. Compiled src/edown_layout.erl
  73. ==> setup (compile)
  74. Compiled src/setup_lib.erl
  75. Compiled src/setup_gen.erl
  76. Compiled src/setup.erl
  77. ==> edown (escriptize)
  78. ==> setup (escriptize)
  79. ==> resource (compile)
  80. Compiled src/resource.erl
  81. Compiling c_src/resource_nif.c
  82. ==> src (compile)
  83. ==> dthread (compile)
  84. Compiled src/dthread.erl
  85. Compiling c_src/dlib.c
  86. Compiling c_src/dlog.c
  87. Compiling c_src/dterm.c
  88. Compiling c_src/dthread.c
  89. Compiling c_src/dthread_drv.c
  90. ==> bt (compile)
  91. Compiled src/bt_make_hci_api.erl
  92. Compiled src/bt_util.erl
  93. Compiled src/hci_util.erl
  94. Compiled src/rfcomm.erl
  95. Compiled src/bt_sup.erl
  96. Compiled src/bt_erl_server.erl
  97. Compiled src/bt_drv.erl
  98. Compiled src/bt_iset.erl
  99. Compiled src/hci.erl
  100. Compiled src/bt.erl
  101. Compiled src/bt_app.erl
  102. Compiled src/obex_tcp.erl
  103. Compiled src/obex_sync_server.erl
  104. Compiled src/hci_api.erl
  105. Compiled src/hci_test.erl
  106. Compiled src/obex_generic.erl
  107. Compiled src/hci_drv.erl
  108. Compiled src/l2cap.erl
  109. Compiled src/bt_sdp_srv.erl
  110. Compiled src/obex_bip.erl
  111. Compiled src/bt_sdp.erl
  112. Compiled src/hci_socket.erl
  113. Compiled src/obex_rfcomm.erl
  114. Compiled src/obex_dm_server.erl
  115. Compiled src/obex.erl
  116. Compiling /home/ec2-user/rvi_core/deps/bt/c_src/bt_linux_drv.c
  117. /home/ec2-user/rvi_core/deps/bt/c_src/bt_linux_drv.c: In function ‘mgmt_open’:
  118. /home/ec2-user/rvi_core/deps/bt/c_src/bt_linux_drv.c:82: error: ‘struct sockaddr_hci’ has no member named ‘hci_channel’
  119. /home/ec2-user/rvi_core/deps/bt/c_src/bt_linux_drv.c:82: error: ‘HCI_CHANNEL_CONTROL’ undeclared (first use in this function)
  120. /home/ec2-user/rvi_core/deps/bt/c_src/bt_linux_drv.c:82: error: (Each undeclaredidentifier is reported only once
  121. /home/ec2-user/rvi_core/deps/bt/c_src/bt_linux_drv.c:82: error: for each function it appears in.)
  122. /home/ec2-user/rvi_core/deps/bt/c_src/bt_linux_drv.c: In function ‘rfcomm_accept’:
  123. /home/ec2-user/rvi_core/deps/bt/c_src/bt_linux_drv.c:448: warning: missing initializer
  124. /home/ec2-user/rvi_core/deps/bt/c_src/bt_linux_drv.c:448: warning: (near initialization for ‘rem_addr.rc_bdaddr’)
  125. /home/ec2-user/rvi_core/deps/bt/c_src/bt_linux_drv.c:449: warning: missing initializer
  126. /home/ec2-user/rvi_core/deps/bt/c_src/bt_linux_drv.c:449: warning: (near initialization for ‘loc_addr.rc_bdaddr’)
  127. /home/ec2-user/rvi_core/deps/bt/c_src/bt_linux_drv.c: In function ‘bt_command’:
  128. /home/ec2-user/rvi_core/deps/bt/c_src/bt_linux_drv.c:673: warning: missing initializer
  129. /home/ec2-user/rvi_core/deps/bt/c_src/bt_linux_drv.c:673: warning: (near initialization for ‘loc_addr.rc_bdaddr’)
  130. ERROR: compile failed while processing /home/ec2-user/rvi_core/deps/bt: rebar_abort
  131. make: *** [compile] Error 1
Advertisement
Add Comment
Please, Sign In to add comment