Pastebin launched a little side project called VERYVIRAL.com, check it out ;-) Want more features on Pastebin? Sign Up, it's FREE!
Guest

Johannes

By: a guest on Jan 21st, 2010  |  syntax: None  |  size: 91.31 KB  |  views: 139  |  expires: Never
download  |  raw  |  embed  |  report abuse  |  print
Text below is selected. Please press Ctrl+C to copy to your clipboard. (⌘+C on Mac)
  1. cpan[1]> install DBD::mysql                                                    
  2. CPAN: Storable loaded ok (v2.18)
  3. CPAN: LWP::UserAgent loaded ok (v5.813)
  4. CPAN: Time::HiRes loaded ok (v1.9711)
  5. Warning: no success downloading '/Users/administrator/.cpan/sources/authors/01mailrc.txt.gz.tmp1122'. Giving up on it. at /Library/Perl/Updates/5.10.0/CPAN/FTP.pm line 837
  6.         CPAN::FTP::hostdlhard('CPAN::FTP', 'ARRAY(0x100968a40)', 'authors/01mailrc.txt.gz', '/Users/administrator/.cpan/sources/authors/01mailrc.txt.gz.tm...', 'HASH(0x100c3cbb0)') called at /Library/Perl/Updates/5.10.0/CPAN/FTP.pm line 515
  7.         CPAN::FTP::hostdlxxx('CPAN::FTP', 'dlhard', undef, 'ARRAY(0x100968a40)', 'authors/01mailrc.txt.gz', '/Users/administrator/.cpan/sources/authors/01mailrc.txt.gz.tm...', 'HASH(0x100c3cbb0)') called at /Library/Perl/Updates/5.10.0/CPAN/FTP.pm line 442
  8.         CPAN::FTP::localize('CPAN::FTP', 'authors/01mailrc.txt.gz', '/Users/administrator/.cpan/sources/authors/01mailrc.txt.gz', 3) called at /Library/Perl/Updates/5.10.0/CPAN/Index.pm line 225
  9.         CPAN::Index::reload_x('CPAN::Index', 'authors/01mailrc.txt.gz', 'authors/01mailrc.txt.gz', undef) called at /Library/Perl/Updates/5.10.0/CPAN/Index.pm line 84
  10.         CPAN::Index::reload('CPAN::Index') called at /Library/Perl/Updates/5.10.0/CPAN.pm line 955
  11.         CPAN::exists('CPAN=HASH(0x100b33688)', 'CPAN::Module', 'DBD::mysql') called at /Library/Perl/Updates/5.10.0/CPAN/Shell.pm line 1243
  12.         CPAN::Shell::expandany('CPAN::Shell', 'DBD::mysql') called at /Library/Perl/Updates/5.10.0/CPAN/Shell.pm line 1639
  13.         CPAN::Shell::rematein('CPAN::Shell', 'install', 'DBD::mysql') called at /Library/Perl/Updates/5.10.0/CPAN/Shell.pm line 1935
  14.         CPAN::Shell::__ANON__('CPAN::Shell', 'DBD::mysql') called at /Library/Perl/Updates/5.10.0/CPAN.pm line 375
  15.         eval {...} called at /Library/Perl/Updates/5.10.0/CPAN.pm line 372
  16.         CPAN::shell() called at /usr/bin/cpan5.10.0 line 199
  17.  
  18. I would like to connect to one of the following sites to get 'authors/01mailrc.txt.gz':
  19.  
  20.  http://www.perl.org/CPAN/
  21.  ftp://ftp.perl.org/pub/CPAN/
  22.  
  23. Is it OK to try to connect to the Internet? [yes]
  24. Fetching with LWP:
  25.   http://www.perl.org/CPAN/authors/01mailrc.txt.gz
  26. CPAN: YAML loaded ok (v0.70)
  27. Going to read '/Users/administrator/.cpan/sources/authors/01mailrc.txt.gz'
  28. ............................................................................DONE
  29. Fetching with LWP:
  30.   http://www.perl.org/CPAN/modules/02packages.details.txt.gz
  31. Going to read '/Users/administrator/.cpan/sources/modules/02packages.details.txt.gz'
  32.   Database was generated on Thu, 21 Jan 2010 14:55:28 GMT
  33. ............................................................................DONE
  34. Fetching with LWP:
  35.   http://www.perl.org/CPAN/modules/03modlist.data.gz
  36. Going to read '/Users/administrator/.cpan/sources/modules/03modlist.data.gz'
  37. ............................................................................DONE
  38. Going to write /Users/administrator/.cpan/Metadata
  39. Running install for module 'DBD::mysql'
  40. Running make for C/CA/CAPTTOFU/DBD-mysql-4.013.tar.gz
  41. Fetching with LWP:
  42.   http://www.perl.org/CPAN/authors/id/C/CA/CAPTTOFU/DBD-mysql-4.013.tar.gz
  43. CPAN: Digest::SHA loaded ok (v5.47)
  44. Fetching with LWP:
  45.   http://www.perl.org/CPAN/authors/id/C/CA/CAPTTOFU/CHECKSUMS
  46. Checksum for /Users/administrator/.cpan/sources/authors/id/C/CA/CAPTTOFU/DBD-mysql-4.013.tar.gz ok
  47. Scanning cache /Users/administrator/.cpan/build for sizes
  48. DONE
  49. CPAN: Archive::Tar loaded ok (v1.54)
  50. DBD-mysql-4.013/
  51. DBD-mysql-4.013/lib/
  52. DBD-mysql-4.013/lib/DBD/
  53. DBD-mysql-4.013/lib/DBD/mysql.pm
  54. DBD-mysql-4.013/lib/DBD/mysql/
  55. DBD-mysql-4.013/lib/DBD/mysql/GetInfo.pm
  56. DBD-mysql-4.013/lib/DBD/mysql/INSTALL.pod
  57. DBD-mysql-4.013/lib/Bundle/
  58. DBD-mysql-4.013/lib/Bundle/DBD/
  59. DBD-mysql-4.013/lib/Bundle/DBD/mysql.pm
  60. DBD-mysql-4.013/mysql.xs
  61. DBD-mysql-4.013/dbdimp.c
  62. DBD-mysql-4.013/myld
  63. DBD-mysql-4.013/INSTALL.html
  64. DBD-mysql-4.013/Makefile.PL.embedded
  65. DBD-mysql-4.013/TODO
  66. DBD-mysql-4.013/README
  67. DBD-mysql-4.013/MANIFEST.SKIP
  68. DBD-mysql-4.013/ChangeLog
  69. DBD-mysql-4.013/Makefile.PL
  70. DBD-mysql-4.013/META.yml
  71. DBD-mysql-4.013/dbdimp.h
  72. DBD-mysql-4.013/eg/
  73. DBD-mysql-4.013/eg/prepare_memory_usage.pl
  74. DBD-mysql-4.013/eg/proc_example2b.pl
  75. DBD-mysql-4.013/eg/proc_example2.pl
  76. DBD-mysql-4.013/eg/decimal_test.pl
  77. DBD-mysql-4.013/eg/bug30033pg.pl
  78. DBD-mysql-4.013/eg/proc_example2a.pl
  79. DBD-mysql-4.013/eg/proc_example4.pl
  80. DBD-mysql-4.013/eg/bug21028.pl
  81. DBD-mysql-4.013/eg/bug14979.pl
  82. DBD-mysql-4.013/eg/bug30033.pl
  83. DBD-mysql-4.013/eg/issue21946.pl
  84. DBD-mysql-4.013/eg/proc_example3.pl
  85. DBD-mysql-4.013/eg/proc_example1.pl
  86. DBD-mysql-4.013/constants.h
  87. DBD-mysql-4.013/t/
  88. DBD-mysql-4.013/t/85init_command.t
  89. DBD-mysql-4.013/t/40listfields.t
  90. DBD-mysql-4.013/t/40bindparam.t
  91. DBD-mysql-4.013/t/mysql.mtest
  92. DBD-mysql-4.013/t/41bindparam.t
  93. DBD-mysql-4.013/t/76multi_statement.t
  94. DBD-mysql-4.013/t/40nulls.t
  95. DBD-mysql-4.013/t/32insert_error.t
  96. DBD-mysql-4.013/t/40catalog.t
  97. DBD-mysql-4.013/t/51bind_type_guessing.t
  98. DBD-mysql-4.013/t/40bindparam2.t
  99. DBD-mysql-4.013/t/41blobs_prepare.t
  100. DBD-mysql-4.013/t/20createdrop.t
  101. DBD-mysql-4.013/t/70takeimp.t
  102. DBD-mysql-4.013/t/42bindparam.t
  103. DBD-mysql-4.013/t/00base.t
  104. DBD-mysql-4.013/t/55utf8.t
  105. DBD-mysql-4.013/t/65types.t
  106. DBD-mysql-4.013/t/40server_prepare_error.t
  107. DBD-mysql-4.013/t/31insertid.t
  108. DBD-mysql-4.013/t/29warnings.t
  109. DBD-mysql-4.013/t/40types.t
  110. DBD-mysql-4.013/t/10connect.t
  111. DBD-mysql-4.013/t/lib.pl
  112. DBD-mysql-4.013/t/mysql.dbtest
  113. DBD-mysql-4.013/t/35limit.t
  114. DBD-mysql-4.013/t/71impdata.t
  115. DBD-mysql-4.013/t/40blobs.t
  116. DBD-mysql-4.013/t/40server_prepare.t
  117. DBD-mysql-4.013/t/40numrows.t
  118. DBD-mysql-4.013/t/35prepare.t
  119. DBD-mysql-4.013/t/40keyinfo.t
  120. DBD-mysql-4.013/t/75supported_sql.t
  121. DBD-mysql-4.013/t/60leaks.t
  122. DBD-mysql-4.013/t/50commit.t
  123. DBD-mysql-4.013/t/30insertfetch.t
  124. DBD-mysql-4.013/t/50chopblanks.t
  125. DBD-mysql-4.013/t/25lockunlock.t
  126. DBD-mysql-4.013/t/80procs.t
  127. DBD-mysql-4.013/MANIFEST
  128. CPAN: File::Temp loaded ok (v0.22)
  129.  
  130.   CPAN.pm: Going to build C/CA/CAPTTOFU/DBD-mysql-4.013.tar.gz
  131.  
  132.  
  133.  
  134. PLEASE NOTE:
  135.  
  136. For 'make test' to run properly, you must ensure that the
  137. database user 'root' can connect to your MySQL server
  138. and has the proper privileges that these tests require such
  139. as 'drop table', 'create table', 'drop procedure', 'create procedure'
  140. as well as others.
  141.  
  142. mysql> grant all privileges on test.* to 'root'@'localhost' identified by 's3kr1t';
  143.  
  144. You can also optionally set the user to run 'make test' with:
  145.  
  146. perl Makefile.pl --testuser=username
  147.  
  148. I will use the following settings for compiling and testing:
  149.  
  150.   cflags        (mysql_config) = -I/usr/include  -fno-omit-frame-pointer    -pipe   -D_P1003_1B_VISIBLE -DSIGNAL_WITH_VIO_CLOSE -DSIGNALS_DONT_BREAK_READ -DIGNORE_SIGHUP_SIGQUIT
  151.   embedded      (mysql_config) =
  152.   libs          (mysql_config) = -pipe  -L/usr/lib -lmysqlclient -lz -lm
  153.   mysql_config  (guessed     ) = mysql_config
  154.   nocatchstderr (default     ) = 0
  155.   nofoundrows   (default     ) = 0
  156.   ssl           (guessed     ) = 0
  157.   testdb        (default     ) = test
  158.   testhost      (default     ) =
  159.   testpassword  (default     ) =
  160.   testsocket    (default     ) =
  161.   testuser      (guessed     ) = root
  162.  
  163. To change these settings, see 'perl Makefile.PL --help' and
  164. 'perldoc INSTALL'.
  165.  
  166. Checking if your kit is complete...
  167. Looks good
  168. Unrecognized argument in LIBS ignored: '-pipe'
  169. Note (probably harmless): No library found for -lmysqlclient
  170. Multiple copies of Driver.xst found in: /Library/Perl/5.10.0/darwin-thread-multi-2level/auto/DBI/ /System/Library/Perl/Extras/5.10.0/darwin-thread-multi-2level/auto/DBI/ at Makefile.PL line 902
  171. Using DBI 1.609 (for perl 5.010000 on darwin-thread-multi-2level) installed in /Library/Perl/5.10.0/darwin-thread-multi-2level/auto/DBI/
  172. Writing Makefile for DBD::mysql
  173. cp lib/DBD/mysql.pm blib/lib/DBD/mysql.pm
  174. cp lib/DBD/mysql/GetInfo.pm blib/lib/DBD/mysql/GetInfo.pm
  175. cp lib/DBD/mysql/INSTALL.pod blib/lib/DBD/mysql/INSTALL.pod
  176. cp lib/Bundle/DBD/mysql.pm blib/lib/Bundle/DBD/mysql.pm
  177. gcc-4.2 -c  -I/Library/Perl/5.10.0/darwin-thread-multi-2level/auto/DBI -I/usr/include  -fno-omit-frame-pointer    -pipe   -D_P1003_1B_VISIBLE -DSIGNAL_WITH_VIO_CLOSE -DSIGNALS_DONT_BREAK_READ -DIGNORE_SIGHUP_SIGQUIT -DDBD_MYSQL_INSERT_ID_IS_GOOD -g  -arch x86_64 -arch i386 -arch ppc -g -pipe -fno-common -DPERL_DARWIN -fno-strict-aliasing -I/usr/local/include -Os   -DVERSION=\"4.013\" -DXS_VERSION=\"4.013\"  "-I/System/Library/Perl/5.10.0/darwin-thread-multi-2level/CORE"   dbdimp.c
  178. In file included from dbdimp.c:20:
  179. dbdimp.h:22:49: error: mysql.h: No such file or directory
  180. dbdimp.h:23:45: error: mysqld_error.h: No such file or directory
  181. dbdimp.h:25:49: error: errmsg.h: No such file or directory
  182. In file included from dbdimp.c:20:
  183. dbdimp.h:144: error: expected specifier-qualifier-list before ‘MYSQL’
  184. dbdimp.h:236: error: expected specifier-qualifier-list before ‘MYSQL_RES’
  185. In file included from dbdimp.c:20:
  186. dbdimp.h:293: error: expected ‘)’ before ‘*’ token
  187. dbdimp.h:296: error: expected ‘=’, ‘,’, ‘;’, ‘asm’ or ‘__attribute__’ before ‘mysql_st_internal_execute’
  188. dbdimp.h:328: error: expected ‘=’, ‘,’, ‘;’, ‘asm’ or ‘__attribute__’ before ‘*’ token
  189. dbdimp.c: In function ‘alloc_param’:
  190. dbdimp.c:113: warning: format not a string literal and no format arguments
  191. dbdimp.c: At top level:
  192. dbdimp.c:408: error: expected ‘)’ before ‘*’ token
  193. dbdimp.c:635: error: ‘FIELD_TYPE_VAR_STRING’ undeclared here (not in a function)
  194. dbdimp.c:645: error: ‘FIELD_TYPE_DECIMAL’ undeclared here (not in a function)
  195. dbdimp.c:655: error: ‘FIELD_TYPE_TINY’ undeclared here (not in a function)
  196. dbdimp.c:665: error: ‘FIELD_TYPE_SHORT’ undeclared here (not in a function)
  197. dbdimp.c:675: error: ‘FIELD_TYPE_LONG’ undeclared here (not in a function)
  198. dbdimp.c:685: error: ‘FIELD_TYPE_FLOAT’ undeclared here (not in a function)
  199. dbdimp.c:695: error: ‘FIELD_TYPE_DOUBLE’ undeclared here (not in a function)
  200. dbdimp.c:718: error: ‘FIELD_TYPE_TIMESTAMP’ undeclared here (not in a function)
  201. dbdimp.c:728: error: ‘FIELD_TYPE_LONGLONG’ undeclared here (not in a function)
  202. dbdimp.c:738: error: ‘FIELD_TYPE_INT24’ undeclared here (not in a function)
  203. dbdimp.c:748: error: ‘FIELD_TYPE_DATE’ undeclared here (not in a function)
  204. dbdimp.c:758: error: ‘FIELD_TYPE_TIME’ undeclared here (not in a function)
  205. dbdimp.c:768: error: ‘FIELD_TYPE_DATETIME’ undeclared here (not in a function)
  206. dbdimp.c:778: error: ‘FIELD_TYPE_YEAR’ undeclared here (not in a function)
  207. dbdimp.c:788: error: ‘FIELD_TYPE_NEWDATE’ undeclared here (not in a function)
  208. dbdimp.c:798: error: ‘FIELD_TYPE_ENUM’ undeclared here (not in a function)
  209. dbdimp.c:808: error: ‘FIELD_TYPE_SET’ undeclared here (not in a function)
  210. dbdimp.c:818: error: ‘FIELD_TYPE_BLOB’ undeclared here (not in a function)
  211. dbdimp.c:828: error: ‘FIELD_TYPE_TINY_BLOB’ undeclared here (not in a function)
  212. dbdimp.c:838: error: ‘FIELD_TYPE_MEDIUM_BLOB’ undeclared here (not in a function)
  213. dbdimp.c:848: error: ‘FIELD_TYPE_LONG_BLOB’ undeclared here (not in a function)
  214. dbdimp.c:858: error: ‘FIELD_TYPE_STRING’ undeclared here (not in a function)
  215. dbdimp.c:1325: error: expected ‘=’, ‘,’, ‘;’, ‘asm’ or ‘__attribute__’ before ‘*’ token
  216. dbdimp.c: In function ‘my_login’:
  217. dbdimp.c:1795: error: ‘imp_dbh_t’ has no member named ‘pmysql’
  218. dbdimp.c:1796: error: ‘imp_dbh_t’ has no member named ‘pmysql’
  219. dbdimp.c:1796: error: ‘MYSQL’ undeclared (first use in this function)
  220. dbdimp.c:1796: error: (Each undeclared identifier is reported only once
  221. dbdimp.c:1796: error: for each function it appears in.)
  222. dbdimp.c:1796: warning: comparison between pointer and integer
  223. dbdimp.c:1796: error: invalid operands to binary / (have ‘long unsigned int’ and ‘const struct sql_type_info_t *’)
  224. dbdimp.c:1796: error: invalid operands to binary > (have ‘double’ and ‘const struct sql_type_info_t *’)
  225. dbdimp.c:1796: warning: format not a string literal and no format arguments
  226. dbdimp.c:1796: error: expected expression before ‘)’ token
  227. dbdimp.c:1796: error: invalid operands to binary * (have ‘const struct sql_type_info_t *’ and ‘const struct sql_type_info_t *’)
  228. dbdimp.c:1798: error: ‘imp_dbh_t’ has no member named ‘pmysql’
  229. dbdimp.c: In function ‘mysql_db_login’:
  230. dbdimp.c:1835: error: ‘imp_dbh_t’ has no member named ‘stats’
  231. dbdimp.c:1835: error: request for member ‘auto_reconnects_ok’ in something not a structure or union
  232. dbdimp.c:1836: error: ‘imp_dbh_t’ has no member named ‘stats’
  233. dbdimp.c:1836: error: request for member ‘auto_reconnects_failed’ in something not a structure or union
  234. dbdimp.c:1837: error: ‘imp_dbh_t’ has no member named ‘bind_type_guessing’
  235. dbdimp.c:1838: error: ‘imp_dbh_t’ has no member named ‘has_transactions’
  236. dbdimp.c:1840: error: ‘imp_dbh_t’ has no member named ‘auto_reconnect’
  237. dbdimp.c:1849: error: ‘imp_dbh_t’ has no member named ‘pmysql’
  238. dbdimp.c:1850: error: ‘imp_dbh_t’ has no member named ‘pmysql’
  239. dbdimp.c:1850: warning: passing argument 3 of ‘mysql_dr_error’ makes pointer from integer without a cast
  240. dbdimp.c: In function ‘mysql_db_commit’:
  241. dbdimp.c:1887: error: ‘imp_dbh_t’ has no member named ‘has_transactions’
  242. dbdimp.c:1890: error: ‘imp_dbh_t’ has no member named ‘pmysql’
  243. dbdimp.c:1895: error: ‘imp_dbh_t’ has no member named ‘pmysql’
  244. dbdimp.c:1895: error: ‘imp_dbh_t’ has no member named ‘pmysql’
  245. dbdimp.c:1896: warning: passing argument 3 of ‘mysql_dr_error’ makes pointer from integer without a cast
  246. dbdimp.c: In function ‘mysql_db_rollback’:
  247. dbdimp.c:1915: error: ‘imp_dbh_t’ has no member named ‘has_transactions’
  248. dbdimp.c:1918: error: ‘imp_dbh_t’ has no member named ‘pmysql’
  249. dbdimp.c:1923: error: ‘imp_dbh_t’ has no member named ‘pmysql’
  250. dbdimp.c:1924: error: ‘imp_dbh_t’ has no member named ‘pmysql’
  251. dbdimp.c:1924: warning: passing argument 3 of ‘mysql_dr_error’ makes pointer from integer without a cast
  252. dbdimp.c: In function ‘mysql_db_disconnect’:
  253. dbdimp.c:1961: error: ‘imp_dbh_t’ has no member named ‘pmysql’
  254. dbdimp.c:1962: error: ‘imp_dbh_t’ has no member named ‘pmysql’
  255. dbdimp.c: In function ‘mysql_db_destroy’:
  256. dbdimp.c:2049: error: ‘imp_dbh_t’ has no member named ‘has_transactions’
  257. dbdimp.c:2053: error: ‘imp_dbh_t’ has no member named ‘pmysql’
  258. dbdimp.c:2061: error: ‘imp_dbh_t’ has no member named ‘pmysql’
  259. dbdimp.c: In function ‘mysql_db_STORE_attrib’:
  260. dbdimp.c:2099: error: ‘imp_dbh_t’ has no member named ‘has_transactions’
  261. dbdimp.c:2121: error: ‘imp_dbh_t’ has no member named ‘no_autocommit_cmd’
  262. dbdimp.c:2126: error: ‘imp_dbh_t’ has no member named ‘pmysql’
  263. dbdimp.c:2134: error: ‘imp_dbh_t’ has no member named ‘pmysql’
  264. dbdimp.c:2159: error: ‘imp_dbh_t’ has no member named ‘use_mysql_use_result’
  265. dbdimp.c:2161: error: ‘imp_dbh_t’ has no member named ‘auto_reconnect’
  266. dbdimp.c:2163: error: ‘imp_dbh_t’ has no member named ‘use_server_side_prepare’
  267. dbdimp.c:2165: error: ‘imp_dbh_t’ has no member named ‘no_autocommit_cmd’
  268. dbdimp.c:2167: error: ‘imp_dbh_t’ has no member named ‘bind_type_guessing’
  269. dbdimp.c: At top level:
  270. dbdimp.c:2196: error: expected ‘)’ before ‘val’
  271. dbdimp.c: In function ‘mysql_db_FETCH_attrib’:
  272. dbdimp.c:2225: error: ‘imp_dbh_t’ has no member named ‘has_transactions’
  273. dbdimp.c:2242: error: ‘imp_dbh_t’ has no member named ‘auto_reconnect’
  274. dbdimp.c:2242: warning: passing argument 2 of ‘Perl_newSViv’ makes integer from pointer without a cast
  275. dbdimp.c:2247: error: ‘imp_dbh_t’ has no member named ‘bind_type_guessing’
  276. dbdimp.c:2247: warning: passing argument 2 of ‘Perl_newSViv’ makes integer from pointer without a cast
  277. dbdimp.c:2251: error: ‘imp_dbh_t’ has no member named ‘pmysql’
  278. dbdimp.c:2255: error: ‘imp_dbh_t’ has no member named ‘pmysql’
  279. dbdimp.c:2255: warning: initialization makes pointer from integer without a cast
  280. dbdimp.c:2269: error: ‘imp_dbh_t’ has no member named ‘stats’
  281. dbdimp.c:2269: error: request for member ‘auto_reconnects_ok’ in something not a structure or union
  282. dbdimp.c:2269: warning: passing argument 2 of ‘Perl_newSViv’ makes integer from pointer without a cast
  283. dbdimp.c:2276: error: ‘imp_dbh_t’ has no member named ‘stats’
  284. dbdimp.c:2276: error: request for member ‘auto_reconnects_failed’ in something not a structure or union
  285. dbdimp.c:2276: warning: passing argument 2 of ‘Perl_newSViv’ makes integer from pointer without a cast
  286. dbdimp.c:2290: error: ‘imp_dbh_t’ has no member named ‘pmysql’
  287. dbdimp.c:2290: warning: initialization makes pointer from integer without a cast
  288. dbdimp.c:2299: error: ‘imp_dbh_t’ has no member named ‘pmysql’
  289. dbdimp.c:2299: warning: initialization makes pointer from integer without a cast
  290. dbdimp.c:2304: error: ‘imp_dbh_t’ has no member named ‘pmysql’
  291. dbdimp.c:2304: warning: passing argument 2 of ‘Perl_sv_2mortal’ makes pointer from integer without a cast
  292. dbdimp.c:2309: error: ‘imp_dbh_t’ has no member named ‘no_autocommit_cmd’
  293. dbdimp.c:2309: warning: passing argument 2 of ‘Perl_newSViv’ makes integer from pointer without a cast
  294. dbdimp.c:2314: error: ‘imp_dbh_t’ has no member named ‘pmysql’
  295. dbdimp.c:2320: error: ‘imp_dbh_t’ has no member named ‘pmysql’
  296. dbdimp.c:2320: warning: initialization makes pointer from integer without a cast
  297. dbdimp.c:2325: error: ‘imp_dbh_t’ has no member named ‘pmysql’
  298. dbdimp.c:2327: error: ‘imp_dbh_t’ has no member named ‘pmysql’
  299. dbdimp.c:2327: error: ‘sql_type_info_t’ has no member named ‘net’
  300. dbdimp.c:2327: error: request for member ‘fd’ in something not a structure or union
  301. dbdimp.c:2330: error: ‘imp_dbh_t’ has no member named ‘pmysql’
  302. dbdimp.c:2330: warning: initialization makes pointer from integer without a cast
  303. dbdimp.c:2337: error: ‘imp_dbh_t’ has no member named ‘pmysql’
  304. dbdimp.c:2337: warning: initialization makes pointer from integer without a cast
  305. dbdimp.c:2342: error: ‘imp_dbh_t’ has no member named ‘use_server_side_prepare’
  306. dbdimp.c:2347: error: ‘imp_dbh_t’ has no member named ‘pmysql’
  307. dbdimp.c: In function ‘mysql_st_prepare’:
  308. dbdimp.c:2396: error: ‘MYSQL_VERSION_ID’ undeclared (first use in this function)
  309. dbdimp.c:2396: warning: format ‘%d’ expects type ‘int’, but argument 3 has type ‘const struct sql_type_info_t *’
  310. dbdimp.c:2411: error: ‘imp_sth_t’ has no member named ‘done_desc’
  311. dbdimp.c:2412: error: ‘imp_sth_t’ has no member named ‘result’
  312. dbdimp.c:2413: error: ‘imp_sth_t’ has no member named ‘currow’
  313. dbdimp.c:2417: error: ‘imp_sth_t’ has no member named ‘use_mysql_use_result’
  314. dbdimp.c:2418: error: ‘imp_dbh_t’ has no member named ‘use_mysql_use_result’
  315. dbdimp.c:2418: warning: pointer/integer type mismatch in conditional expression
  316. dbdimp.c:2421: error: ‘imp_sth_t’ has no member named ‘av_attr’
  317. dbdimp.c:2421: error: assignment of read-only location
  318. dbdimp.c:2610: error: ‘imp_sth_t’ has no member named ‘params’
  319. dbdimp.c: In function ‘mysql_st_free_result_sets’:
  320. dbdimp.c:2680: error: ‘imp_sth_t’ has no member named ‘result’
  321. dbdimp.c:2682: error: ‘imp_sth_t’ has no member named ‘result’
  322. dbdimp.c:2683: error: ‘imp_sth_t’ has no member named ‘result’
  323. dbdimp.c: At top level:
  324. dbdimp.c:2847: error: expected ‘=’, ‘,’, ‘;’, ‘asm’ or ‘__attribute__’ before ‘mysql_st_internal_execute’
  325. dbdimp.c: In function ‘mysql_st_execute’:
  326. dbdimp.c:3148: error: ‘imp_sth_t’ has no member named ‘av_attr’
  327. dbdimp.c:3148: error: used struct type value where scalar is required
  328. dbdimp.c:3149: error: ‘imp_sth_t’ has no member named ‘av_attr’
  329. dbdimp.c:3149: error: cannot convert to a pointer type
  330. dbdimp.c:3151: error: ‘imp_sth_t’ has no member named ‘av_attr’
  331. dbdimp.c:3151: error: assignment of read-only location
  332. dbdimp.c:3184: error: ‘imp_sth_t’ has no member named ‘row_num’
  333. dbdimp.c:3189: error: ‘imp_sth_t’ has no member named ‘params’
  334. dbdimp.c:3190: error: ‘imp_sth_t’ has no member named ‘result’
  335. dbdimp.c:3191: error: ‘imp_dbh_t’ has no member named ‘pmysql’
  336. dbdimp.c:3192: error: ‘imp_sth_t’ has no member named ‘use_mysql_use_result’
  337. dbdimp.c:3195: error: ‘imp_sth_t’ has no member named ‘row_num’
  338. dbdimp.c:3195: error: ‘my_ulonglong’ undeclared (first use in this function)
  339. dbdimp.c:3197: error: ‘imp_sth_t’ has no member named ‘result’
  340. dbdimp.c:3199: error: ‘imp_sth_t’ has no member named ‘insertid’
  341. dbdimp.c:3199: error: ‘imp_dbh_t’ has no member named ‘pmysql’
  342. dbdimp.c:3208: error: ‘imp_sth_t’ has no member named ‘result’
  343. dbdimp.c:3210: error: ‘imp_sth_t’ has no member named ‘done_desc’
  344. dbdimp.c:3211: error: ‘imp_sth_t’ has no member named ‘fetch_done’
  345. dbdimp.c:3215: error: ‘imp_sth_t’ has no member named ‘warning_count’
  346. dbdimp.c:3223: error: ‘imp_sth_t’ has no member named ‘row_num’
  347. dbdimp.c:3223: warning: format ‘%llu’ expects type ‘long long unsigned int’, but argument 5 has type ‘const struct sql_type_info_t *’
  348. dbdimp.c:3229: error: ‘imp_sth_t’ has no member named ‘row_num’
  349. dbdimp.c:3229: warning: cast from pointer to integer of different size
  350. dbdimp.c: In function ‘mysql_describe’:
  351. dbdimp.c:3351: error: ‘imp_sth_t’ has no member named ‘done_desc’
  352. dbdimp.c: In function ‘mysql_st_fetch’:
  353. dbdimp.c:3379: error: ‘MYSQL_ROW’ undeclared (first use in this function)
  354. dbdimp.c:3379: error: expected ‘;’ before ‘cols’
  355. dbdimp.c:3381: error: ‘MYSQL’ undeclared (first use in this function)
  356. dbdimp.c:3381: error: ‘svsock’ undeclared (first use in this function)
  357. dbdimp.c:3381: error: invalid operands to binary * (have ‘const struct sql_type_info_t *’ and ‘const struct sql_type_info_t *’)
  358. dbdimp.c:3381: error: ‘imp_dbh_t’ has no member named ‘pmysql’
  359. dbdimp.c:3387: error: ‘MYSQL_FIELD’ undeclared (first use in this function)
  360. dbdimp.c:3387: error: ‘fields’ undeclared (first use in this function)
  361. dbdimp.c:3387: error: invalid operands to binary * (have ‘const struct sql_type_info_t *’ and ‘const struct sql_type_info_t *’)
  362. dbdimp.c:3425: error: ‘imp_sth_t’ has no member named ‘result’
  363. dbdimp.c:3432: error: ‘imp_dbh_t’ has no member named ‘pmysql’
  364. dbdimp.c:3432: error: ‘sql_type_info_t’ has no member named ‘net’
  365. dbdimp.c:3432: error: request for member ‘last_errno’ in something not a structure or union
  366. dbdimp.c:3563: error: ‘imp_sth_t’ has no member named ‘currow’
  367. dbdimp.c:3563: error: lvalue required as increment operand
  368. dbdimp.c:3563: error: lvalue required as increment operand
  369. dbdimp.c:3568: error: ‘imp_sth_t’ has no member named ‘result’
  370. dbdimp.c:3568: warning: format ‘%08lx’ expects type ‘long unsigned int’, but argument 3 has type ‘const struct sql_type_info_t *’
  371. dbdimp.c:3570: error: ‘imp_sth_t’ has no member named ‘result’
  372. dbdimp.c:3570: warning: format ‘%llu’ expects type ‘long long unsigned int’, but argument 3 has type ‘int’
  373. dbdimp.c:3572: error: ‘imp_sth_t’ has no member named ‘result’
  374. dbdimp.c:3572: warning: format ‘%llu’ expects type ‘long long unsigned int’, but argument 3 has type ‘int’
  375. dbdimp.c:3574: error: ‘imp_dbh_t’ has no member named ‘pmysql’
  376. dbdimp.c:3574: warning: format ‘%llu’ expects type ‘long long unsigned int’, but argument 3 has type ‘int’
  377. dbdimp.c:3576: error: ‘imp_sth_t’ has no member named ‘currow’
  378. dbdimp.c:3576: warning: format ‘%d’ expects type ‘int’, but argument 4 has type ‘const struct sql_type_info_t *’
  379. dbdimp.c:3579: error: ‘cols’ undeclared (first use in this function)
  380. dbdimp.c:3579: error: ‘imp_sth_t’ has no member named ‘result’
  381. dbdimp.c:3585: error: ‘imp_dbh_t’ has no member named ‘pmysql’
  382. dbdimp.c:3586: error: ‘imp_dbh_t’ has no member named ‘pmysql’
  383. dbdimp.c:3587: error: ‘imp_dbh_t’ has no member named ‘pmysql’
  384. dbdimp.c:3588: warning: passing argument 3 of ‘mysql_dr_error’ makes pointer from integer without a cast
  385. dbdimp.c:3598: error: ‘imp_sth_t’ has no member named ‘result’
  386. dbdimp.c:3599: error: ‘imp_sth_t’ has no member named ‘result’
  387. dbdimp.c:3600: error: ‘imp_sth_t’ has no member named ‘result’
  388. dbdimp.c:3600: warning: assignment makes pointer from integer without a cast
  389. dbdimp.c:3640: error: incompatible types in initialization
  390. dbdimp.c: In function ‘mysql_st_destroy’:
  391. dbdimp.c:3828: error: ‘imp_sth_t’ has no member named ‘params’
  392. dbdimp.c:3830: error: ‘imp_sth_t’ has no member named ‘params’
  393. dbdimp.c:3830: warning: passing argument 1 of ‘free_param’ from incompatible pointer type
  394. dbdimp.c:3831: error: ‘imp_sth_t’ has no member named ‘params’
  395. dbdimp.c:3837: error: ‘imp_sth_t’ has no member named ‘av_attr’
  396. dbdimp.c:3837: error: used struct type value where scalar is required
  397. dbdimp.c:3838: error: ‘imp_sth_t’ has no member named ‘av_attr’
  398. dbdimp.c:3838: error: cannot convert to a pointer type
  399. dbdimp.c:3839: error: ‘imp_sth_t’ has no member named ‘av_attr’
  400. dbdimp.c:3839: error: assignment of read-only location
  401. dbdimp.c: In function ‘mysql_st_STORE_attrib’:
  402. dbdimp.c:3883: error: ‘imp_sth_t’ has no member named ‘use_mysql_use_result’
  403. dbdimp.c: At top level:
  404. dbdimp.c:3931: error: expected declaration specifiers or ‘...’ before ‘MYSQL_RES’
  405. dbdimp.c: In function ‘mysql_st_FETCH_internal’:
  406. dbdimp.c:3937: error: ‘MYSQL_FIELD’ undeclared (first use in this function)
  407. dbdimp.c:3937: error: ‘curField’ undeclared (first use in this function)
  408. dbdimp.c:3937: error: invalid operands to binary * (have ‘const struct sql_type_info_t *’ and ‘const struct sql_type_info_t *’)
  409. dbdimp.c:3944: error: ‘imp_sth_t’ has no member named ‘av_attr’
  410. dbdimp.c:3944: error: invalid operands to binary && (have ‘int’ and ‘struct sql_type_info_s’)
  411. dbdimp.c:3945: error: ‘imp_sth_t’ has no member named ‘av_attr’
  412. dbdimp.c:3945: error: incompatible types in assignment
  413. dbdimp.c:3948: error: ‘res’ undeclared (first use in this function)
  414. dbdimp.c:3962: error: ‘sql_type_info_t’ has no member named ‘name’
  415. dbdimp.c:3962: error: ‘sql_type_info_t’ has no member named ‘name’
  416. dbdimp.c:3962: warning: passing argument 1 of ‘strlen’ from incompatible pointer type
  417. dbdimp.c:3962: warning: passing argument 2 of ‘Perl_newSVpv’ from incompatible pointer type
  418. dbdimp.c:3966: error: ‘sql_type_info_t’ has no member named ‘table’
  419. dbdimp.c:3966: error: ‘sql_type_info_t’ has no member named ‘table’
  420. dbdimp.c:3966: warning: passing argument 1 of ‘strlen’ from incompatible pointer type
  421. dbdimp.c:3966: warning: passing argument 2 of ‘Perl_newSVpv’ from incompatible pointer type
  422. dbdimp.c:3970: error: ‘sql_type_info_t’ has no member named ‘type’
  423. dbdimp.c:3970: warning: cast from pointer to integer of different size
  424. dbdimp.c:3974: error: ‘sql_type_info_t’ has no member named ‘type’
  425. dbdimp.c:3974: warning: passing argument 1 of ‘native2sql’ makes integer from pointer without a cast
  426. dbdimp.c:3977: error: ‘sql_type_info_t’ has no member named ‘flags’
  427. dbdimp.c:3981: error: ‘sql_type_info_t’ has no member named ‘flags’
  428. dbdimp.c:3985: error: ‘sql_type_info_t’ has no member named ‘flags’
  429. dbdimp.c:3989: error: ‘sql_type_info_t’ has no member named ‘length’
  430. dbdimp.c:3989: warning: cast from pointer to integer of different size
  431. dbdimp.c:3993: error: ‘sql_type_info_t’ has no member named ‘type’
  432. dbdimp.c:3993: warning: passing argument 1 of ‘native2sql’ makes integer from pointer without a cast
  433. dbdimp.c:3997: error: ‘sql_type_info_t’ has no member named ‘type’
  434. dbdimp.c:3997: warning: passing argument 1 of ‘native2sql’ makes integer from pointer without a cast
  435. dbdimp.c:4001: error: ‘sql_type_info_t’ has no member named ‘max_length’
  436. dbdimp.c:4001: warning: cast from pointer to integer of different size
  437. dbdimp.c:4013: error: ‘sql_type_info_t’ has no member named ‘flags’
  438. dbdimp.c:4013: error: ‘PRI_KEY_FLAG’ undeclared (first use in this function)
  439. dbdimp.c:4013: error: ‘UNIQUE_KEY_FLAG’ undeclared (first use in this function)
  440. dbdimp.c:4013: error: invalid operands to binary | (have ‘const struct sql_type_info_t *’ and ‘const struct sql_type_info_t *’)
  441. dbdimp.c:4013: error: ‘MULTIPLE_KEY_FLAG’ undeclared (first use in this function)
  442. dbdimp.c:4013: error: invalid operands to binary | (have ‘const struct sql_type_info_t *’ and ‘const struct sql_type_info_t *’)
  443. dbdimp.c:4013: error: invalid operands to binary & (have ‘const struct sql_type_info_t *’ and ‘const struct sql_type_info_t *’)
  444. dbdimp.c:4017: error: ‘sql_type_info_t’ has no member named ‘flags’
  445. dbdimp.c:4021: error: ‘sql_type_info_t’ has no member named ‘decimals’
  446. dbdimp.c:4021: warning: cast from pointer to integer of different size
  447. dbdimp.c:4025: error: ‘sql_type_info_t’ has no member named ‘length’
  448. dbdimp.c:4025: error: ‘sql_type_info_t’ has no member named ‘max_length’
  449. dbdimp.c:4025: error: ‘sql_type_info_t’ has no member named ‘length’
  450. dbdimp.c:4025: error: ‘sql_type_info_t’ has no member named ‘max_length’
  451. dbdimp.c:4025: warning: passing argument 2 of ‘Perl_newSViv’ makes integer from pointer without a cast
  452. dbdimp.c:4040: error: ‘imp_sth_t’ has no member named ‘av_attr’
  453. dbdimp.c:4040: error: assignment of read-only location
  454. dbdimp.c: In function ‘mysql_st_FETCH_attrib’:
  455. dbdimp.c:4091: error: ‘imp_sth_t’ has no member named ‘result’
  456. dbdimp.c:4091: warning: passing argument 3 of ‘mysql_st_FETCH_internal’ makes integer from pointer without a cast
  457. dbdimp.c:4091: error: too many arguments to function ‘mysql_st_FETCH_internal’
  458. dbdimp.c:4093: error: ‘imp_sth_t’ has no member named ‘result’
  459. dbdimp.c:4093: warning: passing argument 3 of ‘mysql_st_FETCH_internal’ makes integer from pointer without a cast
  460. dbdimp.c:4093: error: too many arguments to function ‘mysql_st_FETCH_internal’
  461. dbdimp.c:4097: error: ‘imp_sth_t’ has no member named ‘result’
  462. dbdimp.c:4097: warning: passing argument 3 of ‘mysql_st_FETCH_internal’ makes integer from pointer without a cast
  463. dbdimp.c:4097: error: too many arguments to function ‘mysql_st_FETCH_internal’
  464. dbdimp.c:4109: error: ‘imp_sth_t’ has no member named ‘params’
  465. dbdimp.c:4109: error: ‘struct sql_type_info_s’ has no member named ‘value’
  466. dbdimp.c:4109: warning: passing argument 2 of ‘Perl_newSVsv’ from incompatible pointer type
  467. dbdimp.c:4118: error: ‘imp_sth_t’ has no member named ‘result’
  468. dbdimp.c:4118: warning: passing argument 3 of ‘mysql_st_FETCH_internal’ makes integer from pointer without a cast
  469. dbdimp.c:4118: error: too many arguments to function ‘mysql_st_FETCH_internal’
  470. dbdimp.c:4122: error: ‘imp_sth_t’ has no member named ‘result’
  471. dbdimp.c:4122: warning: passing argument 3 of ‘mysql_st_FETCH_internal’ makes integer from pointer without a cast
  472. dbdimp.c:4122: error: too many arguments to function ‘mysql_st_FETCH_internal’
  473. dbdimp.c:4128: error: ‘imp_sth_t’ has no member named ‘result’
  474. dbdimp.c:4128: warning: passing argument 3 of ‘mysql_st_FETCH_internal’ makes integer from pointer without a cast
  475. dbdimp.c:4128: error: too many arguments to function ‘mysql_st_FETCH_internal’
  476. dbdimp.c:4132: error: ‘imp_sth_t’ has no member named ‘result’
  477. dbdimp.c:4132: warning: passing argument 3 of ‘mysql_st_FETCH_internal’ makes integer from pointer without a cast
  478. dbdimp.c:4132: error: too many arguments to function ‘mysql_st_FETCH_internal’
  479. dbdimp.c:4136: error: ‘imp_sth_t’ has no member named ‘result’
  480. dbdimp.c:4136: warning: passing argument 3 of ‘mysql_st_FETCH_internal’ makes integer from pointer without a cast
  481. dbdimp.c:4136: error: too many arguments to function ‘mysql_st_FETCH_internal’
  482. dbdimp.c:4138: error: ‘imp_sth_t’ has no member named ‘result’
  483. dbdimp.c:4138: warning: passing argument 3 of ‘mysql_st_FETCH_internal’ makes integer from pointer without a cast
  484. dbdimp.c:4138: error: too many arguments to function ‘mysql_st_FETCH_internal’
  485. dbdimp.c:4140: error: ‘imp_sth_t’ has no member named ‘result’
  486. dbdimp.c:4140: warning: passing argument 3 of ‘mysql_st_FETCH_internal’ makes integer from pointer without a cast
  487. dbdimp.c:4140: error: too many arguments to function ‘mysql_st_FETCH_internal’
  488. dbdimp.c:4142: error: ‘imp_sth_t’ has no member named ‘result’
  489. dbdimp.c:4146: error: ‘imp_sth_t’ has no member named ‘result’
  490. dbdimp.c:4146: warning: passing argument 3 of ‘mysql_st_FETCH_internal’ makes integer from pointer without a cast
  491. dbdimp.c:4146: error: too many arguments to function ‘mysql_st_FETCH_internal’
  492. dbdimp.c:4153: error: ‘imp_sth_t’ has no member named ‘insertid’
  493. dbdimp.c:4153: warning: format ‘%d’ expects type ‘int’, but argument 3 has type ‘const struct sql_type_info_t *’
  494. dbdimp.c:4155: error: ‘imp_sth_t’ has no member named ‘insertid’
  495. dbdimp.c:4155: warning: passing argument 2 of ‘Perl_sv_2mortal’ makes pointer from integer without a cast
  496. dbdimp.c:4160: error: ‘imp_sth_t’ has no member named ‘result’
  497. dbdimp.c:4160: warning: passing argument 3 of ‘mysql_st_FETCH_internal’ makes integer from pointer without a cast
  498. dbdimp.c:4160: error: too many arguments to function ‘mysql_st_FETCH_internal’
  499. dbdimp.c:4164: error: ‘imp_sth_t’ has no member named ‘result’
  500. dbdimp.c:4164: warning: passing argument 3 of ‘mysql_st_FETCH_internal’ makes integer from pointer without a cast
  501. dbdimp.c:4164: error: too many arguments to function ‘mysql_st_FETCH_internal’
  502. dbdimp.c:4166: error: ‘imp_sth_t’ has no member named ‘result’
  503. dbdimp.c:4166: warning: passing argument 3 of ‘mysql_st_FETCH_internal’ makes integer from pointer without a cast
  504. dbdimp.c:4166: error: too many arguments to function ‘mysql_st_FETCH_internal’
  505. dbdimp.c:4168: error: ‘imp_sth_t’ has no member named ‘use_mysql_use_result’
  506. dbdimp.c:4172: error: ‘imp_sth_t’ has no member named ‘warning_count’
  507. dbdimp.c:4184: error: ‘imp_sth_t’ has no member named ‘result’
  508. dbdimp.c:4184: warning: passing argument 3 of ‘mysql_st_FETCH_internal’ makes integer from pointer without a cast
  509. dbdimp.c:4184: error: too many arguments to function ‘mysql_st_FETCH_internal’
  510. dbdimp.c: In function ‘mysql_bind_ph’:
  511. dbdimp.c:4308: error: ‘imp_sth_t’ has no member named ‘params’
  512. dbdimp.c:4308: warning: passing argument 1 of ‘bind_param’ from incompatible pointer type
  513. dbdimp.c: In function ‘mysql_db_reconnect’:
  514. dbdimp.c:4430: error: ‘MYSQL’ undeclared (first use in this function)
  515. dbdimp.c:4430: error: expected ‘;’ before ‘save_socket’
  516. dbdimp.c:4440: error: ‘imp_dbh_t’ has no member named ‘pmysql’
  517. dbdimp.c:4440: error: ‘CR_SERVER_GONE_ERROR’ undeclared (first use in this function)
  518. dbdimp.c:4440: warning: comparison between pointer and integer
  519. dbdimp.c:4444: error: ‘imp_dbh_t’ has no member named ‘auto_reconnect’
  520. dbdimp.c:4458: error: ‘save_socket’ undeclared (first use in this function)
  521. dbdimp.c:4458: error: ‘imp_dbh_t’ has no member named ‘pmysql’
  522. dbdimp.c:4459: error: ‘imp_dbh_t’ has no member named ‘pmysql’
  523. dbdimp.c:4459: warning: passing argument 3 of ‘__builtin___memcpy_chk’ makes integer from pointer without a cast
  524. dbdimp.c:4459: error: ‘imp_dbh_t’ has no member named ‘pmysql’
  525. dbdimp.c:4459: warning: passing argument 3 of ‘__inline_memcpy_chk’ makes integer from pointer without a cast
  526. dbdimp.c:4460: error: ‘imp_dbh_t’ has no member named ‘pmysql’
  527. dbdimp.c:4460: error: ‘imp_dbh_t’ has no member named ‘pmysql’
  528. dbdimp.c:4460: error: ‘imp_dbh_t’ has no member named ‘pmysql’
  529. dbdimp.c:4460: error: ‘imp_dbh_t’ has no member named ‘pmysql’
  530. dbdimp.c:4460: warning: passing argument 1 of ‘__builtin___memset_chk’ discards qualifiers from pointer target type
  531. dbdimp.c:4460: error: ‘imp_dbh_t’ has no member named ‘pmysql’
  532. dbdimp.c:4460: error: ‘imp_dbh_t’ has no member named ‘pmysql’
  533. dbdimp.c:4460: warning: passing argument 1 of ‘__inline_memset_chk’ discards qualifiers from pointer target type
  534. dbdimp.c:4468: error: ‘imp_dbh_t’ has no member named ‘pmysql’
  535. dbdimp.c:4468: error: ‘imp_dbh_t’ has no member named ‘pmysql’
  536. dbdimp.c:4469: warning: passing argument 3 of ‘mysql_dr_error’ makes pointer from integer without a cast
  537. dbdimp.c:4470: error: ‘imp_dbh_t’ has no member named ‘pmysql’
  538. dbdimp.c:4470: error: ‘imp_dbh_t’ has no member named ‘pmysql’
  539. dbdimp.c:4470: error: ‘imp_dbh_t’ has no member named ‘pmysql’
  540. dbdimp.c:4470: warning: passing argument 1 of ‘__builtin___memcpy_chk’ discards qualifiers from pointer target type
  541. dbdimp.c:4470: warning: passing argument 3 of ‘__builtin___memcpy_chk’ makes integer from pointer without a cast
  542. dbdimp.c:4470: error: ‘imp_dbh_t’ has no member named ‘pmysql’
  543. dbdimp.c:4470: warning: passing argument 1 of ‘__inline_memcpy_chk’ discards qualifiers from pointer target type
  544. dbdimp.c:4470: warning: passing argument 3 of ‘__inline_memcpy_chk’ makes integer from pointer without a cast
  545. dbdimp.c:4471: error: ‘imp_dbh_t’ has no member named ‘stats’
  546. dbdimp.c:4471: error: request for member ‘auto_reconnects_failed’ in something not a structure or union
  547. dbdimp.c:4471: error: lvalue required as increment operand
  548. dbdimp.c:4471: error: lvalue required as increment operand
  549. dbdimp.c:4480: error: ‘imp_dbh_t’ has no member named ‘stats’
  550. dbdimp.c:4480: error: request for member ‘auto_reconnects_ok’ in something not a structure or union
  551. dbdimp.c:4480: error: lvalue required as increment operand
  552. dbdimp.c:4480: error: lvalue required as increment operand
  553. dbdimp.c: In function ‘mysql_db_quote’:
  554. dbdimp.c:4640: error: ‘imp_dbh_t’ has no member named ‘pmysql’
  555. dbdimp.c: In function ‘mysql_db_last_insert_id’:
  556. dbdimp.c:4663: error: ‘imp_dbh_t’ has no member named ‘pmysql’
  557. dbdimp.c:4663: warning: passing argument 2 of ‘Perl_sv_2mortal’ makes pointer from integer without a cast
  558. In file included from dbdimp.c:20:
  559. dbdimp.h:22:49: error: mysql.h: No such file or directory
  560. dbdimp.h:23:45: error: mysqld_error.h: No such file or directory
  561. dbdimp.h:25:49: error: errmsg.h: No such file or directory
  562. In file included from dbdimp.c:20:
  563. dbdimp.h:144: error: expected specifier-qualifier-list before ‘MYSQL’
  564. dbdimp.h:236: error: expected specifier-qualifier-list before ‘MYSQL_RES’
  565. In file included from dbdimp.c:20:
  566. dbdimp.h:293: error: expected ‘)’ before ‘*’ token
  567. dbdimp.h:296: error: expected ‘=’, ‘,’, ‘;’, ‘asm’ or ‘__attribute__’ before ‘mysql_st_internal_execute’
  568. dbdimp.h:328: error: expected ‘=’, ‘,’, ‘;’, ‘asm’ or ‘__attribute__’ before ‘*’ token
  569. dbdimp.c: In function ‘alloc_param’:
  570. dbdimp.c:113: warning: format not a string literal and no format arguments
  571. dbdimp.c: At top level:
  572. dbdimp.c:408: error: expected ‘)’ before ‘*’ token
  573. dbdimp.c:635: error: ‘FIELD_TYPE_VAR_STRING’ undeclared here (not in a function)
  574. dbdimp.c:645: error: ‘FIELD_TYPE_DECIMAL’ undeclared here (not in a function)
  575. dbdimp.c:655: error: ‘FIELD_TYPE_TINY’ undeclared here (not in a function)
  576. dbdimp.c:665: error: ‘FIELD_TYPE_SHORT’ undeclared here (not in a function)
  577. dbdimp.c:675: error: ‘FIELD_TYPE_LONG’ undeclared here (not in a function)
  578. dbdimp.c:685: error: ‘FIELD_TYPE_FLOAT’ undeclared here (not in a function)
  579. dbdimp.c:695: error: ‘FIELD_TYPE_DOUBLE’ undeclared here (not in a function)
  580. dbdimp.c:718: error: ‘FIELD_TYPE_TIMESTAMP’ undeclared here (not in a function)
  581. dbdimp.c:728: error: ‘FIELD_TYPE_LONGLONG’ undeclared here (not in a function)
  582. dbdimp.c:738: error: ‘FIELD_TYPE_INT24’ undeclared here (not in a function)
  583. dbdimp.c:748: error: ‘FIELD_TYPE_DATE’ undeclared here (not in a function)
  584. dbdimp.c:758: error: ‘FIELD_TYPE_TIME’ undeclared here (not in a function)
  585. dbdimp.c:768: error: ‘FIELD_TYPE_DATETIME’ undeclared here (not in a function)
  586. dbdimp.c:778: error: ‘FIELD_TYPE_YEAR’ undeclared here (not in a function)
  587. dbdimp.c:788: error: ‘FIELD_TYPE_NEWDATE’ undeclared here (not in a function)
  588. dbdimp.c:798: error: ‘FIELD_TYPE_ENUM’ undeclared here (not in a function)
  589. dbdimp.c:808: error: ‘FIELD_TYPE_SET’ undeclared here (not in a function)
  590. dbdimp.c:818: error: ‘FIELD_TYPE_BLOB’ undeclared here (not in a function)
  591. dbdimp.c:828: error: ‘FIELD_TYPE_TINY_BLOB’ undeclared here (not in a function)
  592. dbdimp.c:838: error: ‘FIELD_TYPE_MEDIUM_BLOB’ undeclared here (not in a function)
  593. dbdimp.c:848: error: ‘FIELD_TYPE_LONG_BLOB’ undeclared here (not in a function)
  594. dbdimp.c:858: error: ‘FIELD_TYPE_STRING’ undeclared here (not in a function)
  595. dbdimp.c:1325: error: expected ‘=’, ‘,’, ‘;’, ‘asm’ or ‘__attribute__’ before ‘*’ token
  596. dbdimp.c: In function ‘my_login’:
  597. dbdimp.c:1795: error: ‘imp_dbh_t’ has no member named ‘pmysql’
  598. dbdimp.c:1796: error: ‘imp_dbh_t’ has no member named ‘pmysql’
  599. dbdimp.c:1796: error: ‘MYSQL’ undeclared (first use in this function)
  600. dbdimp.c:1796: error: (Each undeclared identifier is reported only once
  601. dbdimp.c:1796: error: for each function it appears in.)
  602. dbdimp.c:1796: warning: comparison between pointer and integer
  603. dbdimp.c:1796: error: invalid operands to binary / (have ‘long unsigned int’ and ‘const struct sql_type_info_t *’)
  604. dbdimp.c:1796: error: invalid operands to binary > (have ‘double’ and ‘const struct sql_type_info_t *’)
  605. dbdimp.c:1796: warning: format not a string literal and no format arguments
  606. dbdimp.c:1796: error: expected expression before ‘)’ token
  607. dbdimp.c:1796: error: invalid operands to binary * (have ‘const struct sql_type_info_t *’ and ‘const struct sql_type_info_t *’)
  608. dbdimp.c:1798: error: ‘imp_dbh_t’ has no member named ‘pmysql’
  609. dbdimp.c: In function ‘mysql_db_login’:
  610. dbdimp.c:1835: error: ‘imp_dbh_t’ has no member named ‘stats’
  611. dbdimp.c:1835: error: request for member ‘auto_reconnects_ok’ in something not a structure or union
  612. dbdimp.c:1836: error: ‘imp_dbh_t’ has no member named ‘stats’
  613. dbdimp.c:1836: error: request for member ‘auto_reconnects_failed’ in something not a structure or union
  614. dbdimp.c:1837: error: ‘imp_dbh_t’ has no member named ‘bind_type_guessing’
  615. dbdimp.c:1838: error: ‘imp_dbh_t’ has no member named ‘has_transactions’
  616. dbdimp.c:1840: error: ‘imp_dbh_t’ has no member named ‘auto_reconnect’
  617. dbdimp.c:1849: error: ‘imp_dbh_t’ has no member named ‘pmysql’
  618. dbdimp.c:1850: error: ‘imp_dbh_t’ has no member named ‘pmysql’
  619. dbdimp.c:1850: warning: passing argument 3 of ‘mysql_dr_error’ makes pointer from integer without a cast
  620. dbdimp.c: In function ‘mysql_db_commit’:
  621. dbdimp.c:1887: error: ‘imp_dbh_t’ has no member named ‘has_transactions’
  622. dbdimp.c:1890: error: ‘imp_dbh_t’ has no member named ‘pmysql’
  623. dbdimp.c:1895: error: ‘imp_dbh_t’ has no member named ‘pmysql’
  624. dbdimp.c:1895: error: ‘imp_dbh_t’ has no member named ‘pmysql’
  625. dbdimp.c:1896: warning: passing argument 3 of ‘mysql_dr_error’ makes pointer from integer without a cast
  626. dbdimp.c: In function ‘mysql_db_rollback’:
  627. dbdimp.c:1915: error: ‘imp_dbh_t’ has no member named ‘has_transactions’
  628. dbdimp.c:1918: error: ‘imp_dbh_t’ has no member named ‘pmysql’
  629. dbdimp.c:1923: error: ‘imp_dbh_t’ has no member named ‘pmysql’
  630. dbdimp.c:1924: error: ‘imp_dbh_t’ has no member named ‘pmysql’
  631. dbdimp.c:1924: warning: passing argument 3 of ‘mysql_dr_error’ makes pointer from integer without a cast
  632. dbdimp.c: In function ‘mysql_db_disconnect’:
  633. dbdimp.c:1961: error: ‘imp_dbh_t’ has no member named ‘pmysql’
  634. dbdimp.c:1962: error: ‘imp_dbh_t’ has no member named ‘pmysql’
  635. dbdimp.c: In function ‘mysql_db_destroy’:
  636. dbdimp.c:2049: error: ‘imp_dbh_t’ has no member named ‘has_transactions’
  637. dbdimp.c:2053: error: ‘imp_dbh_t’ has no member named ‘pmysql’
  638. dbdimp.c:2061: error: ‘imp_dbh_t’ has no member named ‘pmysql’
  639. dbdimp.c: In function ‘mysql_db_STORE_attrib’:
  640. dbdimp.c:2099: error: ‘imp_dbh_t’ has no member named ‘has_transactions’
  641. dbdimp.c:2121: error: ‘imp_dbh_t’ has no member named ‘no_autocommit_cmd’
  642. dbdimp.c:2126: error: ‘imp_dbh_t’ has no member named ‘pmysql’
  643. dbdimp.c:2134: error: ‘imp_dbh_t’ has no member named ‘pmysql’
  644. dbdimp.c:2159: error: ‘imp_dbh_t’ has no member named ‘use_mysql_use_result’
  645. dbdimp.c:2161: error: ‘imp_dbh_t’ has no member named ‘auto_reconnect’
  646. dbdimp.c:2163: error: ‘imp_dbh_t’ has no member named ‘use_server_side_prepare’
  647. dbdimp.c:2165: error: ‘imp_dbh_t’ has no member named ‘no_autocommit_cmd’
  648. dbdimp.c:2167: error: ‘imp_dbh_t’ has no member named ‘bind_type_guessing’
  649. dbdimp.c: At top level:
  650. dbdimp.c:2196: error: expected ‘)’ before ‘val’
  651. dbdimp.c: In function ‘mysql_db_FETCH_attrib’:
  652. dbdimp.c:2225: error: ‘imp_dbh_t’ has no member named ‘has_transactions’
  653. dbdimp.c:2242: error: ‘imp_dbh_t’ has no member named ‘auto_reconnect’
  654. dbdimp.c:2242: warning: passing argument 2 of ‘Perl_newSViv’ makes integer from pointer without a cast
  655. dbdimp.c:2247: error: ‘imp_dbh_t’ has no member named ‘bind_type_guessing’
  656. dbdimp.c:2247: warning: passing argument 2 of ‘Perl_newSViv’ makes integer from pointer without a cast
  657. dbdimp.c:2251: error: ‘imp_dbh_t’ has no member named ‘pmysql’
  658. dbdimp.c:2255: error: ‘imp_dbh_t’ has no member named ‘pmysql’
  659. dbdimp.c:2255: warning: initialization makes pointer from integer without a cast
  660. dbdimp.c:2269: error: ‘imp_dbh_t’ has no member named ‘stats’
  661. dbdimp.c:2269: error: request for member ‘auto_reconnects_ok’ in something not a structure or union
  662. dbdimp.c:2269: warning: passing argument 2 of ‘Perl_newSViv’ makes integer from pointer without a cast
  663. dbdimp.c:2276: error: ‘imp_dbh_t’ has no member named ‘stats’
  664. dbdimp.c:2276: error: request for member ‘auto_reconnects_failed’ in something not a structure or union
  665. dbdimp.c:2276: warning: passing argument 2 of ‘Perl_newSViv’ makes integer from pointer without a cast
  666. dbdimp.c:2290: error: ‘imp_dbh_t’ has no member named ‘pmysql’
  667. dbdimp.c:2290: warning: initialization makes pointer from integer without a cast
  668. dbdimp.c:2299: error: ‘imp_dbh_t’ has no member named ‘pmysql’
  669. dbdimp.c:2299: warning: initialization makes pointer from integer without a cast
  670. dbdimp.c:2304: error: ‘imp_dbh_t’ has no member named ‘pmysql’
  671. dbdimp.c:2304: warning: passing argument 2 of ‘Perl_sv_2mortal’ makes pointer from integer without a cast
  672. dbdimp.c:2309: error: ‘imp_dbh_t’ has no member named ‘no_autocommit_cmd’
  673. dbdimp.c:2309: warning: passing argument 2 of ‘Perl_newSViv’ makes integer from pointer without a cast
  674. dbdimp.c:2314: error: ‘imp_dbh_t’ has no member named ‘pmysql’
  675. dbdimp.c:2320: error: ‘imp_dbh_t’ has no member named ‘pmysql’
  676. dbdimp.c:2320: warning: initialization makes pointer from integer without a cast
  677. dbdimp.c:2325: error: ‘imp_dbh_t’ has no member named ‘pmysql’
  678. dbdimp.c:2327: error: ‘imp_dbh_t’ has no member named ‘pmysql’
  679. dbdimp.c:2327: error: ‘sql_type_info_t’ has no member named ‘net’
  680. dbdimp.c:2327: error: request for member ‘fd’ in something not a structure or union
  681. dbdimp.c:2330: error: ‘imp_dbh_t’ has no member named ‘pmysql’
  682. dbdimp.c:2330: warning: initialization makes pointer from integer without a cast
  683. dbdimp.c:2337: error: ‘imp_dbh_t’ has no member named ‘pmysql’
  684. dbdimp.c:2337: warning: initialization makes pointer from integer without a cast
  685. dbdimp.c:2342: error: ‘imp_dbh_t’ has no member named ‘use_server_side_prepare’
  686. dbdimp.c:2347: error: ‘imp_dbh_t’ has no member named ‘pmysql’
  687. dbdimp.c: In function ‘mysql_st_prepare’:
  688. dbdimp.c:2396: error: ‘MYSQL_VERSION_ID’ undeclared (first use in this function)
  689. dbdimp.c:2396: warning: format ‘%d’ expects type ‘int’, but argument 3 has type ‘const struct sql_type_info_t *’
  690. dbdimp.c:2411: error: ‘imp_sth_t’ has no member named ‘done_desc’
  691. dbdimp.c:2412: error: ‘imp_sth_t’ has no member named ‘result’
  692. dbdimp.c:2413: error: ‘imp_sth_t’ has no member named ‘currow’
  693. dbdimp.c:2417: error: ‘imp_sth_t’ has no member named ‘use_mysql_use_result’
  694. dbdimp.c:2418: error: ‘imp_dbh_t’ has no member named ‘use_mysql_use_result’
  695. dbdimp.c:2418: warning: pointer/integer type mismatch in conditional expression
  696. dbdimp.c:2421: error: ‘imp_sth_t’ has no member named ‘av_attr’
  697. dbdimp.c:2421: error: assignment of read-only location
  698. dbdimp.c:2610: error: ‘imp_sth_t’ has no member named ‘params’
  699. dbdimp.c: In function ‘mysql_st_free_result_sets’:
  700. dbdimp.c:2680: error: ‘imp_sth_t’ has no member named ‘result’
  701. dbdimp.c:2682: error: ‘imp_sth_t’ has no member named ‘result’
  702. dbdimp.c:2683: error: ‘imp_sth_t’ has no member named ‘result’
  703. dbdimp.c: At top level:
  704. dbdimp.c:2847: error: expected ‘=’, ‘,’, ‘;’, ‘asm’ or ‘__attribute__’ before ‘mysql_st_internal_execute’
  705. dbdimp.c: In function ‘mysql_st_execute’:
  706. dbdimp.c:3148: error: ‘imp_sth_t’ has no member named ‘av_attr’
  707. dbdimp.c:3148: error: used struct type value where scalar is required
  708. dbdimp.c:3149: error: ‘imp_sth_t’ has no member named ‘av_attr’
  709. dbdimp.c:3149: error: cannot convert to a pointer type
  710. dbdimp.c:3151: error: ‘imp_sth_t’ has no member named ‘av_attr’
  711. dbdimp.c:3151: error: assignment of read-only location
  712. dbdimp.c:3184: error: ‘imp_sth_t’ has no member named ‘row_num’
  713. dbdimp.c:3189: error: ‘imp_sth_t’ has no member named ‘params’
  714. dbdimp.c:3190: error: ‘imp_sth_t’ has no member named ‘result’
  715. dbdimp.c:3191: error: ‘imp_dbh_t’ has no member named ‘pmysql’
  716. dbdimp.c:3192: error: ‘imp_sth_t’ has no member named ‘use_mysql_use_result’
  717. dbdimp.c:3195: error: ‘imp_sth_t’ has no member named ‘row_num’
  718. dbdimp.c:3195: error: ‘my_ulonglong’ undeclared (first use in this function)
  719. dbdimp.c:3197: error: ‘imp_sth_t’ has no member named ‘result’
  720. dbdimp.c:3199: error: ‘imp_sth_t’ has no member named ‘insertid’
  721. dbdimp.c:3199: error: ‘imp_dbh_t’ has no member named ‘pmysql’
  722. dbdimp.c:3208: error: ‘imp_sth_t’ has no member named ‘result’
  723. dbdimp.c:3210: error: ‘imp_sth_t’ has no member named ‘done_desc’
  724. dbdimp.c:3211: error: ‘imp_sth_t’ has no member named ‘fetch_done’
  725. dbdimp.c:3215: error: ‘imp_sth_t’ has no member named ‘warning_count’
  726. dbdimp.c:3223: error: ‘imp_sth_t’ has no member named ‘row_num’
  727. dbdimp.c:3223: warning: format ‘%llu’ expects type ‘long long unsigned int’, but argument 5 has type ‘const struct sql_type_info_t *’
  728. dbdimp.c:3229: error: ‘imp_sth_t’ has no member named ‘row_num’
  729. dbdimp.c: In function ‘mysql_describe’:
  730. dbdimp.c:3351: error: ‘imp_sth_t’ has no member named ‘done_desc’
  731. dbdimp.c: In function ‘mysql_st_fetch’:
  732. dbdimp.c:3379: error: ‘MYSQL_ROW’ undeclared (first use in this function)
  733. dbdimp.c:3379: error: expected ‘;’ before ‘cols’
  734. dbdimp.c:3381: error: ‘MYSQL’ undeclared (first use in this function)
  735. dbdimp.c:3381: error: ‘svsock’ undeclared (first use in this function)
  736. dbdimp.c:3381: error: invalid operands to binary * (have ‘const struct sql_type_info_t *’ and ‘const struct sql_type_info_t *’)
  737. dbdimp.c:3381: error: ‘imp_dbh_t’ has no member named ‘pmysql’
  738. dbdimp.c:3387: error: ‘MYSQL_FIELD’ undeclared (first use in this function)
  739. dbdimp.c:3387: error: ‘fields’ undeclared (first use in this function)
  740. dbdimp.c:3387: error: invalid operands to binary * (have ‘const struct sql_type_info_t *’ and ‘const struct sql_type_info_t *’)
  741. dbdimp.c:3425: error: ‘imp_sth_t’ has no member named ‘result’
  742. dbdimp.c:3432: error: ‘imp_dbh_t’ has no member named ‘pmysql’
  743. dbdimp.c:3432: error: ‘sql_type_info_t’ has no member named ‘net’
  744. dbdimp.c:3432: error: request for member ‘last_errno’ in something not a structure or union
  745. dbdimp.c:3563: error: ‘imp_sth_t’ has no member named ‘currow’
  746. dbdimp.c:3563: error: lvalue required as increment operand
  747. dbdimp.c:3563: error: lvalue required as increment operand
  748. dbdimp.c:3568: error: ‘imp_sth_t’ has no member named ‘result’
  749. dbdimp.c:3568: warning: format ‘%08lx’ expects type ‘long unsigned int’, but argument 3 has type ‘const struct sql_type_info_t *’
  750. dbdimp.c:3570: error: ‘imp_sth_t’ has no member named ‘result’
  751. dbdimp.c:3570: warning: format ‘%llu’ expects type ‘long long unsigned int’, but argument 3 has type ‘int’
  752. dbdimp.c:3572: error: ‘imp_sth_t’ has no member named ‘result’
  753. dbdimp.c:3572: warning: format ‘%llu’ expects type ‘long long unsigned int’, but argument 3 has type ‘int’
  754. dbdimp.c:3574: error: ‘imp_dbh_t’ has no member named ‘pmysql’
  755. dbdimp.c:3574: warning: format ‘%llu’ expects type ‘long long unsigned int’, but argument 3 has type ‘int’
  756. dbdimp.c:3576: error: ‘imp_sth_t’ has no member named ‘currow’
  757. dbdimp.c:3576: warning: format ‘%d’ expects type ‘int’, but argument 4 has type ‘const struct sql_type_info_t *’
  758. dbdimp.c:3579: error: ‘cols’ undeclared (first use in this function)
  759. dbdimp.c:3579: error: ‘imp_sth_t’ has no member named ‘result’
  760. dbdimp.c:3585: error: ‘imp_dbh_t’ has no member named ‘pmysql’
  761. dbdimp.c:3586: error: ‘imp_dbh_t’ has no member named ‘pmysql’
  762. dbdimp.c:3587: error: ‘imp_dbh_t’ has no member named ‘pmysql’
  763. dbdimp.c:3588: warning: passing argument 3 of ‘mysql_dr_error’ makes pointer from integer without a cast
  764. dbdimp.c:3598: error: ‘imp_sth_t’ has no member named ‘result’
  765. dbdimp.c:3599: error: ‘imp_sth_t’ has no member named ‘result’
  766. dbdimp.c:3600: error: ‘imp_sth_t’ has no member named ‘result’
  767. dbdimp.c:3600: warning: assignment makes pointer from integer without a cast
  768. dbdimp.c:3640: error: incompatible types in initialization
  769. dbdimp.c: In function ‘mysql_st_destroy’:
  770. dbdimp.c:3828: error: ‘imp_sth_t’ has no member named ‘params’
  771. dbdimp.c:3830: error: ‘imp_sth_t’ has no member named ‘params’
  772. dbdimp.c:3830: warning: passing argument 1 of ‘free_param’ from incompatible pointer type
  773. dbdimp.c:3831: error: ‘imp_sth_t’ has no member named ‘params’
  774. dbdimp.c:3837: error: ‘imp_sth_t’ has no member named ‘av_attr’
  775. dbdimp.c:3837: error: used struct type value where scalar is required
  776. dbdimp.c:3838: error: ‘imp_sth_t’ has no member named ‘av_attr’
  777. dbdimp.c:3838: error: cannot convert to a pointer type
  778. dbdimp.c:3839: error: ‘imp_sth_t’ has no member named ‘av_attr’
  779. dbdimp.c:3839: error: assignment of read-only location
  780. dbdimp.c: In function ‘mysql_st_STORE_attrib’:
  781. dbdimp.c:3883: error: ‘imp_sth_t’ has no member named ‘use_mysql_use_result’
  782. dbdimp.c: At top level:
  783. dbdimp.c:3931: error: expected declaration specifiers or ‘...’ before ‘MYSQL_RES’
  784. dbdimp.c: In function ‘mysql_st_FETCH_internal’:
  785. dbdimp.c:3937: error: ‘MYSQL_FIELD’ undeclared (first use in this function)
  786. dbdimp.c:3937: error: ‘curField’ undeclared (first use in this function)
  787. dbdimp.c:3937: error: invalid operands to binary * (have ‘const struct sql_type_info_t *’ and ‘const struct sql_type_info_t *’)
  788. dbdimp.c:3944: error: ‘imp_sth_t’ has no member named ‘av_attr’
  789. dbdimp.c:3944: error: invalid operands to binary && (have ‘int’ and ‘struct sql_type_info_s’)
  790. dbdimp.c:3945: error: ‘imp_sth_t’ has no member named ‘av_attr’
  791. dbdimp.c:3945: error: incompatible types in assignment
  792. dbdimp.c:3948: error: ‘res’ undeclared (first use in this function)
  793. dbdimp.c:3962: error: ‘sql_type_info_t’ has no member named ‘name’
  794. dbdimp.c:3962: error: ‘sql_type_info_t’ has no member named ‘name’
  795. dbdimp.c:3962: warning: passing argument 1 of ‘strlen’ from incompatible pointer type
  796. dbdimp.c:3962: warning: passing argument 2 of ‘Perl_newSVpv’ from incompatible pointer type
  797. dbdimp.c:3966: error: ‘sql_type_info_t’ has no member named ‘table’
  798. dbdimp.c:3966: error: ‘sql_type_info_t’ has no member named ‘table’
  799. dbdimp.c:3966: warning: passing argument 1 of ‘strlen’ from incompatible pointer type
  800. dbdimp.c:3966: warning: passing argument 2 of ‘Perl_newSVpv’ from incompatible pointer type
  801. dbdimp.c:3970: error: ‘sql_type_info_t’ has no member named ‘type’
  802. dbdimp.c:3974: error: ‘sql_type_info_t’ has no member named ‘type’
  803. dbdimp.c:3974: warning: passing argument 1 of ‘native2sql’ makes integer from pointer without a cast
  804. dbdimp.c:3977: error: ‘sql_type_info_t’ has no member named ‘flags’
  805. dbdimp.c:3981: error: ‘sql_type_info_t’ has no member named ‘flags’
  806. dbdimp.c:3985: error: ‘sql_type_info_t’ has no member named ‘flags’
  807. dbdimp.c:3989: error: ‘sql_type_info_t’ has no member named ‘length’
  808. dbdimp.c:3993: error: ‘sql_type_info_t’ has no member named ‘type’
  809. dbdimp.c:3993: warning: passing argument 1 of ‘native2sql’ makes integer from pointer without a cast
  810. dbdimp.c:3997: error: ‘sql_type_info_t’ has no member named ‘type’
  811. dbdimp.c:3997: warning: passing argument 1 of ‘native2sql’ makes integer from pointer without a cast
  812. dbdimp.c:4001: error: ‘sql_type_info_t’ has no member named ‘max_length’
  813. dbdimp.c:4013: error: ‘sql_type_info_t’ has no member named ‘flags’
  814. dbdimp.c:4013: error: ‘PRI_KEY_FLAG’ undeclared (first use in this function)
  815. dbdimp.c:4013: error: ‘UNIQUE_KEY_FLAG’ undeclared (first use in this function)
  816. dbdimp.c:4013: error: invalid operands to binary | (have ‘const struct sql_type_info_t *’ and ‘const struct sql_type_info_t *’)
  817. dbdimp.c:4013: error: ‘MULTIPLE_KEY_FLAG’ undeclared (first use in this function)
  818. dbdimp.c:4013: error: invalid operands to binary | (have ‘const struct sql_type_info_t *’ and ‘const struct sql_type_info_t *’)
  819. dbdimp.c:4013: error: invalid operands to binary & (have ‘const struct sql_type_info_t *’ and ‘const struct sql_type_info_t *’)
  820. dbdimp.c:4017: error: ‘sql_type_info_t’ has no member named ‘flags’
  821. dbdimp.c:4021: error: ‘sql_type_info_t’ has no member named ‘decimals’
  822. dbdimp.c:4025: error: ‘sql_type_info_t’ has no member named ‘length’
  823. dbdimp.c:4025: error: ‘sql_type_info_t’ has no member named ‘max_length’
  824. dbdimp.c:4025: error: ‘sql_type_info_t’ has no member named ‘length’
  825. dbdimp.c:4025: error: ‘sql_type_info_t’ has no member named ‘max_length’
  826. dbdimp.c:4025: warning: passing argument 2 of ‘Perl_newSViv’ makes integer from pointer without a cast
  827. dbdimp.c:4040: error: ‘imp_sth_t’ has no member named ‘av_attr’
  828. dbdimp.c:4040: error: assignment of read-only location
  829. dbdimp.c: In function ‘mysql_st_FETCH_attrib’:
  830. dbdimp.c:4091: error: ‘imp_sth_t’ has no member named ‘result’
  831. dbdimp.c:4091: warning: passing argument 3 of ‘mysql_st_FETCH_internal’ makes integer from pointer without a cast
  832. dbdimp.c:4091: error: too many arguments to function ‘mysql_st_FETCH_internal’
  833. dbdimp.c:4093: error: ‘imp_sth_t’ has no member named ‘result’
  834. dbdimp.c:4093: warning: passing argument 3 of ‘mysql_st_FETCH_internal’ makes integer from pointer without a cast
  835. dbdimp.c:4093: error: too many arguments to function ‘mysql_st_FETCH_internal’
  836. dbdimp.c:4097: error: ‘imp_sth_t’ has no member named ‘result’
  837. dbdimp.c:4097: warning: passing argument 3 of ‘mysql_st_FETCH_internal’ makes integer from pointer without a cast
  838. dbdimp.c:4097: error: too many arguments to function ‘mysql_st_FETCH_internal’
  839. dbdimp.c:4109: error: ‘imp_sth_t’ has no member named ‘params’
  840. dbdimp.c:4109: error: ‘struct sql_type_info_s’ has no member named ‘value’
  841. dbdimp.c:4109: warning: passing argument 2 of ‘Perl_newSVsv’ from incompatible pointer type
  842. dbdimp.c:4118: error: ‘imp_sth_t’ has no member named ‘result’
  843. dbdimp.c:4118: warning: passing argument 3 of ‘mysql_st_FETCH_internal’ makes integer from pointer without a cast
  844. dbdimp.c:4118: error: too many arguments to function ‘mysql_st_FETCH_internal’
  845. dbdimp.c:4122: error: ‘imp_sth_t’ has no member named ‘result’
  846. dbdimp.c:4122: warning: passing argument 3 of ‘mysql_st_FETCH_internal’ makes integer from pointer without a cast
  847. dbdimp.c:4122: error: too many arguments to function ‘mysql_st_FETCH_internal’
  848. dbdimp.c:4128: error: ‘imp_sth_t’ has no member named ‘result’
  849. dbdimp.c:4128: warning: passing argument 3 of ‘mysql_st_FETCH_internal’ makes integer from pointer without a cast
  850. dbdimp.c:4128: error: too many arguments to function ‘mysql_st_FETCH_internal’
  851. dbdimp.c:4132: error: ‘imp_sth_t’ has no member named ‘result’
  852. dbdimp.c:4132: warning: passing argument 3 of ‘mysql_st_FETCH_internal’ makes integer from pointer without a cast
  853. dbdimp.c:4132: error: too many arguments to function ‘mysql_st_FETCH_internal’
  854. dbdimp.c:4136: error: ‘imp_sth_t’ has no member named ‘result’
  855. dbdimp.c:4136: warning: passing argument 3 of ‘mysql_st_FETCH_internal’ makes integer from pointer without a cast
  856. dbdimp.c:4136: error: too many arguments to function ‘mysql_st_FETCH_internal’
  857. dbdimp.c:4138: error: ‘imp_sth_t’ has no member named ‘result’
  858. dbdimp.c:4138: warning: passing argument 3 of ‘mysql_st_FETCH_internal’ makes integer from pointer without a cast
  859. dbdimp.c:4138: error: too many arguments to function ‘mysql_st_FETCH_internal’
  860. dbdimp.c:4140: error: ‘imp_sth_t’ has no member named ‘result’
  861. dbdimp.c:4140: warning: passing argument 3 of ‘mysql_st_FETCH_internal’ makes integer from pointer without a cast
  862. dbdimp.c:4140: error: too many arguments to function ‘mysql_st_FETCH_internal’
  863. dbdimp.c:4142: error: ‘imp_sth_t’ has no member named ‘result’
  864. dbdimp.c:4146: error: ‘imp_sth_t’ has no member named ‘result’
  865. dbdimp.c:4146: warning: passing argument 3 of ‘mysql_st_FETCH_internal’ makes integer from pointer without a cast
  866. dbdimp.c:4146: error: too many arguments to function ‘mysql_st_FETCH_internal’
  867. dbdimp.c:4153: error: ‘imp_sth_t’ has no member named ‘insertid’
  868. dbdimp.c:4153: warning: format ‘%d’ expects type ‘int’, but argument 3 has type ‘const struct sql_type_info_t *’
  869. dbdimp.c:4155: error: ‘imp_sth_t’ has no member named ‘insertid’
  870. dbdimp.c:4155: warning: passing argument 2 of ‘Perl_sv_2mortal’ makes pointer from integer without a cast
  871. dbdimp.c:4160: error: ‘imp_sth_t’ has no member named ‘result’
  872. dbdimp.c:4160: warning: passing argument 3 of ‘mysql_st_FETCH_internal’ makes integer from pointer without a cast
  873. dbdimp.c:4160: error: too many arguments to function ‘mysql_st_FETCH_internal’
  874. dbdimp.c:4164: error: ‘imp_sth_t’ has no member named ‘result’
  875. dbdimp.c:4164: warning: passing argument 3 of ‘mysql_st_FETCH_internal’ makes integer from pointer without a cast
  876. dbdimp.c:4164: error: too many arguments to function ‘mysql_st_FETCH_internal’
  877. dbdimp.c:4166: error: ‘imp_sth_t’ has no member named ‘result’
  878. dbdimp.c:4166: warning: passing argument 3 of ‘mysql_st_FETCH_internal’ makes integer from pointer without a cast
  879. dbdimp.c:4166: error: too many arguments to function ‘mysql_st_FETCH_internal’
  880. dbdimp.c:4168: error: ‘imp_sth_t’ has no member named ‘use_mysql_use_result’
  881. dbdimp.c:4172: error: ‘imp_sth_t’ has no member named ‘warning_count’
  882. dbdimp.c:4184: error: ‘imp_sth_t’ has no member named ‘result’
  883. dbdimp.c:4184: warning: passing argument 3 of ‘mysql_st_FETCH_internal’ makes integer from pointer without a cast
  884. dbdimp.c:4184: error: too many arguments to function ‘mysql_st_FETCH_internal’
  885. dbdimp.c: In function ‘mysql_bind_ph’:
  886. dbdimp.c:4308: error: ‘imp_sth_t’ has no member named ‘params’
  887. dbdimp.c:4308: warning: passing argument 1 of ‘bind_param’ from incompatible pointer type
  888. dbdimp.c: In function ‘mysql_db_reconnect’:
  889. dbdimp.c:4430: error: ‘MYSQL’ undeclared (first use in this function)
  890. dbdimp.c:4430: error: expected ‘;’ before ‘save_socket’
  891. dbdimp.c:4440: error: ‘imp_dbh_t’ has no member named ‘pmysql’
  892. dbdimp.c:4440: error: ‘CR_SERVER_GONE_ERROR’ undeclared (first use in this function)
  893. dbdimp.c:4440: warning: comparison between pointer and integer
  894. dbdimp.c:4444: error: ‘imp_dbh_t’ has no member named ‘auto_reconnect’
  895. dbdimp.c:4458: error: ‘save_socket’ undeclared (first use in this function)
  896. dbdimp.c:4458: error: ‘imp_dbh_t’ has no member named ‘pmysql’
  897. dbdimp.c:4459: error: ‘imp_dbh_t’ has no member named ‘pmysql’
  898. dbdimp.c:4459: warning: passing argument 3 of ‘__builtin___memcpy_chk’ makes integer from pointer without a cast
  899. dbdimp.c:4459: error: ‘imp_dbh_t’ has no member named ‘pmysql’
  900. dbdimp.c:4459: warning: passing argument 3 of ‘__inline_memcpy_chk’ makes integer from pointer without a cast
  901. dbdimp.c:4460: error: ‘imp_dbh_t’ has no member named ‘pmysql’
  902. dbdimp.c:4460: error: ‘imp_dbh_t’ has no member named ‘pmysql’
  903. dbdimp.c:4460: error: ‘imp_dbh_t’ has no member named ‘pmysql’
  904. dbdimp.c:4460: error: ‘imp_dbh_t’ has no member named ‘pmysql’
  905. dbdimp.c:4460: warning: passing argument 1 of ‘__builtin___memset_chk’ discards qualifiers from pointer target type
  906. dbdimp.c:4460: error: ‘imp_dbh_t’ has no member named ‘pmysql’
  907. dbdimp.c:4460: error: ‘imp_dbh_t’ has no member named ‘pmysql’
  908. dbdimp.c:4460: warning: passing argument 1 of ‘__inline_memset_chk’ discards qualifiers from pointer target type
  909. dbdimp.c:4468: error: ‘imp_dbh_t’ has no member named ‘pmysql’
  910. dbdimp.c:4468: error: ‘imp_dbh_t’ has no member named ‘pmysql’
  911. dbdimp.c:4469: warning: passing argument 3 of ‘mysql_dr_error’ makes pointer from integer without a cast
  912. dbdimp.c:4470: error: ‘imp_dbh_t’ has no member named ‘pmysql’
  913. dbdimp.c:4470: error: ‘imp_dbh_t’ has no member named ‘pmysql’
  914. dbdimp.c:4470: error: ‘imp_dbh_t’ has no member named ‘pmysql’
  915. dbdimp.c:4470: warning: passing argument 1 of ‘__builtin___memcpy_chk’ discards qualifiers from pointer target type
  916. dbdimp.c:4470: warning: passing argument 3 of ‘__builtin___memcpy_chk’ makes integer from pointer without a cast
  917. dbdimp.c:4470: error: ‘imp_dbh_t’ has no member named ‘pmysql’
  918. dbdimp.c:4470: warning: passing argument 1 of ‘__inline_memcpy_chk’ discards qualifiers from pointer target type
  919. dbdimp.c:4470: warning: passing argument 3 of ‘__inline_memcpy_chk’ makes integer from pointer without a cast
  920. dbdimp.c:4471: error: ‘imp_dbh_t’ has no member named ‘stats’
  921. dbdimp.c:4471: error: request for member ‘auto_reconnects_failed’ in something not a structure or union
  922. dbdimp.c:4471: error: lvalue required as increment operand
  923. dbdimp.c:4471: error: lvalue required as increment operand
  924. dbdimp.c:4480: error: ‘imp_dbh_t’ has no member named ‘stats’
  925. dbdimp.c:4480: error: request for member ‘auto_reconnects_ok’ in something not a structure or union
  926. dbdimp.c:4480: error: lvalue required as increment operand
  927. dbdimp.c:4480: error: lvalue required as increment operand
  928. dbdimp.c: In function ‘mysql_db_quote’:
  929. dbdimp.c:4640: error: ‘imp_dbh_t’ has no member named ‘pmysql’
  930. dbdimp.c: In function ‘mysql_db_last_insert_id’:
  931. dbdimp.c:4663: error: ‘imp_dbh_t’ has no member named ‘pmysql’
  932. dbdimp.c:4663: warning: passing argument 2 of ‘Perl_sv_2mortal’ makes pointer from integer without a cast
  933. In file included from dbdimp.c:20:
  934. dbdimp.h:22:49: error: mysql.h: No such file or directory
  935. dbdimp.h:23:45: error: mysqld_error.h: No such file or directory
  936. dbdimp.h:25:49: error: errmsg.h: No such file or directory
  937. In file included from dbdimp.c:20:
  938. dbdimp.h:144: error: expected specifier-qualifier-list before ‘MYSQL’
  939. dbdimp.h:236: error: expected specifier-qualifier-list before ‘MYSQL_RES’
  940. In file included from dbdimp.c:20:
  941. dbdimp.h:293: error: expected ‘)’ before ‘*’ token
  942. dbdimp.h:296: error: expected ‘=’, ‘,’, ‘;’, ‘asm’ or ‘__attribute__’ before ‘mysql_st_internal_execute’
  943. dbdimp.h:328: error: expected ‘=’, ‘,’, ‘;’, ‘asm’ or ‘__attribute__’ before ‘*’ token
  944. dbdimp.c: In function ‘alloc_param’:
  945. dbdimp.c:113: warning: format not a string literal and no format arguments
  946. dbdimp.c: At top level:
  947. dbdimp.c:408: error: expected ‘)’ before ‘*’ token
  948. dbdimp.c:635: error: ‘FIELD_TYPE_VAR_STRING’ undeclared here (not in a function)
  949. dbdimp.c:645: error: ‘FIELD_TYPE_DECIMAL’ undeclared here (not in a function)
  950. dbdimp.c:655: error: ‘FIELD_TYPE_TINY’ undeclared here (not in a function)
  951. dbdimp.c:665: error: ‘FIELD_TYPE_SHORT’ undeclared here (not in a function)
  952. dbdimp.c:675: error: ‘FIELD_TYPE_LONG’ undeclared here (not in a function)
  953. dbdimp.c:685: error: ‘FIELD_TYPE_FLOAT’ undeclared here (not in a function)
  954. dbdimp.c:695: error: ‘FIELD_TYPE_DOUBLE’ undeclared here (not in a function)
  955. dbdimp.c:718: error: ‘FIELD_TYPE_TIMESTAMP’ undeclared here (not in a function)
  956. dbdimp.c:728: error: ‘FIELD_TYPE_LONGLONG’ undeclared here (not in a function)
  957. dbdimp.c:738: error: ‘FIELD_TYPE_INT24’ undeclared here (not in a function)
  958. dbdimp.c:748: error: ‘FIELD_TYPE_DATE’ undeclared here (not in a function)
  959. dbdimp.c:758: error: ‘FIELD_TYPE_TIME’ undeclared here (not in a function)
  960. dbdimp.c:768: error: ‘FIELD_TYPE_DATETIME’ undeclared here (not in a function)
  961. dbdimp.c:778: error: ‘FIELD_TYPE_YEAR’ undeclared here (not in a function)
  962. dbdimp.c:788: error: ‘FIELD_TYPE_NEWDATE’ undeclared here (not in a function)
  963. dbdimp.c:798: error: ‘FIELD_TYPE_ENUM’ undeclared here (not in a function)
  964. dbdimp.c:808: error: ‘FIELD_TYPE_SET’ undeclared here (not in a function)
  965. dbdimp.c:818: error: ‘FIELD_TYPE_BLOB’ undeclared here (not in a function)
  966. dbdimp.c:828: error: ‘FIELD_TYPE_TINY_BLOB’ undeclared here (not in a function)
  967. dbdimp.c:838: error: ‘FIELD_TYPE_MEDIUM_BLOB’ undeclared here (not in a function)
  968. dbdimp.c:848: error: ‘FIELD_TYPE_LONG_BLOB’ undeclared here (not in a function)
  969. dbdimp.c:858: error: ‘FIELD_TYPE_STRING’ undeclared here (not in a function)
  970. dbdimp.c:1325: error: expected ‘=’, ‘,’, ‘;’, ‘asm’ or ‘__attribute__’ before ‘*’ token
  971. dbdimp.c: In function ‘my_login’:
  972. dbdimp.c:1795: error: ‘imp_dbh_t’ has no member named ‘pmysql’
  973. dbdimp.c:1796: error: ‘imp_dbh_t’ has no member named ‘pmysql’
  974. dbdimp.c:1796: error: ‘MYSQL’ undeclared (first use in this function)
  975. dbdimp.c:1796: error: (Each undeclared identifier is reported only once
  976. dbdimp.c:1796: error: for each function it appears in.)
  977. dbdimp.c:1796: warning: comparison between pointer and integer
  978. dbdimp.c:1796: error: invalid operands to binary / (have ‘long unsigned int’ and ‘const struct sql_type_info_t *’)
  979. dbdimp.c:1796: error: invalid operands to binary > (have ‘double’ and ‘const struct sql_type_info_t *’)
  980. dbdimp.c:1796: warning: format not a string literal and no format arguments
  981. dbdimp.c:1796: error: expected expression before ‘)’ token
  982. dbdimp.c:1796: error: invalid operands to binary * (have ‘const struct sql_type_info_t *’ and ‘const struct sql_type_info_t *’)
  983. dbdimp.c:1798: error: ‘imp_dbh_t’ has no member named ‘pmysql’
  984. dbdimp.c: In function ‘mysql_db_login’:
  985. dbdimp.c:1835: error: ‘imp_dbh_t’ has no member named ‘stats’
  986. dbdimp.c:1835: error: request for member ‘auto_reconnects_ok’ in something not a structure or union
  987. dbdimp.c:1836: error: ‘imp_dbh_t’ has no member named ‘stats’
  988. dbdimp.c:1836: error: request for member ‘auto_reconnects_failed’ in something not a structure or union
  989. dbdimp.c:1837: error: ‘imp_dbh_t’ has no member named ‘bind_type_guessing’
  990. dbdimp.c:1838: error: ‘imp_dbh_t’ has no member named ‘has_transactions’
  991. dbdimp.c:1840: error: ‘imp_dbh_t’ has no member named ‘auto_reconnect’
  992. dbdimp.c:1849: error: ‘imp_dbh_t’ has no member named ‘pmysql’
  993. dbdimp.c:1850: error: ‘imp_dbh_t’ has no member named ‘pmysql’
  994. dbdimp.c:1850: warning: passing argument 3 of ‘mysql_dr_error’ makes pointer from integer without a cast
  995. dbdimp.c: In function ‘mysql_db_commit’:
  996. dbdimp.c:1887: error: ‘imp_dbh_t’ has no member named ‘has_transactions’
  997. dbdimp.c:1890: error: ‘imp_dbh_t’ has no member named ‘pmysql’
  998. dbdimp.c:1895: error: ‘imp_dbh_t’ has no member named ‘pmysql’
  999. dbdimp.c:1895: error: ‘imp_dbh_t’ has no member named ‘pmysql’
  1000. dbdimp.c:1896: warning: passing argument 3 of ‘mysql_dr_error’ makes pointer from integer without a cast
  1001. dbdimp.c: In function ‘mysql_db_rollback’:
  1002. dbdimp.c:1915: error: ‘imp_dbh_t’ has no member named ‘has_transactions’
  1003. dbdimp.c:1918: error: ‘imp_dbh_t’ has no member named ‘pmysql’
  1004. dbdimp.c:1923: error: ‘imp_dbh_t’ has no member named ‘pmysql’
  1005. dbdimp.c:1924: error: ‘imp_dbh_t’ has no member named ‘pmysql’
  1006. dbdimp.c:1924: warning: passing argument 3 of ‘mysql_dr_error’ makes pointer from integer without a cast
  1007. dbdimp.c: In function ‘mysql_db_disconnect’:
  1008. dbdimp.c:1961: error: ‘imp_dbh_t’ has no member named ‘pmysql’
  1009. dbdimp.c:1962: error: ‘imp_dbh_t’ has no member named ‘pmysql’
  1010. dbdimp.c: In function ‘mysql_db_destroy’:
  1011. dbdimp.c:2049: error: ‘imp_dbh_t’ has no member named ‘has_transactions’
  1012. dbdimp.c:2053: error: ‘imp_dbh_t’ has no member named ‘pmysql’
  1013. dbdimp.c:2061: error: ‘imp_dbh_t’ has no member named ‘pmysql’
  1014. dbdimp.c: In function ‘mysql_db_STORE_attrib’:
  1015. dbdimp.c:2099: error: ‘imp_dbh_t’ has no member named ‘has_transactions’
  1016. dbdimp.c:2121: error: ‘imp_dbh_t’ has no member named ‘no_autocommit_cmd’
  1017. dbdimp.c:2126: error: ‘imp_dbh_t’ has no member named ‘pmysql’
  1018. dbdimp.c:2134: error: ‘imp_dbh_t’ has no member named ‘pmysql’
  1019. dbdimp.c:2159: error: ‘imp_dbh_t’ has no member named ‘use_mysql_use_result’
  1020. dbdimp.c:2161: error: ‘imp_dbh_t’ has no member named ‘auto_reconnect’
  1021. dbdimp.c:2163: error: ‘imp_dbh_t’ has no member named ‘use_server_side_prepare’
  1022. dbdimp.c:2165: error: ‘imp_dbh_t’ has no member named ‘no_autocommit_cmd’
  1023. dbdimp.c:2167: error: ‘imp_dbh_t’ has no member named ‘bind_type_guessing’
  1024. dbdimp.c: At top level:
  1025. dbdimp.c:2196: error: expected ‘)’ before ‘val’
  1026. dbdimp.c: In function ‘mysql_db_FETCH_attrib’:
  1027. dbdimp.c:2225: error: ‘imp_dbh_t’ has no member named ‘has_transactions’
  1028. dbdimp.c:2242: error: ‘imp_dbh_t’ has no member named ‘auto_reconnect’
  1029. dbdimp.c:2242: warning: passing argument 2 of ‘Perl_newSViv’ makes integer from pointer without a cast
  1030. dbdimp.c:2247: error: ‘imp_dbh_t’ has no member named ‘bind_type_guessing’
  1031. dbdimp.c:2247: warning: passing argument 2 of ‘Perl_newSViv’ makes integer from pointer without a cast
  1032. dbdimp.c:2251: error: ‘imp_dbh_t’ has no member named ‘pmysql’
  1033. dbdimp.c:2255: error: ‘imp_dbh_t’ has no member named ‘pmysql’
  1034. dbdimp.c:2255: warning: initialization makes pointer from integer without a cast
  1035. dbdimp.c:2269: error: ‘imp_dbh_t’ has no member named ‘stats’
  1036. dbdimp.c:2269: error: request for member ‘auto_reconnects_ok’ in something not a structure or union
  1037. dbdimp.c:2269: warning: passing argument 2 of ‘Perl_newSViv’ makes integer from pointer without a cast
  1038. dbdimp.c:2276: error: ‘imp_dbh_t’ has no member named ‘stats’
  1039. dbdimp.c:2276: error: request for member ‘auto_reconnects_failed’ in something not a structure or union
  1040. dbdimp.c:2276: warning: passing argument 2 of ‘Perl_newSViv’ makes integer from pointer without a cast
  1041. dbdimp.c:2290: error: ‘imp_dbh_t’ has no member named ‘pmysql’
  1042. dbdimp.c:2290: warning: initialization makes pointer from integer without a cast
  1043. dbdimp.c:2299: error: ‘imp_dbh_t’ has no member named ‘pmysql’
  1044. dbdimp.c:2299: warning: initialization makes pointer from integer without a cast
  1045. dbdimp.c:2304: error: ‘imp_dbh_t’ has no member named ‘pmysql’
  1046. dbdimp.c:2304: warning: passing argument 2 of ‘Perl_sv_2mortal’ makes pointer from integer without a cast
  1047. dbdimp.c:2309: error: ‘imp_dbh_t’ has no member named ‘no_autocommit_cmd’
  1048. dbdimp.c:2309: warning: passing argument 2 of ‘Perl_newSViv’ makes integer from pointer without a cast
  1049. dbdimp.c:2314: error: ‘imp_dbh_t’ has no member named ‘pmysql’
  1050. dbdimp.c:2320: error: ‘imp_dbh_t’ has no member named ‘pmysql’
  1051. dbdimp.c:2320: warning: initialization makes pointer from integer without a cast
  1052. dbdimp.c:2325: error: ‘imp_dbh_t’ has no member named ‘pmysql’
  1053. dbdimp.c:2327: error: ‘imp_dbh_t’ has no member named ‘pmysql’
  1054. dbdimp.c:2327: error: ‘sql_type_info_t’ has no member named ‘net’
  1055. dbdimp.c:2327: error: request for member ‘fd’ in something not a structure or union
  1056. dbdimp.c:2330: error: ‘imp_dbh_t’ has no member named ‘pmysql’
  1057. dbdimp.c:2330: warning: initialization makes pointer from integer without a cast
  1058. dbdimp.c:2337: error: ‘imp_dbh_t’ has no member named ‘pmysql’
  1059. dbdimp.c:2337: warning: initialization makes pointer from integer without a cast
  1060. dbdimp.c:2342: error: ‘imp_dbh_t’ has no member named ‘use_server_side_prepare’
  1061. dbdimp.c:2347: error: ‘imp_dbh_t’ has no member named ‘pmysql’
  1062. dbdimp.c: In function ‘mysql_st_prepare’:
  1063. dbdimp.c:2396: error: ‘MYSQL_VERSION_ID’ undeclared (first use in this function)
  1064. dbdimp.c:2396: warning: format ‘%d’ expects type ‘int’, but argument 3 has type ‘const struct sql_type_info_t *’
  1065. dbdimp.c:2411: error: ‘imp_sth_t’ has no member named ‘done_desc’
  1066. dbdimp.c:2412: error: ‘imp_sth_t’ has no member named ‘result’
  1067. dbdimp.c:2413: error: ‘imp_sth_t’ has no member named ‘currow’
  1068. dbdimp.c:2417: error: ‘imp_sth_t’ has no member named ‘use_mysql_use_result’
  1069. dbdimp.c:2418: error: ‘imp_dbh_t’ has no member named ‘use_mysql_use_result’
  1070. dbdimp.c:2418: warning: pointer/integer type mismatch in conditional expression
  1071. dbdimp.c:2421: error: ‘imp_sth_t’ has no member named ‘av_attr’
  1072. dbdimp.c:2421: error: assignment of read-only location
  1073. dbdimp.c:2610: error: ‘imp_sth_t’ has no member named ‘params’
  1074. dbdimp.c: In function ‘mysql_st_free_result_sets’:
  1075. dbdimp.c:2680: error: ‘imp_sth_t’ has no member named ‘result’
  1076. dbdimp.c:2682: error: ‘imp_sth_t’ has no member named ‘result’
  1077. dbdimp.c:2683: error: ‘imp_sth_t’ has no member named ‘result’
  1078. dbdimp.c: At top level:
  1079. dbdimp.c:2847: error: expected ‘=’, ‘,’, ‘;’, ‘asm’ or ‘__attribute__’ before ‘mysql_st_internal_execute’
  1080. dbdimp.c: In function ‘mysql_st_execute’:
  1081. dbdimp.c:3148: error: ‘imp_sth_t’ has no member named ‘av_attr’
  1082. dbdimp.c:3148: error: used struct type value where scalar is required
  1083. dbdimp.c:3149: error: ‘imp_sth_t’ has no member named ‘av_attr’
  1084. dbdimp.c:3149: error: cannot convert to a pointer type
  1085. dbdimp.c:3151: error: ‘imp_sth_t’ has no member named ‘av_attr’
  1086. dbdimp.c:3151: error: assignment of read-only location
  1087. dbdimp.c:3184: error: ‘imp_sth_t’ has no member named ‘row_num’
  1088. dbdimp.c:3189: error: ‘imp_sth_t’ has no member named ‘params’
  1089. dbdimp.c:3190: error: ‘imp_sth_t’ has no member named ‘result’
  1090. dbdimp.c:3191: error: ‘imp_dbh_t’ has no member named ‘pmysql’
  1091. dbdimp.c:3192: error: ‘imp_sth_t’ has no member named ‘use_mysql_use_result’
  1092. dbdimp.c:3195: error: ‘imp_sth_t’ has no member named ‘row_num’
  1093. dbdimp.c:3195: error: ‘my_ulonglong’ undeclared (first use in this function)
  1094. dbdimp.c:3197: error: ‘imp_sth_t’ has no member named ‘result’
  1095. dbdimp.c:3199: error: ‘imp_sth_t’ has no member named ‘insertid’
  1096. dbdimp.c:3199: error: ‘imp_dbh_t’ has no member named ‘pmysql’
  1097. dbdimp.c:3208: error: ‘imp_sth_t’ has no member named ‘result’
  1098. dbdimp.c:3210: error: ‘imp_sth_t’ has no member named ‘done_desc’
  1099. dbdimp.c:3211: error: ‘imp_sth_t’ has no member named ‘fetch_done’
  1100. dbdimp.c:3215: error: ‘imp_sth_t’ has no member named ‘warning_count’
  1101. dbdimp.c:3223: error: ‘imp_sth_t’ has no member named ‘row_num’
  1102. dbdimp.c:3223: warning: format ‘%llu’ expects type ‘long long unsigned int’, but argument 5 has type ‘const struct sql_type_info_t *’
  1103. dbdimp.c:3229: error: ‘imp_sth_t’ has no member named ‘row_num’
  1104. dbdimp.c: In function ‘mysql_describe’:
  1105. dbdimp.c:3351: error: ‘imp_sth_t’ has no member named ‘done_desc’
  1106. dbdimp.c: In function ‘mysql_st_fetch’:
  1107. dbdimp.c:3379: error: ‘MYSQL_ROW’ undeclared (first use in this function)
  1108. dbdimp.c:3379: error: expected ‘;’ before ‘cols’
  1109. dbdimp.c:3381: error: ‘MYSQL’ undeclared (first use in this function)
  1110. dbdimp.c:3381: error: ‘svsock’ undeclared (first use in this function)
  1111. dbdimp.c:3381: error: invalid operands to binary * (have ‘const struct sql_type_info_t *’ and ‘const struct sql_type_info_t *’)
  1112. dbdimp.c:3381: error: ‘imp_dbh_t’ has no member named ‘pmysql’
  1113. dbdimp.c:3387: error: ‘MYSQL_FIELD’ undeclared (first use in this function)
  1114. dbdimp.c:3387: error: ‘fields’ undeclared (first use in this function)
  1115. dbdimp.c:3387: error: invalid operands to binary * (have ‘const struct sql_type_info_t *’ and ‘const struct sql_type_info_t *’)
  1116. dbdimp.c:3425: error: ‘imp_sth_t’ has no member named ‘result’
  1117. dbdimp.c:3432: error: ‘imp_dbh_t’ has no member named ‘pmysql’
  1118. dbdimp.c:3432: error: ‘sql_type_info_t’ has no member named ‘net’
  1119. dbdimp.c:3432: error: request for member ‘last_errno’ in something not a structure or union
  1120. dbdimp.c:3563: error: ‘imp_sth_t’ has no member named ‘currow’
  1121. dbdimp.c:3563: error: lvalue required as increment operand
  1122. dbdimp.c:3563: error: lvalue required as increment operand
  1123. dbdimp.c:3568: error: ‘imp_sth_t’ has no member named ‘result’
  1124. dbdimp.c:3568: warning: format ‘%08lx’ expects type ‘long unsigned int’, but argument 3 has type ‘const struct sql_type_info_t *’
  1125. dbdimp.c:3570: error: ‘imp_sth_t’ has no member named ‘result’
  1126. dbdimp.c:3570: warning: format ‘%llu’ expects type ‘long long unsigned int’, but argument 3 has type ‘int’
  1127. dbdimp.c:3572: error: ‘imp_sth_t’ has no member named ‘result’
  1128. dbdimp.c:3572: warning: format ‘%llu’ expects type ‘long long unsigned int’, but argument 3 has type ‘int’
  1129. dbdimp.c:3574: error: ‘imp_dbh_t’ has no member named ‘pmysql’
  1130. dbdimp.c:3574: warning: format ‘%llu’ expects type ‘long long unsigned int’, but argument 3 has type ‘int’
  1131. dbdimp.c:3576: error: ‘imp_sth_t’ has no member named ‘currow’
  1132. dbdimp.c:3576: warning: format ‘%d’ expects type ‘int’, but argument 4 has type ‘const struct sql_type_info_t *’
  1133. dbdimp.c:3579: error: ‘cols’ undeclared (first use in this function)
  1134. dbdimp.c:3579: error: ‘imp_sth_t’ has no member named ‘result’
  1135. dbdimp.c:3585: error: ‘imp_dbh_t’ has no member named ‘pmysql’
  1136. dbdimp.c:3586: error: ‘imp_dbh_t’ has no member named ‘pmysql’
  1137. dbdimp.c:3587: error: ‘imp_dbh_t’ has no member named ‘pmysql’
  1138. dbdimp.c:3588: warning: passing argument 3 of ‘mysql_dr_error’ makes pointer from integer without a cast
  1139. dbdimp.c:3598: error: ‘imp_sth_t’ has no member named ‘result’
  1140. dbdimp.c:3599: error: ‘imp_sth_t’ has no member named ‘result’
  1141. dbdimp.c:3600: error: ‘imp_sth_t’ has no member named ‘result’
  1142. dbdimp.c:3600: warning: assignment makes pointer from integer without a cast
  1143. dbdimp.c:3640: error: incompatible types in initialization
  1144. dbdimp.c: In function ‘mysql_st_destroy’:
  1145. dbdimp.c:3828: error: ‘imp_sth_t’ has no member named ‘params’
  1146. dbdimp.c:3830: error: ‘imp_sth_t’ has no member named ‘params’
  1147. dbdimp.c:3830: warning: passing argument 1 of ‘free_param’ from incompatible pointer type
  1148. dbdimp.c:3831: error: ‘imp_sth_t’ has no member named ‘params’
  1149. dbdimp.c:3837: error: ‘imp_sth_t’ has no member named ‘av_attr’
  1150. dbdimp.c:3837: error: used struct type value where scalar is required
  1151. dbdimp.c:3838: error: ‘imp_sth_t’ has no member named ‘av_attr’
  1152. dbdimp.c:3838: error: cannot convert to a pointer type
  1153. dbdimp.c:3839: error: ‘imp_sth_t’ has no member named ‘av_attr’
  1154. dbdimp.c:3839: error: assignment of read-only location
  1155. dbdimp.c: In function ‘mysql_st_STORE_attrib’:
  1156. dbdimp.c:3883: error: ‘imp_sth_t’ has no member named ‘use_mysql_use_result’
  1157. dbdimp.c: At top level:
  1158. dbdimp.c:3931: error: expected declaration specifiers or ‘...’ before ‘MYSQL_RES’
  1159. dbdimp.c: In function ‘mysql_st_FETCH_internal’:
  1160. dbdimp.c:3937: error: ‘MYSQL_FIELD’ undeclared (first use in this function)
  1161. dbdimp.c:3937: error: ‘curField’ undeclared (first use in this function)
  1162. dbdimp.c:3937: error: invalid operands to binary * (have ‘const struct sql_type_info_t *’ and ‘const struct sql_type_info_t *’)
  1163. dbdimp.c:3944: error: ‘imp_sth_t’ has no member named ‘av_attr’
  1164. dbdimp.c:3944: error: invalid operands to binary && (have ‘int’ and ‘struct sql_type_info_s’)
  1165. dbdimp.c:3945: error: ‘imp_sth_t’ has no member named ‘av_attr’
  1166. dbdimp.c:3945: error: incompatible types in assignment
  1167. dbdimp.c:3948: error: ‘res’ undeclared (first use in this function)
  1168. dbdimp.c:3962: error: ‘sql_type_info_t’ has no member named ‘name’
  1169. dbdimp.c:3962: error: ‘sql_type_info_t’ has no member named ‘name’
  1170. dbdimp.c:3962: warning: passing argument 1 of ‘strlen’ from incompatible pointer type
  1171. dbdimp.c:3962: warning: passing argument 2 of ‘Perl_newSVpv’ from incompatible pointer type
  1172. dbdimp.c:3966: error: ‘sql_type_info_t’ has no member named ‘table’
  1173. dbdimp.c:3966: error: ‘sql_type_info_t’ has no member named ‘table’
  1174. dbdimp.c:3966: warning: passing argument 1 of ‘strlen’ from incompatible pointer type
  1175. dbdimp.c:3966: warning: passing argument 2 of ‘Perl_newSVpv’ from incompatible pointer type
  1176. dbdimp.c:3970: error: ‘sql_type_info_t’ has no member named ‘type’
  1177. dbdimp.c:3974: error: ‘sql_type_info_t’ has no member named ‘type’
  1178. dbdimp.c:3974: warning: passing argument 1 of ‘native2sql’ makes integer from pointer without a cast
  1179. dbdimp.c:3977: error: ‘sql_type_info_t’ has no member named ‘flags’
  1180. dbdimp.c:3981: error: ‘sql_type_info_t’ has no member named ‘flags’
  1181. dbdimp.c:3985: error: ‘sql_type_info_t’ has no member named ‘flags’
  1182. dbdimp.c:3989: error: ‘sql_type_info_t’ has no member named ‘length’
  1183. dbdimp.c:3993: error: ‘sql_type_info_t’ has no member named ‘type’
  1184. dbdimp.c:3993: warning: passing argument 1 of ‘native2sql’ makes integer from pointer without a cast
  1185. dbdimp.c:3997: error: ‘sql_type_info_t’ has no member named ‘type’
  1186. dbdimp.c:3997: warning: passing argument 1 of ‘native2sql’ makes integer from pointer without a cast
  1187. dbdimp.c:4001: error: ‘sql_type_info_t’ has no member named ‘max_length’
  1188. dbdimp.c:4013: error: ‘sql_type_info_t’ has no member named ‘flags’
  1189. dbdimp.c:4013: error: ‘PRI_KEY_FLAG’ undeclared (first use in this function)
  1190. dbdimp.c:4013: error: ‘UNIQUE_KEY_FLAG’ undeclared (first use in this function)
  1191. dbdimp.c:4013: error: invalid operands to binary | (have ‘const struct sql_type_info_t *’ and ‘const struct sql_type_info_t *’)
  1192. dbdimp.c:4013: error: ‘MULTIPLE_KEY_FLAG’ undeclared (first use in this function)
  1193. dbdimp.c:4013: error: invalid operands to binary | (have ‘const struct sql_type_info_t *’ and ‘const struct sql_type_info_t *’)
  1194. dbdimp.c:4013: error: invalid operands to binary & (have ‘const struct sql_type_info_t *’ and ‘const struct sql_type_info_t *’)
  1195. dbdimp.c:4017: error: ‘sql_type_info_t’ has no member named ‘flags’
  1196. dbdimp.c:4021: error: ‘sql_type_info_t’ has no member named ‘decimals’
  1197. dbdimp.c:4025: error: ‘sql_type_info_t’ has no member named ‘length’
  1198. dbdimp.c:4025: error: ‘sql_type_info_t’ has no member named ‘max_length’
  1199. dbdimp.c:4025: error: ‘sql_type_info_t’ has no member named ‘length’
  1200. dbdimp.c:4025: error: ‘sql_type_info_t’ has no member named ‘max_length’
  1201. dbdimp.c:4025: warning: passing argument 2 of ‘Perl_newSViv’ makes integer from pointer without a cast
  1202. dbdimp.c:4040: error: ‘imp_sth_t’ has no member named ‘av_attr’
  1203. dbdimp.c:4040: error: assignment of read-only location
  1204. dbdimp.c: In function ‘mysql_st_FETCH_attrib’:
  1205. dbdimp.c:4091: error: ‘imp_sth_t’ has no member named ‘result’
  1206. dbdimp.c:4091: warning: passing argument 3 of ‘mysql_st_FETCH_internal’ makes integer from pointer without a cast
  1207. dbdimp.c:4091: error: too many arguments to function ‘mysql_st_FETCH_internal’
  1208. dbdimp.c:4093: error: ‘imp_sth_t’ has no member named ‘result’
  1209. dbdimp.c:4093: warning: passing argument 3 of ‘mysql_st_FETCH_internal’ makes integer from pointer without a cast
  1210. dbdimp.c:4093: error: too many arguments to function ‘mysql_st_FETCH_internal’
  1211. dbdimp.c:4097: error: ‘imp_sth_t’ has no member named ‘result’
  1212. dbdimp.c:4097: warning: passing argument 3 of ‘mysql_st_FETCH_internal’ makes integer from pointer without a cast
  1213. dbdimp.c:4097: error: too many arguments to function ‘mysql_st_FETCH_internal’
  1214. dbdimp.c:4109: error: ‘imp_sth_t’ has no member named ‘params’
  1215. dbdimp.c:4109: error: ‘struct sql_type_info_s’ has no member named ‘value’
  1216. dbdimp.c:4109: warning: passing argument 2 of ‘Perl_newSVsv’ from incompatible pointer type
  1217. dbdimp.c:4118: error: ‘imp_sth_t’ has no member named ‘result’
  1218. dbdimp.c:4118: warning: passing argument 3 of ‘mysql_st_FETCH_internal’ makes integer from pointer without a cast
  1219. dbdimp.c:4118: error: too many arguments to function ‘mysql_st_FETCH_internal’
  1220. dbdimp.c:4122: error: ‘imp_sth_t’ has no member named ‘result’
  1221. dbdimp.c:4122: warning: passing argument 3 of ‘mysql_st_FETCH_internal’ makes integer from pointer without a cast
  1222. dbdimp.c:4122: error: too many arguments to function ‘mysql_st_FETCH_internal’
  1223. dbdimp.c:4128: error: ‘imp_sth_t’ has no member named ‘result’
  1224. dbdimp.c:4128: warning: passing argument 3 of ‘mysql_st_FETCH_internal’ makes integer from pointer without a cast
  1225. dbdimp.c:4128: error: too many arguments to function ‘mysql_st_FETCH_internal’
  1226. dbdimp.c:4132: error: ‘imp_sth_t’ has no member named ‘result’
  1227. dbdimp.c:4132: warning: passing argument 3 of ‘mysql_st_FETCH_internal’ makes integer from pointer without a cast
  1228. dbdimp.c:4132: error: too many arguments to function ‘mysql_st_FETCH_internal’
  1229. dbdimp.c:4136: error: ‘imp_sth_t’ has no member named ‘result’
  1230. dbdimp.c:4136: warning: passing argument 3 of ‘mysql_st_FETCH_internal’ makes integer from pointer without a cast
  1231. dbdimp.c:4136: error: too many arguments to function ‘mysql_st_FETCH_internal’
  1232. dbdimp.c:4138: error: ‘imp_sth_t’ has no member named ‘result’
  1233. dbdimp.c:4138: warning: passing argument 3 of ‘mysql_st_FETCH_internal’ makes integer from pointer without a cast
  1234. dbdimp.c:4138: error: too many arguments to function ‘mysql_st_FETCH_internal’
  1235. dbdimp.c:4140: error: ‘imp_sth_t’ has no member named ‘result’
  1236. dbdimp.c:4140: warning: passing argument 3 of ‘mysql_st_FETCH_internal’ makes integer from pointer without a cast
  1237. dbdimp.c:4140: error: too many arguments to function ‘mysql_st_FETCH_internal’
  1238. dbdimp.c:4142: error: ‘imp_sth_t’ has no member named ‘result’
  1239. dbdimp.c:4146: error: ‘imp_sth_t’ has no member named ‘result’
  1240. dbdimp.c:4146: warning: passing argument 3 of ‘mysql_st_FETCH_internal’ makes integer from pointer without a cast
  1241. dbdimp.c:4146: error: too many arguments to function ‘mysql_st_FETCH_internal’
  1242. dbdimp.c:4153: error: ‘imp_sth_t’ has no member named ‘insertid’
  1243. dbdimp.c:4153: warning: format ‘%d’ expects type ‘int’, but argument 3 has type ‘const struct sql_type_info_t *’
  1244. dbdimp.c:4155: error: ‘imp_sth_t’ has no member named ‘insertid’
  1245. dbdimp.c:4155: warning: passing argument 2 of ‘Perl_sv_2mortal’ makes pointer from integer without a cast
  1246. dbdimp.c:4160: error: ‘imp_sth_t’ has no member named ‘result’
  1247. dbdimp.c:4160: warning: passing argument 3 of ‘mysql_st_FETCH_internal’ makes integer from pointer without a cast
  1248. dbdimp.c:4160: error: too many arguments to function ‘mysql_st_FETCH_internal’
  1249. dbdimp.c:4164: error: ‘imp_sth_t’ has no member named ‘result’
  1250. dbdimp.c:4164: warning: passing argument 3 of ‘mysql_st_FETCH_internal’ makes integer from pointer without a cast
  1251. dbdimp.c:4164: error: too many arguments to function ‘mysql_st_FETCH_internal’
  1252. dbdimp.c:4166: error: ‘imp_sth_t’ has no member named ‘result’
  1253. dbdimp.c:4166: warning: passing argument 3 of ‘mysql_st_FETCH_internal’ makes integer from pointer without a cast
  1254. dbdimp.c:4166: error: too many arguments to function ‘mysql_st_FETCH_internal’
  1255. dbdimp.c:4168: error: ‘imp_sth_t’ has no member named ‘use_mysql_use_result’
  1256. dbdimp.c:4172: error: ‘imp_sth_t’ has no member named ‘warning_count’
  1257. dbdimp.c:4184: error: ‘imp_sth_t’ has no member named ‘result’
  1258. dbdimp.c:4184: warning: passing argument 3 of ‘mysql_st_FETCH_internal’ makes integer from pointer without a cast
  1259. dbdimp.c:4184: error: too many arguments to function ‘mysql_st_FETCH_internal’
  1260. dbdimp.c: In function ‘mysql_bind_ph’:
  1261. dbdimp.c:4308: error: ‘imp_sth_t’ has no member named ‘params’
  1262. dbdimp.c:4308: warning: passing argument 1 of ‘bind_param’ from incompatible pointer type
  1263. dbdimp.c: In function ‘mysql_db_reconnect’:
  1264. dbdimp.c:4430: error: ‘MYSQL’ undeclared (first use in this function)
  1265. dbdimp.c:4430: error: expected ‘;’ before ‘save_socket’
  1266. dbdimp.c:4440: error: ‘imp_dbh_t’ has no member named ‘pmysql’
  1267. dbdimp.c:4440: error: ‘CR_SERVER_GONE_ERROR’ undeclared (first use in this function)
  1268. dbdimp.c:4440: warning: comparison between pointer and integer
  1269. dbdimp.c:4444: error: ‘imp_dbh_t’ has no member named ‘auto_reconnect’
  1270. dbdimp.c:4458: error: ‘save_socket’ undeclared (first use in this function)
  1271. dbdimp.c:4458: error: ‘imp_dbh_t’ has no member named ‘pmysql’
  1272. dbdimp.c:4459: error: ‘imp_dbh_t’ has no member named ‘pmysql’
  1273. dbdimp.c:4459: warning: passing argument 3 of ‘__builtin___memcpy_chk’ makes integer from pointer without a cast
  1274. dbdimp.c:4459: error: ‘imp_dbh_t’ has no member named ‘pmysql’
  1275. dbdimp.c:4459: warning: passing argument 3 of ‘__inline_memcpy_chk’ makes integer from pointer without a cast
  1276. dbdimp.c:4460: error: ‘imp_dbh_t’ has no member named ‘pmysql’
  1277. dbdimp.c:4460: error: ‘imp_dbh_t’ has no member named ‘pmysql’
  1278. dbdimp.c:4460: error: ‘imp_dbh_t’ has no member named ‘pmysql’
  1279. dbdimp.c:4460: error: ‘imp_dbh_t’ has no member named ‘pmysql’
  1280. dbdimp.c:4460: warning: passing argument 1 of ‘__builtin___memset_chk’ discards qualifiers from pointer target type
  1281. dbdimp.c:4460: error: ‘imp_dbh_t’ has no member named ‘pmysql’
  1282. dbdimp.c:4460: error: ‘imp_dbh_t’ has no member named ‘pmysql’
  1283. dbdimp.c:4460: warning: passing argument 1 of ‘__inline_memset_chk’ discards qualifiers from pointer target type
  1284. dbdimp.c:4468: error: ‘imp_dbh_t’ has no member named ‘pmysql’
  1285. dbdimp.c:4468: error: ‘imp_dbh_t’ has no member named ‘pmysql’
  1286. dbdimp.c:4469: warning: passing argument 3 of ‘mysql_dr_error’ makes pointer from integer without a cast
  1287. dbdimp.c:4470: error: ‘imp_dbh_t’ has no member named ‘pmysql’
  1288. dbdimp.c:4470: error: ‘imp_dbh_t’ has no member named ‘pmysql’
  1289. dbdimp.c:4470: error: ‘imp_dbh_t’ has no member named ‘pmysql’
  1290. dbdimp.c:4470: warning: passing argument 1 of ‘__builtin___memcpy_chk’ discards qualifiers from pointer target type
  1291. dbdimp.c:4470: warning: passing argument 3 of ‘__builtin___memcpy_chk’ makes integer from pointer without a cast
  1292. dbdimp.c:4470: error: ‘imp_dbh_t’ has no member named ‘pmysql’
  1293. dbdimp.c:4470: warning: passing argument 1 of ‘__inline_memcpy_chk’ discards qualifiers from pointer target type
  1294. dbdimp.c:4470: warning: passing argument 3 of ‘__inline_memcpy_chk’ makes integer from pointer without a cast
  1295. dbdimp.c:4471: error: ‘imp_dbh_t’ has no member named ‘stats’
  1296. dbdimp.c:4471: error: request for member ‘auto_reconnects_failed’ in something not a structure or union
  1297. dbdimp.c:4471: error: lvalue required as increment operand
  1298. dbdimp.c:4471: error: lvalue required as increment operand
  1299. dbdimp.c:4480: error: ‘imp_dbh_t’ has no member named ‘stats’
  1300. dbdimp.c:4480: error: request for member ‘auto_reconnects_ok’ in something not a structure or union
  1301. dbdimp.c:4480: error: lvalue required as increment operand
  1302. dbdimp.c:4480: error: lvalue required as increment operand
  1303. dbdimp.c: In function ‘mysql_db_quote’:
  1304. dbdimp.c:4640: error: ‘imp_dbh_t’ has no member named ‘pmysql’
  1305. dbdimp.c: In function ‘mysql_db_last_insert_id’:
  1306. dbdimp.c:4663: error: ‘imp_dbh_t’ has no member named ‘pmysql’
  1307. dbdimp.c:4663: warning: passing argument 2 of ‘Perl_sv_2mortal’ makes pointer from integer without a cast
  1308. lipo: can't open input file: /var/tmp//ccRuKkvT.out (No such file or directory)
  1309. make: *** [dbdimp.o] Error 1
  1310.   CAPTTOFU/DBD-mysql-4.013.tar.gz
  1311.   make -- NOT OK
  1312. Running make test
  1313.   Can't test without successful make
  1314. Running make install
  1315.   Make had returned bad status, install seems impossible
  1316. Failed during this command:
  1317.  CAPTTOFU/DBD-mysql-4.013.tar.gz              : make NO