Pastebin launched a little side project called HostCabi.net, check it out ;-)Don't like ads? PRO users don't see any ads ;-)
Guest

Hillshum

By: a guest on Apr 7th, 2009  |  syntax: Bash  |  size: 1.07 KB  |  hits: 232  |  expires: Never
download  |  raw  |  embed  |  report abuse  |  print
Text below is selected. Please press Ctrl+C to copy to your clipboard. (⌘+C on Mac)
  1. m-elf/arm-elf/include -isystem /usr/local/arm-elf/arm-elf/sys-include -O2  -DIN_GCC -DCROSS_COMPILE   -W -Wall -Wwrite-strings -Wstrict-prototypes -Wmissing-prototypes -Wold-style-definition  -isystem ./include  -Dinhibit_libc -fno-inline -g  -DIN_LIBGCC2 -D__GCC_FLOAT_NOT_NEEDED -Dinhibit_libc -I. -I. -I../../gcc-4.0.3/gcc -I../../gcc-4.0.3/gcc/. -I../../gcc-4.0.3/gcc/../include -I../../gcc-4.0.3/gcc/../libcpp/include  -mcpu=arm1136jf-s -mthumb-interwork -DL_mulsc3 -c ../../gcc-4.0.3/gcc/libgcc2.c -o libgcc/arm1136jf-s/interwork/_mulsc3.o
  2. ../../gcc-4.0.3/gcc/libgcc2.c: In function __mulsc3:
  3. ../../gcc-4.0.3/gcc/libgcc2.c:1696: internal compiler error: Segmentation fault
  4. Please submit a full bug report,
  5. with preprocessed source if appropriate.
  6. See <URL:http://gcc.gnu.org/bugs.html> for instructions.
  7. make[2]: *** [libgcc/arm1136jf-s/interwork/_mulsc3.o] Error 1
  8. make[2]: Leaving directory `/tmp/rbdev-build/build-gcc/gcc'
  9. make[1]: *** [stmp-multilib] Error 2
  10. make[1]: Leaving directory `/tmp/rbdev-build/build-gcc/gcc'
  11. make: *** [all-gcc] Error 2
  12. hillshum@UNX tools $