Guest User

cojack

a guest
Sep 23rd, 2009
207
0
Never
Not a member of Pastebin yet? Sign Up, it unlocks many cool features!
Bash 105.66 KB | None | 0 0
  1. [localhost][/home/cojack/Dokumenty/abs/kadu] # makepkg --assroot
  2. makepkg: nierozpoznana opcja '--assroot'                        
  3.  
  4. makepkg (pacman) 3.3.0
  5.  
  6. Użycie: /usr/bin/makepkg [opcje]
  7.  
  8. Opcje:
  9.   -A, --ignorearch Ignoruj niekompletne pole arch w PKGBUILD
  10.   -c, --clean      Usuń plik robocze po wszystkim          
  11.   -C, --cleancache Usuń pliki źr�dłowe z pamięci podręcznej
  12.   --config <konfiguracja> U&#380;yj alternatywnego pliku konfiguracyjnego (zamiast '/etc/makepkg.conf')
  13.   -d, --nodeps     Pomija sprawdzanie zale&#380;no&#347;ci                                                  
  14.   -e, --noextract  Nie rozpakowuj &#378;r�de&#322; (u&#380;yj istniej&#261;cego katalogu src/)                        
  15.   -f, --force      Nadpisuje istniej&#261;ce pakiety                                                  
  16.   -g, --geninteg   Wygeneruj symy kontrolne dla &#378;r�de&#322;                                            
  17.   -h, --help       Niniejsza pomoc                                                                
  18.   -i, --install     Zainstaluj pakiet po udanej budowie                                          
  19.   -L, --log        Stw�rz dziennik budowy pakietu                                                
  20.   -m, --nocolor    Wy&#322;&#261;cz kolorowe komunikaty                                                    
  21.   -o, --nobuild    Tylko pobierz i rozpakuj pliki                                                
  22.   -p <buildscript> U&#380;yj alternatywnego skryptu budowy (zamiast 'PKGBUILD')                        
  23.   -r, --rmdeps     Usu&#324; zainstalowane zale&#380;no&#347;ci po udanym budowaniu                              
  24.   -R, --repackage  Przepakuj zawarto&#347;&#263; pakietu bez ponownego budowania                            
  25.   -s, --syncdeps   Zainstaluj brakuj&#261;ce zale&#380;no&#347;ci pacmanem                                      
  26.       --allsource  Generuje archiwum &#378;r�d&#322;owe zawieraj&#261;ce pobrane &#378;r�d&#322;a                          
  27.       --asroot     Pozw�l makepkg pracowa&#263; jako root                                              
  28.       --holdver    Zapobiega autopodnoszeniu wersji dla rozwojowych PKGBUILD�w                    
  29.       --source     Generuje archiwum &#378;r�d&#322;owe bez pobranych &#378;r�de&#322;                                
  30.  
  31. Poni&#380;sze opcje mog&#261; by&#263; przekazane do pacmana:
  32.  
  33.       --noconfirm      Nie pyta o potwierdzenie przy rozwi&#261;zywaniu zale&#380;no&#347;ci
  34.       --noprogressbar  Wy&#322;&#261;cza pasek post&#281;pu podczas pobierania plik�w      
  35.  
  36. Je&#380;eli nie u&#380;ytko -p, makepkg b&#281;dzie szuka&#263; 'PKGBUILD'
  37.  
  38. [localhost][/home/cojack/Dokumenty/abs/kadu] # makepkg --asroot
  39. ==> Tworz&#281; pakiet: kadu 0.6.5.3-1 i686 (&#347;ro, 23 wrz 2009, 11:08:46 CEST)
  40. ==> Sprawdzanie zale&#380;no&#347;ci dla uruchomienia...                          
  41. ==> Sprawdzanie zale&#380;no&#347;ci dla zbudowania...                            
  42. ==> Pobieranie &#378;r�de&#322;...                                                
  43.   -> Znaleziono kadu-0.6.5.3.tar.bz2 w katalogu budowania              
  44. ==> Sprawdzam pliki &#378;r�d&#322;owe przy u&#380;yciu md5sums...                    
  45.     kadu-0.6.5.3.tar.bz2 ... Zgadza si&#281;                                
  46. ==> Rozpakowuj&#281; &#378;r�d&#322;a...                                              
  47.   -> bsdtar -x -f "kadu-0.6.5.3.tar.bz2"                                
  48. ==> Usuwam istniej&#261;cy katalog pkg/...                                  
  49. ==> Uruchamiam build()...                                              
  50. cp: nie mo&#380;na wykona&#263; stat na `/home/cojack/Dokumenty/abs/kadu/src/mod-*.diff': Nie ma takiego pliku ani katalogu
  51. -- 32 bit architecture detected                                                                                  
  52. -- DATADIR: /usr/share                                                                                          
  53. -- LIBDIR: /usr/lib                                                                                              
  54. -- BINDIR: /usr/bin                                                                                              
  55. #define GG_CONFIG_HAVE_PTHREAD                                                                                  
  56. running cd "/home/cojack/Dokumenty/abs/kadu/src/kadu/modules" && /home/cojack/Dokumenty/abs/kadu/src/kadu/varia/scripts/autodownload module anonymous_check  2>&1                                                                                                                        
  57. >>> Downloading module anonymous_check                                                                                                      
  58. >>> Unpacking anonymous_check module                                                                                                        
  59. >>> module downloaded and unpacked successfully                                                                                              
  60. running cd "/home/cojack/Dokumenty/abs/kadu/src/kadu/modules" && /home/cojack/Dokumenty/abs/kadu/src/kadu/varia/scripts/autodownload module globalhotkeys  2>&1                                                                                                                          
  61. >>> Downloading module globalhotkeys                                                                                                        
  62. >>> Unpacking globalhotkeys module                                                                                                          
  63. >>> module downloaded and unpacked successfully                                                                                              
  64. running cd "/home/cojack/Dokumenty/abs/kadu/src/kadu/modules" && /home/cojack/Dokumenty/abs/kadu/src/kadu/varia/scripts/autodownload module kde_notify  2>&1                                                                                                                              
  65. >>> Downloading module kde_notify                                                                                                            
  66. >>> Unpacking kde_notify module                                                                                                              
  67. >>> module downloaded and unpacked successfully                                                                                              
  68. running cd "/home/cojack/Dokumenty/abs/kadu/src/kadu/modules" && /home/cojack/Dokumenty/abs/kadu/src/kadu/varia/scripts/autodownload module led_notify  2>&1                                                                                                                              
  69. >>> Downloading module led_notify                                                                                                            
  70. >>> Unpacking led_notify module                                                                                                              
  71. >>> module downloaded and unpacked successfully                                                                                              
  72. running cd "/home/cojack/Dokumenty/abs/kadu/src/kadu/modules" && /home/cojack/Dokumenty/abs/kadu/src/kadu/varia/scripts/autodownload module mail  2>&1                                                                                                                                    
  73. >>> Downloading module mail                                                                                                                  
  74. >>> Unpacking mail module                                                                                                                    
  75. >>> module downloaded and unpacked successfully                                                                                              
  76. running cd "/home/cojack/Dokumenty/abs/kadu/src/kadu/modules" && /home/cojack/Dokumenty/abs/kadu/src/kadu/varia/scripts/autodownload module mime_tex  2>&1                                                                                                                                
  77. >>> Downloading module mime_tex                                                                                                              
  78. >>> Unpacking mime_tex module                                                                                                                
  79. >>> module downloaded and unpacked successfully                                                                                              
  80. running cd "/home/cojack/Dokumenty/abs/kadu/src/kadu/modules" && /home/cojack/Dokumenty/abs/kadu/src/kadu/varia/scripts/autodownload module mx610_notify  2>&1                                                                                                                            
  81. >>> Downloading module mx610_notify                                                                                                          
  82. >>> Unpacking mx610_notify module                                                                                                            
  83. >>> module downloaded and unpacked successfully                                                                                              
  84. running cd "/home/cojack/Dokumenty/abs/kadu/src/kadu/modules" && /home/cojack/Dokumenty/abs/kadu/src/kadu/varia/scripts/autodownload module nextinfo  2>&1                                                                                                                                
  85. >>> Downloading module nextinfo                                                                                                              
  86. >>> Unpacking nextinfo module                                                                                                                
  87. >>> module downloaded and unpacked successfully                                                                                              
  88. running cd "/home/cojack/Dokumenty/abs/kadu/src/kadu/modules" && /home/cojack/Dokumenty/abs/kadu/src/kadu/varia/scripts/autodownload module panelkadu  2>&1                                                                                                                              
  89. >>> Downloading module panelkadu                                                                                                            
  90. >>> Unpacking panelkadu module                                                                                                              
  91. >>> module downloaded and unpacked successfully                                                                                              
  92. running cd "/home/cojack/Dokumenty/abs/kadu/src/kadu/modules" && /home/cojack/Dokumenty/abs/kadu/src/kadu/varia/scripts/autodownload module plus_pl_sms  2>&1                                                                                                                            
  93. >>> Downloading module plus_pl_sms                                                                                                          
  94. >>> Unpacking plus_pl_sms module                                                                                                            
  95. >>> module downloaded and unpacked successfully                                                                                              
  96. running cd "/home/cojack/Dokumenty/abs/kadu/src/kadu/modules" && /home/cojack/Dokumenty/abs/kadu/src/kadu/varia/scripts/autodownload module senthistory  2>&1                                                                                                                            
  97. >>> Downloading module senthistory                                                                                                          
  98. >>> Unpacking senthistory module                                                                                                            
  99. >>> module downloaded and unpacked successfully                                                                                              
  100. running cd "/home/cojack/Dokumenty/abs/kadu/src/kadu/modules" && /home/cojack/Dokumenty/abs/kadu/src/kadu/varia/scripts/autodownload module tabs  2>&1                                                                                                                                    
  101. >>> Downloading module tabs                                                                                                                  
  102. >>> Unpacking tabs module                                                                                                                    
  103. >>> module downloaded and unpacked successfully                                                                                              
  104. running cd "/home/cojack/Dokumenty/abs/kadu/src/kadu/modules" && /home/cojack/Dokumenty/abs/kadu/src/kadu/varia/scripts/autodownload module water_notify  2>&1                                                                                                                            
  105. >>> Downloading module water_notify                                                                                                          
  106. >>> Unpacking water_notify module                                                                                                            
  107. >>> module downloaded and unpacked successfully                                                                                              
  108. -- Dynamic module: account_management                                                                                                        
  109. -- Dynamic module: advanced_userlist                                                                                                        
  110. -- Dynamic module: agent                                                                                                                    
  111. -- Dynamic module: alsa_sound                                                                                                                
  112. -- Dynamic module: amarok1_mediaplayer                                                                                                      
  113. -- Dynamic module: amarok2_mediaplayer                                                                                                      
  114. -- Dynamic module: anonymous_check                                                                                                          
  115. -- Dynamic module: antistring                                                                                                                
  116. -- Dynamic module: ao_sound                                                                                                                  
  117. -- Dynamic module: audacious_mediaplayer                                                                                                    
  118. -- Dynamic module: auto_hide                                                                                                                
  119. -- Dynamic module: autoaway                                                                                                                  
  120. -- Dynamic module: autoresponder                                                                                                            
  121. -- Dynamic module: autostatus                                                                                                                
  122. -- Dynamic module: bmpx_mediaplayer                                                                                                          
  123. -- Dynamic module: cenzor                                                                                                                    
  124. -- Dynamic module: config_wizard                                                                                                            
  125. -- Dynamic module: dcc                                                                                                                      
  126. -- Dynamic module: default_sms                                                                                                              
  127. -- Dynamic module: desktop_docking                                                                                                          
  128. -- Dynamic module: docking                                                                                                                  
  129. -- Dynamic module: dragon_mediaplayer                                                                                                        
  130. -- Dynamic module: dsp_sound                                                                                                                
  131. -- Dynamic module: echo                                                                                                                      
  132. -- Dynamic module: encryption                                                                                                                
  133. -- Dynamic module: encryption_old                                                                                                            
  134. -- Dynamic module: exec_notify                                                                                                              
  135. -- Dynamic module: ext_sound                                                                                                                
  136. -- Dynamic module: falf_mediaplayer                                                                                                          
  137. -- Dynamic module: filedesc                                                                                                                  
  138. -- Dynamic module: filtering                                                                                                                
  139. -- Dynamic module: firewall                                                                                                                  
  140. -- Dynamic module: gg_avatars                                                                                                                
  141. -- Dynamic module: globalhotkeys                                                                                                            
  142. -- Dynamic module: hints                                                                                                                    
  143. -- Dynamic module: history                                                                                                                  
  144. -- Dynamic module: idle                                                                                                                      
  145. -- Found X11 Screen Saver extension: /usr/lib/libXss.so                                                                                      
  146. -- Dynamic module: kde_notify                                                                                                                
  147. -- Dynamic module: last_seen                                                                                                                
  148. -- Dynamic module: led_notify                                                                                                                
  149. -- Dynamic module: mail                                                                                                                      
  150. -- Dynamic module: mediaplayer                                                                                                              
  151. -- Dynamic module: mime_tex                                                                                                                  
  152. -- Dynamic module: mx610_notify                                                                                                              
  153. -- Dynamic module: nextinfo                                                                                                                  
  154. -- Dynamic module: notify                                                                                                                    
  155. -- Dynamic module: osd_hints                                                                                                                
  156. -- Dynamic module: panelkadu                                                                                                                
  157. -- Dynamic module: parser_extender                                                                                                          
  158. -- Dynamic module: pcspeaker                                                                                                                
  159. -- Dynamic module: phonon_sound                                                                                                              
  160. -- Dynamic module: plus_pl_sms                                                                                                              
  161. -- Dynamic module: powerkadu                                                                                                                
  162. -- Dynamic module: profiles                                                                                                                  
  163. -- Dynamic module: qt4_docking                                                                                                              
  164. -- Dynamic module: qt4_sound                                                                                                                
  165. -- Dynamic module: screenshot                                                                                                                
  166. -- Dynamic module: senthistory                                                                                                              
  167. -- Dynamic module: sms                                                                                                                      
  168. -- Dynamic module: sound                                                                                                                    
  169. -- Dynamic module: speech                                                                                                                    
  170. -- Dynamic module: spellchecker                                                                                                              
  171. -- Dynamic module: split_messages                                                                                                            
  172. -- Dynamic module: tabs                                                                                                                      
  173. -- Dynamic module: vlc_mediaplayer                                                                                                          
  174. -- Dynamic module: voice                                                                                                                    
  175. -- Dynamic module: water_notify                                                                                                              
  176. -- Dynamic module: weather                                                                                                                  
  177. -- Dynamic module: winamp_mediaplayer                                                                                                        
  178. -- Dynamic module: window_notify                                                                                                            
  179. -- Dynamic module: word_fix                                                                                                                  
  180. -- Dynamic module: xmms2_mediaplayer                                                                                                        
  181. -- Dynamic module: xmms_mediaplayer                                                                                                          
  182. -- Emoticon theme: penguins                                                                                                                  
  183. -- Emoticon theme: gg6_compatible                                                                                                            
  184. -- Emoticon theme: tango                                                                                                                    
  185. -- Icon theme: default                                                                                                                      
  186. -- Icon theme: glass16                                                                                                                      
  187. -- Icon theme: glass22                                                                                                                      
  188. -- Icon theme: kadu05                                                                                                                        
  189. -- Icon theme: oxygen16                                                                                                                      
  190. -- Icon theme: tango16                                                                                                                      
  191. -- Sound theme: default                                                                                                                      
  192. -- Sound theme: bns                                                                                                                          
  193. -- Sound theme: drums                                                                                                                        
  194. -- Sound theme: florkus                                                                                                                      
  195. -- Sound theme: michalsrodek                                                                                                                
  196. -- Sound theme: percussion                                                                                                                  
  197. -- Sound theme: ultr                                                                                                                        
  198. -- Kadu (version: 0.6.5.3) will be build:                                                                                                    
  199. --  * libgadu (version 1.8.2) in                                                                                                            
  200. --  * install prefix: /usr                                                                                                                  
  201. --  * debug  (Release)                                                                                                                      
  202. -- Configuring done                                                                                                                          
  203. -- Generating done                                                                                                                          
  204. -- Build files have been written to: /home/cojack/Dokumenty/abs/kadu/src/kadu                                                                
  205. [  1%] Built target account_management-translations                                                                                          
  206. [  2%] Built target account_management                                                                                                      
  207. [  2%] Built target advanced_userlist-translations                                                                                          
  208. [  3%] Built target advanced_userlist                                                                                                        
  209. [  3%] Built target agent-translations                                                                                                      
  210. [  4%] Built target agent                                                                                                                    
  211. [  5%] Built target alsa_sound-translations                                                                                                  
  212. [  5%] Built target alsa_sound                                                                                                              
  213. [  5%] Built target amarok1_mediaplayer                                                                                                      
  214. [  6%] Built target amarok2_mediaplayer                                                                                                      
  215. Scanning dependencies of target anonymous_check-translations                                                                                
  216. [  6%] Generating anonymous_check.qm                                                                                                        
  217. Updating '/home/cojack/Dokumenty/abs/kadu/src/kadu/modules/anonymous_check/anonymous_check.qm'...                                            
  218.     Generated 10 translation(s) (10 finished and 0 unfinished)                                                                              
  219. [  6%] Built target anonymous_check-translations                                                                                            
  220. [  6%] Qt Wrapped File                                                                                                                      
  221. Scanning dependencies of target anonymous_check                                                                                              
  222. [  6%] Building CXX object modules/anonymous_check/CMakeFiles/anonymous_check.dir/anonymous_check.cpp.o                                      
  223. [  6%] Building CXX object modules/anonymous_check/CMakeFiles/anonymous_check.dir/moc_anonymous_check.cxx.o                                  
  224. Linking CXX shared module libanonymous_check.so                                                                                              
  225. [  6%] Built target anonymous_check                                                                                                          
  226. [  6%] Built target antistring-translations                                                                                                  
  227. [  7%] Built target antistring                                                                                                              
  228. [  7%] Built target ao_sound                                                                                                                
  229. [  8%] Built target audacious_mediaplayer                                                                                                    
  230. [  8%] Built target auto_hide-translations                                                                                                  
  231. [  8%] Built target auto_hide                                                                                                                
  232. [  9%] Built target autoaway-translations                                                                                                    
  233. [  9%] Built target autoaway                                                                                                                
  234. [ 10%] Built target autoresponder-translations                                                                                              
  235. [ 10%] Built target autoresponder                                                                                                            
  236. [ 10%] Built target autostatus-translations                                                                                                  
  237. [ 11%] Built target autostatus                                                                                                              
  238. [ 11%] Built target bmpx_mediaplayer                                                                                                        
  239. [ 11%] Built target cenzor-translations                                                                                                      
  240. [ 12%] Built target cenzor                                                                                                                  
  241. [ 13%] Built target config_wizard-translations                                                                                              
  242. [ 13%] Built target config_wizard                                                                                                            
  243. [ 14%] Built target dcc-translations                                                                                                        
  244. [ 16%] Built target dcc                                                                                                                      
  245. [ 17%] Built target default_sms-translations                                                                                                
  246. [ 17%] Built target default_sms                                                                                                              
  247. [ 18%] Built target desktop_docking-translations                                                                                            
  248. [ 18%] Built target desktop_docking                                                                                                          
  249. [ 19%] Built target docking-translations                                                                                                    
  250. [ 19%] Built target docking                                                                                                                  
  251. [ 19%] Built target dragon_mediaplayer                                                                                                      
  252. [ 19%] Built target dsp_sound-translations                                                                                                  
  253. [ 20%] Built target dsp_sound                                                                                                                
  254. [ 20%] Built target echo-translations                                                                                                        
  255. [ 20%] Built target echo                                                                                                                    
  256. [ 20%] Built target encryption-translations                                                                                                  
  257. [ 22%] Built target encryption                                                                                                              
  258. [ 23%] Built target encryption_old-translations                                                                                              
  259. [ 24%] Built target encryption_old                                                                                                          
  260. [ 25%] Built target exec_notify-translations                                                                                                
  261. [ 25%] Built target exec_notify                                                                                                              
  262. [ 26%] Built target ext_sound-translations                                                                                                  
  263. [ 26%] Built target ext_sound                                                                                                                
  264. [ 26%] Built target falf_mediaplayer                                                                                                        
  265. [ 26%] Built target filedesc-translations                                                                                                    
  266. [ 26%] Built target filedesc                                                                                                                
  267. [ 26%] Built target filtering-translations                                                                                                  
  268. [ 27%] Built target filtering                                                                                                                
  269. [ 28%] Built target firewall-translations                                                                                                    
  270. [ 28%] Built target firewall                                                                                                                
  271. [ 28%] Built target gg_avatars-translations                                                                                                  
  272. [ 28%] Built target gg_avatars                                                                                                              
  273. Scanning dependencies of target globalhotkeys-translations                                                                                  
  274. [ 28%] Generating globalhotkeys_pl.qm                                                                                                        
  275. Updating '/home/cojack/Dokumenty/abs/kadu/src/kadu/modules/globalhotkeys/globalhotkeys_pl.qm'...                                            
  276.     Generated 34 translation(s) (34 finished and 0 unfinished)                                                                              
  277. [ 28%] Built target globalhotkeys-translations                                                                                              
  278. [ 28%] Qt Wrapped File                                                                                                                      
  279. Scanning dependencies of target globalhotkeys                                                                                                
  280. [ 28%] Building CXX object modules/globalhotkeys/CMakeFiles/globalhotkeys.dir/globalhotkeys.cpp.o                                            
  281. [ 28%] Building CXX object modules/globalhotkeys/CMakeFiles/globalhotkeys.dir/hotkey.cpp.o                                                  
  282. [ 28%] Building CXX object modules/globalhotkeys/CMakeFiles/globalhotkeys.dir/hotkeyedit.cpp.o                                              
  283. [ 29%] Building CXX object modules/globalhotkeys/CMakeFiles/globalhotkeys.dir/wideiconsmenu.cpp.o                                            
  284. [ 29%] Building CXX object modules/globalhotkeys/CMakeFiles/globalhotkeys.dir/proxystyle.cpp.o                                              
  285. [ 29%] Building CXX object modules/globalhotkeys/CMakeFiles/globalhotkeys.dir/moc_globalhotkeys.cxx.o                                        
  286. Linking CXX shared module libglobalhotkeys.so                                                                                                
  287. [ 29%] Built target globalhotkeys                                                                                                            
  288. [ 30%] Built target hints-translations                                                                                                      
  289. [ 31%] Built target hints                                                                                                                    
  290. [ 31%] Built target history-translations                                                                                                    
  291. [ 33%] Built target history                                                                                                                  
  292. [ 34%] Built target idle                                                                                                                    
  293. Scanning dependencies of target kde_notify-translations                                                                                      
  294. [ 34%] Generating kde_notify_pl.qm                                                                                                          
  295. Updating '/home/cojack/Dokumenty/abs/kadu/src/kadu/modules/kde_notify/kde_notify_pl.qm'...                                                  
  296.     Generated 6 translation(s) (6 finished and 0 unfinished)                                                                                
  297. [ 34%] Built target kde_notify-translations                                                                                                  
  298. [ 34%] Qt Wrapped File                                                                                                                      
  299. Scanning dependencies of target kde_notify                                                                                                  
  300. [ 34%] Building CXX object modules/kde_notify/CMakeFiles/kde_notify.dir/kde_notify.cpp.o                                                    
  301. [ 34%] Building CXX object modules/kde_notify/CMakeFiles/kde_notify.dir/moc_kde_notify.cxx.o                                                
  302. Linking CXX shared module libkde_notify.so                                                                                                  
  303. [ 34%] Built target kde_notify                                                                                                              
  304. [ 34%] Built target last_seen-translations                                                                                                  
  305. [ 35%] Built target last_seen                                                                                                                
  306. Scanning dependencies of target led_notify-translations                                                                                      
  307. [ 35%] Generating led_notify_pl.qm                                                                                                          
  308. Updating '/home/cojack/Dokumenty/abs/kadu/src/kadu/modules/led_notify/led_notify_pl.qm'...                                                  
  309.     Generated 7 translation(s) (7 finished and 0 unfinished)                                                                                
  310. [ 35%] Built target led_notify-translations                                                                                                  
  311. [ 35%] Qt Wrapped File                                                                                                                      
  312. [ 35%] Qt Wrapped File                                                                                                                      
  313. Scanning dependencies of target led_notify                                                                                                  
  314. [ 35%] Building CXX object modules/led_notify/CMakeFiles/led_notify.dir/led_blinker.cpp.o                                                    
  315. [ 35%] Building CXX object modules/led_notify/CMakeFiles/led_notify.dir/led_notify.cpp.o                                                    
  316. [ 35%] Building CXX object modules/led_notify/CMakeFiles/led_notify.dir/led_driver.cpp.o                                                    
  317. [ 36%] Building CXX object modules/led_notify/CMakeFiles/led_notify.dir/moc_led_blinker.cxx.o                                                
  318. [ 36%] Building CXX object modules/led_notify/CMakeFiles/led_notify.dir/moc_led_notify.cxx.o                                                
  319. Linking CXX shared module libled_notify.so                                                                                                  
  320. [ 36%] Built target led_notify                                                                                                              
  321. Scanning dependencies of target mail-translations                                                                                            
  322. [ 36%] Generating mail_pl.qm                                                                                                                
  323. Updating '/home/cojack/Dokumenty/abs/kadu/src/kadu/modules/mail/mail_pl.qm'...                                                              
  324.     Generated 45 translation(s) (45 finished and 0 unfinished)                                                                              
  325. [ 36%] Built target mail-translations                                                                                                        
  326. [ 36%] Qt Wrapped File                                                                                                                      
  327. [ 36%] Qt Wrapped File                                                                                                                      
  328. [ 36%] Qt Wrapped File                                                                                                                      
  329. [ 37%] Qt Wrapped File                                                                                                                      
  330. Scanning dependencies of target mail                                                                                                        
  331. [ 37%] Building CXX object modules/mail/CMakeFiles/mail.dir/accountdialog.cpp.o                                                              
  332. [ 37%] Building CXX object modules/mail/CMakeFiles/mail.dir/certdialog.cpp.o                                                                
  333. [ 37%] Building CXX object modules/mail/CMakeFiles/mail.dir/mail.cpp.o                                                                      
  334. [ 38%] Building CXX object modules/mail/CMakeFiles/mail.dir/pop3.cpp.o                                                                      
  335. [ 38%] Building CXX object modules/mail/CMakeFiles/mail.dir/moc_accountdialog.cxx.o                                                          
  336. [ 38%] Building CXX object modules/mail/CMakeFiles/mail.dir/moc_certdialog.cxx.o                                                            
  337. [ 38%] Building CXX object modules/mail/CMakeFiles/mail.dir/moc_mail.cxx.o                                                                  
  338. [ 38%] Building CXX object modules/mail/CMakeFiles/mail.dir/moc_pop3.cxx.o                                                                  
  339. Linking CXX shared module libmail.so                                                                                                        
  340. [ 38%] Built target mail                                                                                                                    
  341. [ 38%] Built target mediaplayer-translations                                                                                                
  342. [ 40%] Built target mediaplayer                                                                                                              
  343. Scanning dependencies of target mime_tex-translations                                                                                        
  344. [ 40%] Generating mime_tex_pl.qm                                                                                                            
  345. Updating '/home/cojack/Dokumenty/abs/kadu/src/kadu/modules/mime_tex/mime_tex_pl.qm'...                                                      
  346.     Generated 18 translation(s) (18 finished and 0 unfinished)                                                                              
  347. [ 40%] Built target mime_tex-translations                                                                                                    
  348. [ 40%] Qt Wrapped File                                                                                                                      
  349. [ 40%] Qt Wrapped File                                                                                                                      
  350. [ 41%] Qt Wrapped File                                                                                                                      
  351. [ 41%] Qt Wrapped File                                                                                                                      
  352. [ 41%] Qt Wrapped File                                                                                                                      
  353. Scanning dependencies of target mime_tex                                                                                                    
  354. [ 41%] Building CXX object modules/mime_tex/CMakeFiles/mime_tex.dir/formula_view.cpp.o                                                      
  355. [ 41%] Building CXX object modules/mime_tex/CMakeFiles/mime_tex.dir/formula_widget.cpp.o                                                    
  356. [ 41%] Building CXX object modules/mime_tex/CMakeFiles/mime_tex.dir/mime_tex.cpp.o                                                          
  357. [ 42%] Building CXX object modules/mime_tex/CMakeFiles/mime_tex.dir/tex_formula_dialog.cpp.o                                                
  358. [ 42%] Building CXX object modules/mime_tex/CMakeFiles/mime_tex.dir/mime_tex_ui_handler.cpp.o                                                
  359. [ 42%] Building CXX object modules/mime_tex/CMakeFiles/mime_tex.dir/moc_formula_view.cxx.o                                                  
  360. [ 42%] Building CXX object modules/mime_tex/CMakeFiles/mime_tex.dir/moc_formula_widget.cxx.o                                                
  361. [ 42%] Building CXX object modules/mime_tex/CMakeFiles/mime_tex.dir/moc_mime_tex.cxx.o                                                      
  362. [ 42%] Building CXX object modules/mime_tex/CMakeFiles/mime_tex.dir/moc_tex_formula_dialog.cxx.o                                            
  363. [ 42%] Building CXX object modules/mime_tex/CMakeFiles/mime_tex.dir/moc_mime_tex_ui_handler.cxx.o                                            
  364. Linking CXX shared module libmime_tex.so                                                                                                    
  365. [ 42%] Built target mime_tex                                                                                                                
  366. Scanning dependencies of target mimetex                                                                                                      
  367. [ 42%] Building C object modules/mime_tex/mimetex/CMakeFiles/mimetex.dir/mimetex.c.o                                                        
  368. [ 42%] Building C object modules/mime_tex/mimetex/CMakeFiles/mimetex.dir/gifsave.c.o                                                        
  369. Linking C executable mimetex                                                                                                                
  370. [ 42%] Built target mimetex                                                                                                                  
  371. Scanning dependencies of target mx610_notify-translations                                                                                    
  372. [ 42%] Generating mx610_notify_pl.qm                                                                                                        
  373. Updating '/home/cojack/Dokumenty/abs/kadu/src/kadu/modules/mx610_notify/mx610_notify_pl.qm'...                                              
  374.     Generated 20 translation(s) (20 finished and 0 unfinished)                                                                              
  375. [ 42%] Built target mx610_notify-translations                                                                                                
  376. [ 42%] Qt Wrapped File                                                                                                                      
  377. Scanning dependencies of target mx610_notify                                                                                                
  378. [ 43%] Building CXX object modules/mx610_notify/CMakeFiles/mx610_notify.dir/mx610_notify.cpp.o                                              
  379. [ 43%] Building CXX object modules/mx610_notify/CMakeFiles/mx610_notify.dir/moc_mx610_notify.cxx.o                                          
  380. Linking CXX shared module libmx610_notify.so                                                                                                
  381. [ 43%] Built target mx610_notify                                                                                                            
  382. Scanning dependencies of target nextinfo-translations                                                                                        
  383. [ 43%] Generating nextinfo_pl.qm                                                                                                            
  384. Updating '/home/cojack/Dokumenty/abs/kadu/src/kadu/modules/nextinfo/nextinfo_pl.qm'...                                                      
  385.     Generated 71 translation(s) (71 finished and 0 unfinished)                                                                              
  386. [ 43%] Built target nextinfo-translations                                                                                                    
  387. [ 43%] Qt Wrapped File                                                                                                                      
  388. [ 44%] Qt Wrapped File                                                                                                                      
  389. Scanning dependencies of target nextinfo                                                                                                    
  390. [ 44%] Building CXX object modules/nextinfo/CMakeFiles/nextinfo.dir/nextinfo.cpp.o                                                          
  391. [ 44%] Building CXX object modules/nextinfo/CMakeFiles/nextinfo.dir/extendedinformationwindow.cpp.o                                          
  392. [ 44%] Building CXX object modules/nextinfo/CMakeFiles/nextinfo.dir/moc_nextinfo.cxx.o                                                      
  393. [ 44%] Building CXX object modules/nextinfo/CMakeFiles/nextinfo.dir/moc_extendedinformationwindow.cxx.o                                      
  394. Linking CXX shared module libnextinfo.so                                                                                                    
  395. [ 44%] Built target nextinfo                                                                                                                
  396. [ 45%] Built target notify-translations                                                                                                      
  397. [ 47%] Built target notify                                                                                                                  
  398. [ 47%] Built target osd_hints-translations                                                                                                  
  399. [ 48%] Built target osd_hints                                                                                                                
  400. Scanning dependencies of target panelkadu-translations                                                                                      
  401. [ 48%] Generating panelkadu_pl.qm                                                                                                            
  402. Updating '/home/cojack/Dokumenty/abs/kadu/src/kadu/modules/panelkadu/panelkadu_pl.qm'...                                                    
  403.     Generated 18 translation(s) (18 finished and 0 unfinished)                                                                              
  404. [ 48%] Built target panelkadu-translations                                                                                                  
  405. [ 49%] Qt Wrapped File                                                                                                                      
  406. Scanning dependencies of target panelkadu                                                                                                    
  407. [ 49%] Building CXX object modules/panelkadu/CMakeFiles/panelkadu.dir/panelkadu.cpp.o                                                        
  408. [ 49%] Building CXX object modules/panelkadu/CMakeFiles/panelkadu.dir/moc_panelkadu.cxx.o                                                    
  409. Linking CXX shared module libpanelkadu.so                                                                                                    
  410. [ 49%] Built target panelkadu                                                                                                                
  411. [ 49%] Built target parser_extender-translations                                                                                            
  412. [ 49%] Built target parser_extender                                                                                                          
  413. [ 49%] Built target pcspeaker-translations                                                                                                  
  414. [ 50%] Built target pcspeaker                                                                                                                
  415. [ 51%] Built target phonon_sound                                                                                                            
  416. Scanning dependencies of target plus_pl_sms-translations                                                                                    
  417. [ 51%] Generating plus_pl_sms_pl.qm                                                                                                          
  418. Updating '/home/cojack/Dokumenty/abs/kadu/src/kadu/modules/plus_pl_sms/plus_pl_sms_pl.qm'...                                                
  419.     Generated 10 translation(s) (10 finished and 0 unfinished)                                                                              
  420. [ 51%] Built target plus_pl_sms-translations                                                                                                
  421. [ 51%] Qt Wrapped File                                                                                                                      
  422. [ 51%] Qt Wrapped File                                                                                                                      
  423. [ 51%] Qt Wrapped File                                                                                                                      
  424. Scanning dependencies of target plus_pl_sms                                                                                                  
  425. [ 51%] Building CXX object modules/plus_pl_sms/CMakeFiles/plus_pl_sms.dir/plus_pl_sms.cpp.o                                                  
  426. [ 51%] Building CXX object modules/plus_pl_sms/CMakeFiles/plus_pl_sms.dir/plus_pl_sms_ui_handler.cpp.o                                      
  427. [ 51%] Building CXX object modules/plus_pl_sms/CMakeFiles/plus_pl_sms.dir/sendthread.cpp.o                                                  
  428. [ 51%] Building CXX object modules/plus_pl_sms/CMakeFiles/plus_pl_sms.dir/sms_plus_pl_gateway.cpp.o                                          
  429. [ 51%] Building CXX object modules/plus_pl_sms/CMakeFiles/plus_pl_sms.dir/moc_plus_pl_sms_ui_handler.cxx.o                                  
  430. [ 52%] Building CXX object modules/plus_pl_sms/CMakeFiles/plus_pl_sms.dir/moc_sendthread.cxx.o                                              
  431. [ 52%] Building CXX object modules/plus_pl_sms/CMakeFiles/plus_pl_sms.dir/moc_sms_plus_pl_gateway.cxx.o                                      
  432. Linking CXX shared module libplus_pl_sms.so                                                                                                  
  433. [ 52%] Built target plus_pl_sms                                                                                                              
  434. [ 52%] Built target powerkadu-translations                                                                                                  
  435. [ 53%] Built target powerkadu                                                                                                                
  436. [ 53%] Built target profiles-translations                                                                                                    
  437. [ 54%] Built target profiles                                                                                                                
  438. [ 54%] Built target qt4_docking-translations                                                                                                
  439. [ 54%] Built target qt4_docking                                                                                                              
  440. [ 55%] Built target qt4_sound                                                                                                                
  441. [ 55%] Built target screenshot-translations                                                                                                  
  442. [ 55%] Built target screenshot                                                                                                              
  443. Scanning dependencies of target senthistory-translations                                                                                    
  444. [ 55%] Generating senthistory_pl.qm                                                                                                          
  445. Updating '/home/cojack/Dokumenty/abs/kadu/src/kadu/modules/senthistory/senthistory_pl.qm'...                                                
  446.     Generated 7 translation(s) (7 finished and 0 unfinished)                                                                                
  447. [ 56%] Built target senthistory-translations                                                                                                
  448. [ 56%] Qt Wrapped File                                                                                                                      
  449. Scanning dependencies of target senthistory                                                                                                  
  450. [ 56%] Building CXX object modules/senthistory/CMakeFiles/senthistory.dir/senthistory.cpp.o                                                  
  451. [ 56%] Building CXX object modules/senthistory/CMakeFiles/senthistory.dir/moc_senthistory.cxx.o                                              
  452. Linking CXX shared module libsenthistory.so                                                                                                  
  453. [ 56%] Built target senthistory                                                                                                              
  454. [ 56%] Built target sms-translations                                                                                                        
  455. [ 56%] Built target sms                                                                                                                      
  456. [ 56%] Built target sound-translations                                                                                                      
  457. [ 58%] Built target sound                                                                                                                    
  458. [ 58%] Built target speech-translations                                                                                                      
  459. [ 59%] Built target speech                                                                                                                  
  460. [ 59%] Built target spellchecker-translations                                                                                                
  461. [ 60%] Built target spellchecker                                                                                                            
  462. [ 60%] Built target split_messages-translations                                                                                              
  463. [ 60%] Built target split_messages                                                                                                          
  464. Scanning dependencies of target tabs-translations                                                                                            
  465. [ 60%] Generating tabs_pl.qm                                                                                                                
  466. Updating '/home/cojack/Dokumenty/abs/kadu/src/kadu/modules/tabs/tabs_pl.qm'...                                                              
  467.     Generated 25 translation(s) (25 finished and 0 unfinished)                                                                              
  468. [ 60%] Built target tabs-translations                                                                                                        
  469. [ 60%] Generating moc_tabwidget.cxx                                                                                                          
  470. [ 60%] Generating moc_tabs.cxx                                                                                                              
  471. Scanning dependencies of target tabs                                                                                                        
  472. [ 60%] Building CXX object modules/tabs/CMakeFiles/tabs.dir/tabs.cpp.o                                                                      
  473. [ 61%] Building CXX object modules/tabs/CMakeFiles/tabs.dir/tabwidget.cpp.o                                                                  
  474. [ 61%] Building CXX object modules/tabs/CMakeFiles/tabs.dir/moc_tabs.cxx.o                                                                  
  475. [ 61%] Building CXX object modules/tabs/CMakeFiles/tabs.dir/moc_tabwidget.cxx.o                                                              
  476. Linking CXX shared module libtabs.so                                                                                                        
  477. [ 61%] Built target tabs                                                                                                                    
  478. [ 62%] Built target vlc_mediaplayer                                                                                                          
  479. [ 63%] Built target voice-translations                                                                                                      
  480. [ 65%] Built target gsm                                                                                                                      
  481. [ 65%] Built target voice                                                                                                                    
  482. Scanning dependencies of target water_notify-translations                                                                                    
  483. [ 65%] Generating water_notify_pl.qm                                                                                                        
  484. Updating '/home/cojack/Dokumenty/abs/kadu/src/kadu/modules/water_notify/water_notify_pl.qm'...                                              
  485.     Generated 4 translation(s) (4 finished and 0 unfinished)                                                                                
  486. [ 65%] Built target water_notify-translations                                                                                                
  487. [ 65%] Qt Wrapped File                                                                                                                      
  488. Scanning dependencies of target water_notify                                                                                                
  489. [ 65%] Building CXX object modules/water_notify/CMakeFiles/water_notify.dir/water_notify.cpp.o                                              
  490. [ 65%] Building CXX object modules/water_notify/CMakeFiles/water_notify.dir/moc_water_notify.cxx.o                                          
  491. Linking CXX shared module libwater_notify.so                                                                                                
  492. [ 65%] Built target water_notify                                                                                                            
  493. [ 65%] Built target weather-translations                                                                                                    
  494. [ 70%] Built target weather                                                                                                                  
  495. [ 70%] Building CXX object modules/winamp_mediaplayer/CMakeFiles/winamp_mediaplayer.dir/winamp.cpp.o                                        
  496. In file included from /home/cojack/Dokumenty/abs/kadu/src/kadu/modules/winamp_mediaplayer/winamp.cpp:15:                                    
  497. /home/cojack/Dokumenty/abs/kadu/src/kadu/modules/winamp_mediaplayer/winamp.h:17:21: error: windows.h: Nie ma takiego pliku ani katalogu      
  498. In file included from /home/cojack/Dokumenty/abs/kadu/src/kadu/modules/winamp_mediaplayer/winamp.cpp:15:                                    
  499. /home/cojack/Dokumenty/abs/kadu/src/kadu/modules/winamp_mediaplayer/winamp.h:50: error: �HWND� does not name a type                          
  500. /home/cojack/Dokumenty/abs/kadu/src/kadu/modules/winamp_mediaplayer/winamp.h:54: error: �HANDLE� does not name a type                        
  501. In file included from /home/cojack/Dokumenty/abs/kadu/src/kadu/modules/winamp_mediaplayer/winamp.cpp:17:                                    
  502. /home/cojack/Dokumenty/abs/kadu/src/kadu/modules/winamp_mediaplayer/wa_ipc.h:651: error: �HWND� does not name a type                        
  503. /home/cojack/Dokumenty/abs/kadu/src/kadu/modules/winamp_mediaplayer/wa_ipc.h:658: error: �HWND� does not name a type                        
  504. /home/cojack/Dokumenty/abs/kadu/src/kadu/modules/winamp_mediaplayer/wa_ipc.h:743: error: �HINSTANCE� does not name a type                    
  505. /home/cojack/Dokumenty/abs/kadu/src/kadu/modules/winamp_mediaplayer/wa_ipc.h:761: error: �HINSTANCE� does not name a type                    
  506. /home/cojack/Dokumenty/abs/kadu/src/kadu/modules/winamp_mediaplayer/wa_ipc.h:1005: error: �HWND� does not name a type                        
  507. /home/cojack/Dokumenty/abs/kadu/src/kadu/modules/winamp_mediaplayer/wa_ipc.h:1024: error: �RECT� does not name a type                        
  508. /home/cojack/Dokumenty/abs/kadu/src/kadu/modules/winamp_mediaplayer/wa_ipc.h:1048: error: �HWND� does not name a type                        
  509. /home/cojack/Dokumenty/abs/kadu/src/kadu/modules/winamp_mediaplayer/wa_ipc.h:1049: error: �GUID� does not name a type                        
  510. /home/cojack/Dokumenty/abs/kadu/src/kadu/modules/winamp_mediaplayer/wa_ipc.h:1091: error: �HWND� does not name a type                        
  511. /home/cojack/Dokumenty/abs/kadu/src/kadu/modules/winamp_mediaplayer/wa_ipc.h:1113: error: �HWND� does not name a type                        
  512. /home/cojack/Dokumenty/abs/kadu/src/kadu/modules/winamp_mediaplayer/wa_ipc.h:1143: error: �HWND� does not name a type                        
  513. /home/cojack/Dokumenty/abs/kadu/src/kadu/modules/winamp_mediaplayer/wa_ipc.h:1147: error: �HWND� does not name a type                        
  514. /home/cojack/Dokumenty/abs/kadu/src/kadu/modules/winamp_mediaplayer/wa_ipc.h:1169: error: �HWND� does not name a type                        
  515. /home/cojack/Dokumenty/abs/kadu/src/kadu/modules/winamp_mediaplayer/wa_ipc.h:1273: error: �HBITMAP� does not name a type                    
  516. /home/cojack/Dokumenty/abs/kadu/src/kadu/modules/winamp_mediaplayer/wa_ipc.h:1303: error: �HWND� does not name a type                        
  517. /home/cojack/Dokumenty/abs/kadu/src/kadu/modules/winamp_mediaplayer/wa_ipc.h:1311: error: �HWND� does not name a type                        
  518. /home/cojack/Dokumenty/abs/kadu/src/kadu/modules/winamp_mediaplayer/wa_ipc.h:1406: error: �LRESULT� has not been declared                    
  519. /home/cojack/Dokumenty/abs/kadu/src/kadu/modules/winamp_mediaplayer/wa_ipc.h:1406: error: �HWND� has not been declared                      
  520. /home/cojack/Dokumenty/abs/kadu/src/kadu/modules/winamp_mediaplayer/wa_ipc.h:1406: error: �UINT� has not been declared                      
  521. /home/cojack/Dokumenty/abs/kadu/src/kadu/modules/winamp_mediaplayer/wa_ipc.h:1406: error: �WPARAM� has not been declared                    
  522. /home/cojack/Dokumenty/abs/kadu/src/kadu/modules/winamp_mediaplayer/wa_ipc.h:1406: error: �LPARAM� has not been declared                    
  523. /home/cojack/Dokumenty/abs/kadu/src/kadu/modules/winamp_mediaplayer/wa_ipc.h:1413: error: �INT_PTR� does not name a type                    
  524. /home/cojack/Dokumenty/abs/kadu/src/kadu/modules/winamp_mediaplayer/wa_ipc.h: In member function �virtual void IVideoOutput::drawSubtitle(SubsItem*)�:                                                                                                                                    
  525. /home/cojack/Dokumenty/abs/kadu/src/kadu/modules/winamp_mediaplayer/wa_ipc.h:1409: error: �UNREFERENCED_PARAMETER� was not declared in this scope                                                                                                                                        
  526. /home/cojack/Dokumenty/abs/kadu/src/kadu/modules/winamp_mediaplayer/wa_ipc.h: In member function �virtual void IVideoOutput::showStatusMsg(const char*)�:                                                                                                                                
  527. /home/cojack/Dokumenty/abs/kadu/src/kadu/modules/winamp_mediaplayer/wa_ipc.h:1410: error: �UNREFERENCED_PARAMETER� was not declared in this scope                                                                                                                                        
  528. /home/cojack/Dokumenty/abs/kadu/src/kadu/modules/winamp_mediaplayer/wa_ipc.h: In member function �virtual void IVideoOutput::notifyBufferState(int)�:                                                                                                                                    
  529. /home/cojack/Dokumenty/abs/kadu/src/kadu/modules/winamp_mediaplayer/wa_ipc.h:1412: error: �UNREFERENCED_PARAMETER� was not declared in this scope                                                                                                                                        
  530. /home/cojack/Dokumenty/abs/kadu/src/kadu/modules/winamp_mediaplayer/wa_ipc.h: At global scope:                                              
  531. /home/cojack/Dokumenty/abs/kadu/src/kadu/modules/winamp_mediaplayer/wa_ipc.h:1583: error: �HWND� does not name a type                        
  532. /home/cojack/Dokumenty/abs/kadu/src/kadu/modules/winamp_mediaplayer/wa_ipc.h:1585: error: �WPARAM� does not name a type                      
  533. /home/cojack/Dokumenty/abs/kadu/src/kadu/modules/winamp_mediaplayer/wa_ipc.h:1586: error: �LPARAM� does not name a type                      
  534. /home/cojack/Dokumenty/abs/kadu/src/kadu/modules/winamp_mediaplayer/wa_ipc.h:2294: error: �DWORD� does not name a type                      
  535. /home/cojack/Dokumenty/abs/kadu/src/kadu/modules/winamp_mediaplayer/wa_ipc.h:2421: error: �HWND� does not name a type                        
  536. /home/cojack/Dokumenty/abs/kadu/src/kadu/modules/winamp_mediaplayer/winamp.cpp:55: error: �HWND� does not name a type                        
  537. /home/cojack/Dokumenty/abs/kadu/src/kadu/modules/winamp_mediaplayer/winamp.cpp: In member function �QString WinampMediaPlayer::readWinampMemory(quint32, quint32, bool)�:                                                                                                                
  538. /home/cojack/Dokumenty/abs/kadu/src/kadu/modules/winamp_mediaplayer/winamp.cpp:63: error: �HWND� was not declared in this scope              
  539. /home/cojack/Dokumenty/abs/kadu/src/kadu/modules/winamp_mediaplayer/winamp.cpp:63: error: expected �;� before �hWinamp�                      
  540. /home/cojack/Dokumenty/abs/kadu/src/kadu/modules/winamp_mediaplayer/winamp.cpp:64: error: �hWinamp� was not declared in this scope          
  541. /home/cojack/Dokumenty/abs/kadu/src/kadu/modules/winamp_mediaplayer/winamp.cpp:65: error: �WM_USER� was not declared in this scope          
  542. /home/cojack/Dokumenty/abs/kadu/src/kadu/modules/winamp_mediaplayer/winamp.cpp:65: error: �SendMessage� was not declared in this scope      
  543. /home/cojack/Dokumenty/abs/kadu/src/kadu/modules/winamp_mediaplayer/winamp.cpp:70: error: �DWORD� was not declared in this scope            
  544. /home/cojack/Dokumenty/abs/kadu/src/kadu/modules/winamp_mediaplayer/winamp.cpp:70: error: expected �;� before �processId�                    
  545. /home/cojack/Dokumenty/abs/kadu/src/kadu/modules/winamp_mediaplayer/winamp.cpp:71: error: �processId� was not declared in this scope        
  546. /home/cojack/Dokumenty/abs/kadu/src/kadu/modules/winamp_mediaplayer/winamp.cpp:71: error: �GetWindowThreadProcessId� was not declared in this scope                                                                                                                                      
  547. /home/cojack/Dokumenty/abs/kadu/src/kadu/modules/winamp_mediaplayer/winamp.cpp:73: error: �HANDLE� was not declared in this scope            
  548. /home/cojack/Dokumenty/abs/kadu/src/kadu/modules/winamp_mediaplayer/winamp.cpp:73: error: expected �;� before �hWinampProcess�              
  549. /home/cojack/Dokumenty/abs/kadu/src/kadu/modules/winamp_mediaplayer/winamp.cpp:74: error: �hWinampProcess� was not declared in this scope    
  550. /home/cojack/Dokumenty/abs/kadu/src/kadu/modules/winamp_mediaplayer/winamp.cpp:74: error: �SUCCEEDED� was not declared in this scope        
  551. /home/cojack/Dokumenty/abs/kadu/src/kadu/modules/winamp_mediaplayer/winamp.cpp:80: error: �hWinampProcess� was not declared in this scope    
  552. /home/cojack/Dokumenty/abs/kadu/src/kadu/modules/winamp_mediaplayer/winamp.cpp:80: error: �ReadProcessMemory� was not declared in this scope
  553. /home/cojack/Dokumenty/abs/kadu/src/kadu/modules/winamp_mediaplayer/winamp.cpp:80: error: �SUCCEEDED� was not declared in this scope        
  554. /home/cojack/Dokumenty/abs/kadu/src/kadu/modules/winamp_mediaplayer/winamp.cpp:82: error: �CloseHandle� was not declared in this scope      
  555. /home/cojack/Dokumenty/abs/kadu/src/kadu/modules/winamp_mediaplayer/winamp.cpp: In member function �QString WinampMediaPlayer::getFileTagW(int, QString)�:                                                                                                                                
  556. /home/cojack/Dokumenty/abs/kadu/src/kadu/modules/winamp_mediaplayer/winamp.cpp:99: error: �HWND� was not declared in this scope              
  557. /home/cojack/Dokumenty/abs/kadu/src/kadu/modules/winamp_mediaplayer/winamp.cpp:99: error: expected �;� before �hWinamp�                      
  558. /home/cojack/Dokumenty/abs/kadu/src/kadu/modules/winamp_mediaplayer/winamp.cpp:100: error: �hWinamp� was not declared in this scope          
  559. /home/cojack/Dokumenty/abs/kadu/src/kadu/modules/winamp_mediaplayer/winamp.cpp:101: error: �DWORD� was not declared in this scope            
  560. /home/cojack/Dokumenty/abs/kadu/src/kadu/modules/winamp_mediaplayer/winamp.cpp:101: error: expected �;� before �processId�                  
  561. /home/cojack/Dokumenty/abs/kadu/src/kadu/modules/winamp_mediaplayer/winamp.cpp:102: error: �processId� was not declared in this scope        
  562. /home/cojack/Dokumenty/abs/kadu/src/kadu/modules/winamp_mediaplayer/winamp.cpp:102: error: �GetWindowThreadProcessId� was not declared in this scope                                                                                                                                      
  563. /home/cojack/Dokumenty/abs/kadu/src/kadu/modules/winamp_mediaplayer/winamp.cpp:104: error: �HANDLE� was not declared in this scope          
  564. /home/cojack/Dokumenty/abs/kadu/src/kadu/modules/winamp_mediaplayer/winamp.cpp:104: error: expected �;� before �hWinampProcess�              
  565. /home/cojack/Dokumenty/abs/kadu/src/kadu/modules/winamp_mediaplayer/winamp.cpp:105: error: �hWinampProcess� was not declared in this scope  
  566. /home/cojack/Dokumenty/abs/kadu/src/kadu/modules/winamp_mediaplayer/winamp.cpp:105: error: �SUCCEEDED� was not declared in this scope        
  567. /home/cojack/Dokumenty/abs/kadu/src/kadu/modules/winamp_mediaplayer/winamp.cpp:110: error: �hWinampProcess� was not declared in this scope  
  568. /home/cojack/Dokumenty/abs/kadu/src/kadu/modules/winamp_mediaplayer/winamp.cpp:110: error: �MEM_COMMIT� was not declared in this scope      
  569. /home/cojack/Dokumenty/abs/kadu/src/kadu/modules/winamp_mediaplayer/winamp.cpp:110: error: �PAGE_READWRITE� was not declared in this scope  
  570. /home/cojack/Dokumenty/abs/kadu/src/kadu/modules/winamp_mediaplayer/winamp.cpp:110: error: �VirtualAllocEx� was not declared in this scope  
  571. /home/cojack/Dokumenty/abs/kadu/src/kadu/modules/winamp_mediaplayer/winamp.cpp:116: error: �CloseHandle� was not declared in this scope      
  572. /home/cojack/Dokumenty/abs/kadu/src/kadu/modules/winamp_mediaplayer/winamp.cpp:121: error: �WM_USER� was not declared in this scope          
  573. /home/cojack/Dokumenty/abs/kadu/src/kadu/modules/winamp_mediaplayer/winamp.cpp:121: error: �SendMessage� was not declared in this scope      
  574. /home/cojack/Dokumenty/abs/kadu/src/kadu/modules/winamp_mediaplayer/winamp.cpp:126: error: �WriteProcessMemory� was not declared in this scope                                                                                                                                            
  575. /home/cojack/Dokumenty/abs/kadu/src/kadu/modules/winamp_mediaplayer/winamp.cpp:132: error: �WPARAM� was not declared in this scope          
  576. /home/cojack/Dokumenty/abs/kadu/src/kadu/modules/winamp_mediaplayer/winamp.cpp:136: error: �ReadProcessMemory� was not declared in this scope
  577. /home/cojack/Dokumenty/abs/kadu/src/kadu/modules/winamp_mediaplayer/winamp.cpp:138: error: �MEM_RELEASE� was not declared in this scope      
  578. /home/cojack/Dokumenty/abs/kadu/src/kadu/modules/winamp_mediaplayer/winamp.cpp:138: error: �VirtualFreeEx� was not declared in this scope    
  579. /home/cojack/Dokumenty/abs/kadu/src/kadu/modules/winamp_mediaplayer/winamp.cpp:142: error: �CloseHandle� was not declared in this scope      
  580. /home/cojack/Dokumenty/abs/kadu/src/kadu/modules/winamp_mediaplayer/winamp.cpp: In member function �QString WinampMediaPlayer::getFileTagA(int, QString)�:                                                                                                                                
  581. /home/cojack/Dokumenty/abs/kadu/src/kadu/modules/winamp_mediaplayer/winamp.cpp:151: error: �HWND� was not declared in this scope            
  582. /home/cojack/Dokumenty/abs/kadu/src/kadu/modules/winamp_mediaplayer/winamp.cpp:151: error: expected �;� before �hWinamp�                    
  583. /home/cojack/Dokumenty/abs/kadu/src/kadu/modules/winamp_mediaplayer/winamp.cpp:152: error: �hWinamp� was not declared in this scope          
  584. /home/cojack/Dokumenty/abs/kadu/src/kadu/modules/winamp_mediaplayer/winamp.cpp:153: error: �DWORD� was not declared in this scope            
  585. /home/cojack/Dokumenty/abs/kadu/src/kadu/modules/winamp_mediaplayer/winamp.cpp:153: error: expected �;� before �processId�                  
  586. /home/cojack/Dokumenty/abs/kadu/src/kadu/modules/winamp_mediaplayer/winamp.cpp:154: error: �processId� was not declared in this scope        
  587. /home/cojack/Dokumenty/abs/kadu/src/kadu/modules/winamp_mediaplayer/winamp.cpp:154: error: �GetWindowThreadProcessId� was not declared in this scope                                                                                                                                      
  588. /home/cojack/Dokumenty/abs/kadu/src/kadu/modules/winamp_mediaplayer/winamp.cpp:156: error: �HANDLE� was not declared in this scope          
  589. /home/cojack/Dokumenty/abs/kadu/src/kadu/modules/winamp_mediaplayer/winamp.cpp:156: error: expected �;� before �hWinampProcess�              
  590. /home/cojack/Dokumenty/abs/kadu/src/kadu/modules/winamp_mediaplayer/winamp.cpp:157: error: �hWinampProcess� was not declared in this scope  
  591. /home/cojack/Dokumenty/abs/kadu/src/kadu/modules/winamp_mediaplayer/winamp.cpp:157: error: �SUCCEEDED� was not declared in this scope        
  592. /home/cojack/Dokumenty/abs/kadu/src/kadu/modules/winamp_mediaplayer/winamp.cpp:162: error: �hWinampProcess� was not declared in this scope  
  593. /home/cojack/Dokumenty/abs/kadu/src/kadu/modules/winamp_mediaplayer/winamp.cpp:162: error: �MEM_COMMIT� was not declared in this scope      
  594. /home/cojack/Dokumenty/abs/kadu/src/kadu/modules/winamp_mediaplayer/winamp.cpp:162: error: �PAGE_READWRITE� was not declared in this scope  
  595. /home/cojack/Dokumenty/abs/kadu/src/kadu/modules/winamp_mediaplayer/winamp.cpp:162: error: �VirtualAllocEx� was not declared in this scope  
  596. /home/cojack/Dokumenty/abs/kadu/src/kadu/modules/winamp_mediaplayer/winamp.cpp:168: error: �CloseHandle� was not declared in this scope      
  597. /home/cojack/Dokumenty/abs/kadu/src/kadu/modules/winamp_mediaplayer/winamp.cpp:173: error: �WM_USER� was not declared in this scope          
  598. /home/cojack/Dokumenty/abs/kadu/src/kadu/modules/winamp_mediaplayer/winamp.cpp:173: error: �SendMessage� was not declared in this scope      
  599. /home/cojack/Dokumenty/abs/kadu/src/kadu/modules/winamp_mediaplayer/winamp.cpp:178: error: �WriteProcessMemory� was not declared in this scope                                                                                                                                            
  600. /home/cojack/Dokumenty/abs/kadu/src/kadu/modules/winamp_mediaplayer/winamp.cpp:184: error: �WPARAM� was not declared in this scope          
  601. /home/cojack/Dokumenty/abs/kadu/src/kadu/modules/winamp_mediaplayer/winamp.cpp:188: error: �ReadProcessMemory� was not declared in this scope
  602. /home/cojack/Dokumenty/abs/kadu/src/kadu/modules/winamp_mediaplayer/winamp.cpp:190: error: �MEM_RELEASE� was not declared in this scope      
  603. /home/cojack/Dokumenty/abs/kadu/src/kadu/modules/winamp_mediaplayer/winamp.cpp:190: error: �VirtualFreeEx� was not declared in this scope    
  604. /home/cojack/Dokumenty/abs/kadu/src/kadu/modules/winamp_mediaplayer/winamp.cpp:194: error: �CloseHandle� was not declared in this scope      
  605. /home/cojack/Dokumenty/abs/kadu/src/kadu/modules/winamp_mediaplayer/winamp.cpp: In member function �virtual QString WinampMediaPlayer::getPlayerVersion()�:                                                                                                                              
  606. /home/cojack/Dokumenty/abs/kadu/src/kadu/modules/winamp_mediaplayer/winamp.cpp:212: error: �HWND� was not declared in this scope            
  607. /home/cojack/Dokumenty/abs/kadu/src/kadu/modules/winamp_mediaplayer/winamp.cpp:212: error: expected �;� before �hWinamp�                    
  608. /home/cojack/Dokumenty/abs/kadu/src/kadu/modules/winamp_mediaplayer/winamp.cpp:213: error: �hWinamp� was not declared in this scope          
  609. /home/cojack/Dokumenty/abs/kadu/src/kadu/modules/winamp_mediaplayer/winamp.cpp:214: error: �WM_USER� was not declared in this scope          
  610. /home/cojack/Dokumenty/abs/kadu/src/kadu/modules/winamp_mediaplayer/winamp.cpp:214: error: �SendMessage� was not declared in this scope      
  611. /home/cojack/Dokumenty/abs/kadu/src/kadu/modules/winamp_mediaplayer/winamp.cpp: In member function �virtual QStringList WinampMediaPlayer::getPlayListTitles()�:                                                                                                                          
  612. /home/cojack/Dokumenty/abs/kadu/src/kadu/modules/winamp_mediaplayer/winamp.cpp:224: error: �HWND� was not declared in this scope            
  613. /home/cojack/Dokumenty/abs/kadu/src/kadu/modules/winamp_mediaplayer/winamp.cpp:224: error: expected �;� before �hWinamp�                    
  614. /home/cojack/Dokumenty/abs/kadu/src/kadu/modules/winamp_mediaplayer/winamp.cpp:225: error: �hWinamp� was not declared in this scope          
  615. /home/cojack/Dokumenty/abs/kadu/src/kadu/modules/winamp_mediaplayer/winamp.cpp: In member function �virtual QStringList WinampMediaPlayer::getPlayListFiles()�:                                                                                                                          
  616. /home/cojack/Dokumenty/abs/kadu/src/kadu/modules/winamp_mediaplayer/winamp.cpp:243: error: �HWND� was not declared in this scope            
  617. /home/cojack/Dokumenty/abs/kadu/src/kadu/modules/winamp_mediaplayer/winamp.cpp:243: error: expected �;� before �hWinamp�                    
  618. /home/cojack/Dokumenty/abs/kadu/src/kadu/modules/winamp_mediaplayer/winamp.cpp:244: error: �hWinamp� was not declared in this scope          
  619. /home/cojack/Dokumenty/abs/kadu/src/kadu/modules/winamp_mediaplayer/winamp.cpp: In member function �virtual uint WinampMediaPlayer::getPlayListLength()�:                                                                                                                                
  620. /home/cojack/Dokumenty/abs/kadu/src/kadu/modules/winamp_mediaplayer/winamp.cpp:255: error: �HWND� was not declared in this scope            
  621. /home/cojack/Dokumenty/abs/kadu/src/kadu/modules/winamp_mediaplayer/winamp.cpp:255: error: expected �;� before �hWinamp�                    
  622. /home/cojack/Dokumenty/abs/kadu/src/kadu/modules/winamp_mediaplayer/winamp.cpp:256: error: �hWinamp� was not declared in this scope          
  623. /home/cojack/Dokumenty/abs/kadu/src/kadu/modules/winamp_mediaplayer/winamp.cpp:257: error: �WM_USER� was not declared in this scope          
  624. /home/cojack/Dokumenty/abs/kadu/src/kadu/modules/winamp_mediaplayer/winamp.cpp:257: error: �SendMessage� was not declared in this scope      
  625. /home/cojack/Dokumenty/abs/kadu/src/kadu/modules/winamp_mediaplayer/winamp.cpp: In member function �virtual QString WinampMediaPlayer::getTitle(int)�:                                                                                                                                    
  626. /home/cojack/Dokumenty/abs/kadu/src/kadu/modules/winamp_mediaplayer/winamp.cpp:265: error: �HWND� was not declared in this scope            
  627. /home/cojack/Dokumenty/abs/kadu/src/kadu/modules/winamp_mediaplayer/winamp.cpp:265: error: expected �;� before �hWinamp�                    
  628. /home/cojack/Dokumenty/abs/kadu/src/kadu/modules/winamp_mediaplayer/winamp.cpp:266: error: �hWinamp� was not declared in this scope          
  629. /home/cojack/Dokumenty/abs/kadu/src/kadu/modules/winamp_mediaplayer/winamp.cpp:268: error: �WM_USER� was not declared in this scope          
  630. /home/cojack/Dokumenty/abs/kadu/src/kadu/modules/winamp_mediaplayer/winamp.cpp:268: error: �SendMessage� was not declared in this scope      
  631. /home/cojack/Dokumenty/abs/kadu/src/kadu/modules/winamp_mediaplayer/winamp.cpp: In member function �virtual QString WinampMediaPlayer::getAlbum(int)�:                                                                                                                                    
  632. /home/cojack/Dokumenty/abs/kadu/src/kadu/modules/winamp_mediaplayer/winamp.cpp:285: error: �HWND� was not declared in this scope            
  633. /home/cojack/Dokumenty/abs/kadu/src/kadu/modules/winamp_mediaplayer/winamp.cpp:285: error: expected �;� before �hWinamp�                    
  634. /home/cojack/Dokumenty/abs/kadu/src/kadu/modules/winamp_mediaplayer/winamp.cpp:286: error: �hWinamp� was not declared in this scope          
  635. /home/cojack/Dokumenty/abs/kadu/src/kadu/modules/winamp_mediaplayer/winamp.cpp:288: error: �WM_USER� was not declared in this scope          
  636. /home/cojack/Dokumenty/abs/kadu/src/kadu/modules/winamp_mediaplayer/winamp.cpp:288: error: �SendMessage� was not declared in this scope      
  637. /home/cojack/Dokumenty/abs/kadu/src/kadu/modules/winamp_mediaplayer/winamp.cpp: In member function �virtual QString WinampMediaPlayer::getArtist(int)�:                                                                                                                                  
  638. /home/cojack/Dokumenty/abs/kadu/src/kadu/modules/winamp_mediaplayer/winamp.cpp:305: error: �HWND� was not declared in this scope            
  639. /home/cojack/Dokumenty/abs/kadu/src/kadu/modules/winamp_mediaplayer/winamp.cpp:305: error: expected �;� before �hWinamp�                    
  640. /home/cojack/Dokumenty/abs/kadu/src/kadu/modules/winamp_mediaplayer/winamp.cpp:306: error: �hWinamp� was not declared in this scope          
  641. /home/cojack/Dokumenty/abs/kadu/src/kadu/modules/winamp_mediaplayer/winamp.cpp:308: error: �WM_USER� was not declared in this scope          
  642. /home/cojack/Dokumenty/abs/kadu/src/kadu/modules/winamp_mediaplayer/winamp.cpp:308: error: �SendMessage� was not declared in this scope      
  643. /home/cojack/Dokumenty/abs/kadu/src/kadu/modules/winamp_mediaplayer/winamp.cpp: In member function �virtual QString WinampMediaPlayer::getFile(int)�:                                                                                                                                    
  644. /home/cojack/Dokumenty/abs/kadu/src/kadu/modules/winamp_mediaplayer/winamp.cpp:325: error: �HWND� was not declared in this scope            
  645. /home/cojack/Dokumenty/abs/kadu/src/kadu/modules/winamp_mediaplayer/winamp.cpp:325: error: expected �;� before �hWinamp�                    
  646. /home/cojack/Dokumenty/abs/kadu/src/kadu/modules/winamp_mediaplayer/winamp.cpp:326: error: �hWinamp� was not declared in this scope          
  647. /home/cojack/Dokumenty/abs/kadu/src/kadu/modules/winamp_mediaplayer/winamp.cpp:328: error: �WM_USER� was not declared in this scope          
  648. /home/cojack/Dokumenty/abs/kadu/src/kadu/modules/winamp_mediaplayer/winamp.cpp:328: error: �SendMessage� was not declared in this scope      
  649. /home/cojack/Dokumenty/abs/kadu/src/kadu/modules/winamp_mediaplayer/winamp.cpp: In member function �virtual int WinampMediaPlayer::getLength(int)�:                                                                                                                                      
  650. /home/cojack/Dokumenty/abs/kadu/src/kadu/modules/winamp_mediaplayer/winamp.cpp:346: error: �HWND� was not declared in this scope            
  651. /home/cojack/Dokumenty/abs/kadu/src/kadu/modules/winamp_mediaplayer/winamp.cpp:346: error: expected �;� before �hWinamp�                    
  652. /home/cojack/Dokumenty/abs/kadu/src/kadu/modules/winamp_mediaplayer/winamp.cpp:348: error: �hWinamp� was not declared in this scope          
  653. /home/cojack/Dokumenty/abs/kadu/src/kadu/modules/winamp_mediaplayer/winamp.cpp:350: error: �WM_USER� was not declared in this scope          
  654. /home/cojack/Dokumenty/abs/kadu/src/kadu/modules/winamp_mediaplayer/winamp.cpp:350: error: �SendMessage� was not declared in this scope      
  655. /home/cojack/Dokumenty/abs/kadu/src/kadu/modules/winamp_mediaplayer/winamp.cpp:352: error: �DWORD� was not declared in this scope            
  656. /home/cojack/Dokumenty/abs/kadu/src/kadu/modules/winamp_mediaplayer/winamp.cpp:352: error: expected �;� before �processId�                  
  657. /home/cojack/Dokumenty/abs/kadu/src/kadu/modules/winamp_mediaplayer/winamp.cpp:353: error: �processId� was not declared in this scope        
  658. /home/cojack/Dokumenty/abs/kadu/src/kadu/modules/winamp_mediaplayer/winamp.cpp:353: error: �GetWindowThreadProcessId� was not declared in this scope                                                                                                                                      
  659. /home/cojack/Dokumenty/abs/kadu/src/kadu/modules/winamp_mediaplayer/winamp.cpp:355: error: �HANDLE� was not declared in this scope          
  660. /home/cojack/Dokumenty/abs/kadu/src/kadu/modules/winamp_mediaplayer/winamp.cpp:355: error: expected �;� before �hWinampProcess�              
  661. /home/cojack/Dokumenty/abs/kadu/src/kadu/modules/winamp_mediaplayer/winamp.cpp:356: error: �hWinampProcess� was not declared in this scope  
  662. /home/cojack/Dokumenty/abs/kadu/src/kadu/modules/winamp_mediaplayer/winamp.cpp:356: error: �SUCCEEDED� was not declared in this scope        
  663. /home/cojack/Dokumenty/abs/kadu/src/kadu/modules/winamp_mediaplayer/winamp.cpp:361: error: �hWinampProcess� was not declared in this scope  
  664. /home/cojack/Dokumenty/abs/kadu/src/kadu/modules/winamp_mediaplayer/winamp.cpp:361: error: �MEM_COMMIT� was not declared in this scope      
  665. /home/cojack/Dokumenty/abs/kadu/src/kadu/modules/winamp_mediaplayer/winamp.cpp:361: error: �PAGE_READWRITE� was not declared in this scope  
  666. /home/cojack/Dokumenty/abs/kadu/src/kadu/modules/winamp_mediaplayer/winamp.cpp:361: error: �VirtualAllocEx� was not declared in this scope  
  667. /home/cojack/Dokumenty/abs/kadu/src/kadu/modules/winamp_mediaplayer/winamp.cpp:364: error: �CloseHandle� was not declared in this scope      
  668. /home/cojack/Dokumenty/abs/kadu/src/kadu/modules/winamp_mediaplayer/winamp.cpp:369: error: �WM_USER� was not declared in this scope          
  669. /home/cojack/Dokumenty/abs/kadu/src/kadu/modules/winamp_mediaplayer/winamp.cpp:369: error: �SendMessage� was not declared in this scope      
  670. /home/cojack/Dokumenty/abs/kadu/src/kadu/modules/winamp_mediaplayer/winamp.cpp:372: error: �WriteProcessMemory� was not declared in this scope                                                                                                                                            
  671. /home/cojack/Dokumenty/abs/kadu/src/kadu/modules/winamp_mediaplayer/winamp.cpp:374: error: �WPARAM� was not declared in this scope          
  672. /home/cojack/Dokumenty/abs/kadu/src/kadu/modules/winamp_mediaplayer/winamp.cpp:378: error: expected �)� before �pFileInfo�                  
  673. /home/cojack/Dokumenty/abs/kadu/src/kadu/modules/winamp_mediaplayer/winamp.cpp:381: error: �ReadProcessMemory� was not declared in this scope
  674. /home/cojack/Dokumenty/abs/kadu/src/kadu/modules/winamp_mediaplayer/winamp.cpp:383: error: �MEM_RELEASE� was not declared in this scope      
  675. /home/cojack/Dokumenty/abs/kadu/src/kadu/modules/winamp_mediaplayer/winamp.cpp:383: error: �VirtualFreeEx� was not declared in this scope    
  676. /home/cojack/Dokumenty/abs/kadu/src/kadu/modules/winamp_mediaplayer/winamp.cpp:385: error: �CloseHandle� was not declared in this scope      
  677. /home/cojack/Dokumenty/abs/kadu/src/kadu/modules/winamp_mediaplayer/winamp.cpp: In member function �virtual int WinampMediaPlayer::getCurrentPos()�:                                                                                                                                      
  678. /home/cojack/Dokumenty/abs/kadu/src/kadu/modules/winamp_mediaplayer/winamp.cpp:398: error: �HWND� was not declared in this scope            
  679. /home/cojack/Dokumenty/abs/kadu/src/kadu/modules/winamp_mediaplayer/winamp.cpp:398: error: expected �;� before �hWinamp�                    
  680. /home/cojack/Dokumenty/abs/kadu/src/kadu/modules/winamp_mediaplayer/winamp.cpp:399: error: �hWinamp� was not declared in this scope          
  681. /home/cojack/Dokumenty/abs/kadu/src/kadu/modules/winamp_mediaplayer/winamp.cpp:400: error: �WM_USER� was not declared in this scope          
  682. /home/cojack/Dokumenty/abs/kadu/src/kadu/modules/winamp_mediaplayer/winamp.cpp:400: error: �SendMessage� was not declared in this scope      
  683. /home/cojack/Dokumenty/abs/kadu/src/kadu/modules/winamp_mediaplayer/winamp.cpp: In member function �virtual bool WinampMediaPlayer::isPlaying()�:                                                                                                                                        
  684. /home/cojack/Dokumenty/abs/kadu/src/kadu/modules/winamp_mediaplayer/winamp.cpp:408: error: �HWND� was not declared in this scope            
  685. /home/cojack/Dokumenty/abs/kadu/src/kadu/modules/winamp_mediaplayer/winamp.cpp:408: error: expected �;� before �hWinamp�                    
  686. /home/cojack/Dokumenty/abs/kadu/src/kadu/modules/winamp_mediaplayer/winamp.cpp:409: error: �hWinamp� was not declared in this scope          
  687. /home/cojack/Dokumenty/abs/kadu/src/kadu/modules/winamp_mediaplayer/winamp.cpp:410: error: �WM_USER� was not declared in this scope          
  688. /home/cojack/Dokumenty/abs/kadu/src/kadu/modules/winamp_mediaplayer/winamp.cpp:410: error: �SendMessage� was not declared in this scope      
  689. /home/cojack/Dokumenty/abs/kadu/src/kadu/modules/winamp_mediaplayer/winamp.cpp: In member function �virtual bool WinampMediaPlayer::isActive()�:                                                                                                                                          
  690. /home/cojack/Dokumenty/abs/kadu/src/kadu/modules/winamp_mediaplayer/winamp.cpp:420: error: �findWinamp� was not declared in this scope      
  691. /home/cojack/Dokumenty/abs/kadu/src/kadu/modules/winamp_mediaplayer/winamp.cpp: In member function �virtual void WinampMediaPlayer::nextTrack()�:                                                                                                                                        
  692. /home/cojack/Dokumenty/abs/kadu/src/kadu/modules/winamp_mediaplayer/winamp.cpp:427: error: �HWND� was not declared in this scope            
  693. /home/cojack/Dokumenty/abs/kadu/src/kadu/modules/winamp_mediaplayer/winamp.cpp:427: error: expected �;� before �hWinamp�                    
  694. /home/cojack/Dokumenty/abs/kadu/src/kadu/modules/winamp_mediaplayer/winamp.cpp:428: error: �hWinamp� was not declared in this scope          
  695. /home/cojack/Dokumenty/abs/kadu/src/kadu/modules/winamp_mediaplayer/winamp.cpp:429: error: �WM_COMMAND� was not declared in this scope      
  696. /home/cojack/Dokumenty/abs/kadu/src/kadu/modules/winamp_mediaplayer/winamp.cpp:429: error: �SendMessage� was not declared in this scope      
  697. /home/cojack/Dokumenty/abs/kadu/src/kadu/modules/winamp_mediaplayer/winamp.cpp: In member function �virtual void WinampMediaPlayer::prevTrack()�:                                                                                                                                        
  698. /home/cojack/Dokumenty/abs/kadu/src/kadu/modules/winamp_mediaplayer/winamp.cpp:435: error: �HWND� was not declared in this scope            
  699. /home/cojack/Dokumenty/abs/kadu/src/kadu/modules/winamp_mediaplayer/winamp.cpp:435: error: expected �;� before �hWinamp�                    
  700. /home/cojack/Dokumenty/abs/kadu/src/kadu/modules/winamp_mediaplayer/winamp.cpp:436: error: �hWinamp� was not declared in this scope          
  701. /home/cojack/Dokumenty/abs/kadu/src/kadu/modules/winamp_mediaplayer/winamp.cpp:437: error: �WM_COMMAND� was not declared in this scope      
  702. /home/cojack/Dokumenty/abs/kadu/src/kadu/modules/winamp_mediaplayer/winamp.cpp:437: error: �SendMessage� was not declared in this scope      
  703. /home/cojack/Dokumenty/abs/kadu/src/kadu/modules/winamp_mediaplayer/winamp.cpp: In member function �virtual void WinampMediaPlayer::play()�:
  704. /home/cojack/Dokumenty/abs/kadu/src/kadu/modules/winamp_mediaplayer/winamp.cpp:443: error: �HWND� was not declared in this scope            
  705. /home/cojack/Dokumenty/abs/kadu/src/kadu/modules/winamp_mediaplayer/winamp.cpp:443: error: expected �;� before �hWinamp�                    
  706. /home/cojack/Dokumenty/abs/kadu/src/kadu/modules/winamp_mediaplayer/winamp.cpp:444: error: �hWinamp� was not declared in this scope          
  707. /home/cojack/Dokumenty/abs/kadu/src/kadu/modules/winamp_mediaplayer/winamp.cpp:445: error: �WM_COMMAND� was not declared in this scope      
  708. /home/cojack/Dokumenty/abs/kadu/src/kadu/modules/winamp_mediaplayer/winamp.cpp:445: error: �SendMessage� was not declared in this scope
  709. /home/cojack/Dokumenty/abs/kadu/src/kadu/modules/winamp_mediaplayer/winamp.cpp: In member function �virtual void WinampMediaPlayer::stop()�:
  710. /home/cojack/Dokumenty/abs/kadu/src/kadu/modules/winamp_mediaplayer/winamp.cpp:451: error: �HWND� was not declared in this scope
  711. /home/cojack/Dokumenty/abs/kadu/src/kadu/modules/winamp_mediaplayer/winamp.cpp:451: error: expected �;� before �hWinamp�
  712. /home/cojack/Dokumenty/abs/kadu/src/kadu/modules/winamp_mediaplayer/winamp.cpp:452: error: �hWinamp� was not declared in this scope
  713. /home/cojack/Dokumenty/abs/kadu/src/kadu/modules/winamp_mediaplayer/winamp.cpp:453: error: �WM_COMMAND� was not declared in this scope
  714. /home/cojack/Dokumenty/abs/kadu/src/kadu/modules/winamp_mediaplayer/winamp.cpp:453: error: �SendMessage� was not declared in this scope
  715. /home/cojack/Dokumenty/abs/kadu/src/kadu/modules/winamp_mediaplayer/winamp.cpp: In member function �virtual void WinampMediaPlayer::pause()�:
  716. /home/cojack/Dokumenty/abs/kadu/src/kadu/modules/winamp_mediaplayer/winamp.cpp:459: error: �HWND� was not declared in this scope
  717. /home/cojack/Dokumenty/abs/kadu/src/kadu/modules/winamp_mediaplayer/winamp.cpp:459: error: expected �;� before �hWinamp�
  718. /home/cojack/Dokumenty/abs/kadu/src/kadu/modules/winamp_mediaplayer/winamp.cpp:460: error: �hWinamp� was not declared in this scope
  719. /home/cojack/Dokumenty/abs/kadu/src/kadu/modules/winamp_mediaplayer/winamp.cpp:461: error: �WM_COMMAND� was not declared in this scope
  720. /home/cojack/Dokumenty/abs/kadu/src/kadu/modules/winamp_mediaplayer/winamp.cpp:461: error: �SendMessage� was not declared in this scope
  721. /home/cojack/Dokumenty/abs/kadu/src/kadu/modules/winamp_mediaplayer/winamp.cpp: In member function �virtual void WinampMediaPlayer::setVolume(int)�:
  722. /home/cojack/Dokumenty/abs/kadu/src/kadu/modules/winamp_mediaplayer/winamp.cpp:467: error: �HWND� was not declared in this scope
  723. /home/cojack/Dokumenty/abs/kadu/src/kadu/modules/winamp_mediaplayer/winamp.cpp:467: error: expected �;� before �hWinamp�
  724. /home/cojack/Dokumenty/abs/kadu/src/kadu/modules/winamp_mediaplayer/winamp.cpp:468: error: �hWinamp� was not declared in this scope
  725. /home/cojack/Dokumenty/abs/kadu/src/kadu/modules/winamp_mediaplayer/winamp.cpp:469: error: �WM_USER� was not declared in this scope
  726. /home/cojack/Dokumenty/abs/kadu/src/kadu/modules/winamp_mediaplayer/winamp.cpp:469: error: �SendMessage� was not declared in this scope
  727. /home/cojack/Dokumenty/abs/kadu/src/kadu/modules/winamp_mediaplayer/winamp.cpp: In member function �virtual void WinampMediaPlayer::incrVolume()�:
  728. /home/cojack/Dokumenty/abs/kadu/src/kadu/modules/winamp_mediaplayer/winamp.cpp:475: error: �HWND� was not declared in this scope
  729. /home/cojack/Dokumenty/abs/kadu/src/kadu/modules/winamp_mediaplayer/winamp.cpp:475: error: expected �;� before �hWinamp�
  730. /home/cojack/Dokumenty/abs/kadu/src/kadu/modules/winamp_mediaplayer/winamp.cpp:476: error: �hWinamp� was not declared in this scope
  731. /home/cojack/Dokumenty/abs/kadu/src/kadu/modules/winamp_mediaplayer/winamp.cpp:477: error: �WM_COMMAND� was not declared in this scope
  732. /home/cojack/Dokumenty/abs/kadu/src/kadu/modules/winamp_mediaplayer/winamp.cpp:477: error: �SendMessage� was not declared in this scope
  733. /home/cojack/Dokumenty/abs/kadu/src/kadu/modules/winamp_mediaplayer/winamp.cpp: In member function �virtual void WinampMediaPlayer::decrVolume()�:
  734. /home/cojack/Dokumenty/abs/kadu/src/kadu/modules/winamp_mediaplayer/winamp.cpp:483: error: �HWND� was not declared in this scope
  735. /home/cojack/Dokumenty/abs/kadu/src/kadu/modules/winamp_mediaplayer/winamp.cpp:483: error: expected �;� before �hWinamp�
  736. /home/cojack/Dokumenty/abs/kadu/src/kadu/modules/winamp_mediaplayer/winamp.cpp:484: error: �hWinamp� was not declared in this scope
  737. /home/cojack/Dokumenty/abs/kadu/src/kadu/modules/winamp_mediaplayer/winamp.cpp:485: error: �WM_COMMAND� was not declared in this scope
  738. /home/cojack/Dokumenty/abs/kadu/src/kadu/modules/winamp_mediaplayer/winamp.cpp:485: error: �SendMessage� was not declared in this scope
  739. make[2]: *** [modules/winamp_mediaplayer/CMakeFiles/winamp_mediaplayer.dir/winamp.cpp.o] B&#322;&#261;d 1
  740. make[1]: *** [modules/winamp_mediaplayer/CMakeFiles/winamp_mediaplayer.dir/all] B&#322;&#261;d 2
  741. make: *** [all] B&#322;&#261;d 2
  742. ==> B&#321;&#260;D: Budowanie nie powiod&#322;o si&#281;.
  743.     Przerywam...
  744. [localhost][/home/cojack/Dokumenty/abs/kadu] #
  745.  
Advertisement
Add Comment
Please, Sign In to add comment