Guest User

Untitled

a guest
Oct 26th, 2007
249
0
Never
Not a member of Pastebin yet? Sign Up, it unlocks many cool features!
text 58.75 KB | None | 0 0
  1. sh-3.2# bmake
  2. => Bootstrap dependency digest>=20010302: digest-20070803 found
  3. ===> Skipping vulnerability checks.
  4. WARNING: No /usr/pkgsrc/distfiles/pkg-vulnerabilities file found.
  5. WARNING: To fix, install the pkgsrc/security/audit-packages
  6. WARNING: package and run: ``/usr/pkg/sbin/download-vulnerability-list''.
  7. => Checksum SHA1 OK for perl-5.8.8.tar.bz2
  8. => Checksum RMD160 OK for perl-5.8.8.tar.bz2
  9. ===> Installing dependencies for perl-5.8.8nb4
  10. ==========================================================================
  11. The supported build options for perl are:
  12.  
  13. debug threads
  14.  
  15. The currently selected options are:
  16.  
  17. threads
  18.  
  19. You can select which build options to use by setting PKG_DEFAULT_OPTIONS
  20. or the following variable. Its current value is shown:
  21.  
  22. PKG_OPTIONS.perl (not defined)
  23.  
  24. ==========================================================================
  25. ==========================================================================
  26. The following variables will affect the build process of this package,
  27. perl-5.8.8nb4. Their current value is shown below:
  28.  
  29. * PERL5_SITEPREFIX = /usr/pkg
  30.  
  31. You may want to abort the process now with CTRL-C and change their value
  32. before continuing. Be sure to run `/usr/pkg/bin/bmake clean' after
  33. the changes.
  34. ==========================================================================
  35. ===> Overriding tools for perl-5.8.8nb4
  36. ===> Extracting for perl-5.8.8nb4
  37. ===> Patching for perl-5.8.8nb4
  38. => Applying pkgsrc patches for perl-5.8.8nb4
  39. INFO: [subst.mk:dirmode] Nothing changed in ./installhtml.
  40. INFO: [subst.mk:dirmode] Nothing changed in ./lib/ExtUtils/Install.pm.
  41. ===> Creating toolchain wrappers for perl-5.8.8nb4
  42. ===> Configuring for perl-5.8.8nb4
  43. hintdir="/usr/pkgsrc/lang/perl5/work/perl-5.8.8/hints"; for hints in ${hintdir}/*.sh; do /bin/chmod +w ${hints}; { echo ""; echo "cat > UU/pkgsrc.cbu <<'EOCBU'"; echo "# This script UU/pkgsrc.cbu will get 'called-back' by Configure to set"; echo '# linker options after all other call-back scripts have been invoked.'; echo 'ldflags="'' $ldflags"'; echo 'lddlflags="'' $lddlflags"'; echo "EOCBU"; } >> ${hints}; done
  44. hintdir="/usr/pkgsrc/lang/perl5/work/perl-5.8.8/hints"; for hints in ${hintdir}/*.sh; do /bin/chmod +w ${hints}; { echo ""; echo "# Set pkgsrc defaults for library and header search paths."; echo 'locincpth="'/usr/pkg/include'"'; echo 'loclibpth="'/usr/pkg/lib'"'; } >> ${hints}; done
  45. hintdir="/usr/pkgsrc/lang/perl5/work/perl-5.8.8/hints"; for hints in ${hintdir}/*.sh; do /bin/chmod +w ${hints}; echo 'glibpth="'/usr/lib'"' >> ${hints}; done
  46. First let's make sure your kit is complete. Checking...
  47. Locating common programs...
  48. Checking compatibility between /usr/pkgsrc/lang/perl5/work/.tools/bin/echo and builtin echo (if any)...
  49. Symbolic links are supported.
  50. Checking how to test for symbolic links...
  51. You can test for symbolic links with 'test -h'.
  52. Good, your tr supports [:lower:] and [:upper:] to convert case.
  53. Using [:upper:] and [:lower:] to convert case.
  54. 3b1 dos_djgpp irix_6 next_4 stellar
  55. aix dragonfly irix_6_0 nonstopux sunos_4_0
  56. aix_3 dynix irix_6_1 openbsd sunos_4_1
  57. aix_4 dynixptx isc opus super-ux
  58. altos486 epix isc_2 os2 svr4
  59. amigaos esix4 linux os390 svr5
  60. apollo fps lynxos os400 ti1500
  61. atheos freebsd machten posix-bc titanos
  62. aux_3 genix machten_2 powerux ultrix_4
  63. beos gnu mint qnx umips
  64. bsdos gnukfreebsd mips rhapsody unicos
  65. convexos gnuknetbsd mpc sco unicosmk
  66. cxux greenhills mpeix sco_2_3_0 unisysdynix
  67. cygwin hpux ncr_tower sco_2_3_1 utekv
  68. darwin i386 netbsd sco_2_3_2 uts
  69. dcosx interix newsos4 sco_2_3_3 uwin
  70. dec_osf irix_4 next_3 sco_2_3_4 vmesa
  71. dgux irix_5 next_3_0 solaris_2 vos
  72. Which of these apply, if any? [darwin]
  73. Operating system name? [darwin]
  74. Operating system version? [9.0.0]
  75. Build Perl for SOCKS? [n]
  76. Use the PerlIO abstraction layer? [y]
  77. Build a threading Perl? [y]
  78. Use the newer interpreter-based ithreads? [y]
  79. Use which C compiler? [gcc -pipe]
  80. Checking for GNU cc in disguise and/or its version number...
  81. Now, how can we feed standard input to your C preprocessor...
  82. Directories to use for library searches? [/usr/lib /usr/pkg/lib]
  83. What is the file extension used for shared libraries? [dylib]
  84. Try to use long doubles if available? [n]
  85. Checking for optional libraries...
  86. What libraries to use? [-lm -lc -lpthread]
  87. What optimizer/debugger flag should be used?
  88. [-O2 -mcpu=G5 -maltivec -mabi=altivec -fno-strict-aliasing -pipe -D_REENTRANT -I/usr/include]
  89. Any additional cc flags?
  90. [-fno-common -DPERL_DARWIN -no-cpp-precomp -fno-strict-aliasing -pipe -Wdeclaration-after-statement -I/usr/pkg/include]
  91. Let me guess what the preprocessor flags are...
  92. Any additional ld flags (NOT including libraries)? [ -L/usr/pkg/lib]
  93. Checking your choice of C compiler and flags for coherency...
  94. Computing filename position in cpp output for #include directives...
  95. <stdlib.h> found.
  96. Checking to see how big your integers are...
  97. Checking to see if you have long long...
  98. Checking to see how big your long longs are...
  99. <inttypes.h> found.
  100. Checking to see if you have int64_t...
  101. Checking which 64-bit integer type we could use...
  102. We could use 'long long' for 64-bit integers.
  103. Try to use 64-bit integers, if available? [n]
  104. Try to use maximal 64-bit support, if available? [n]
  105. Checking to see how big your double precision numbers are...
  106. Checking to see if you have long double...
  107. Checking to see how big your long doubles are...
  108. What is your architecture name [darwin]
  109. Threads selected.
  110. ...setting architecture name to darwin-thread.
  111. Multiplicity selected.
  112. ...setting architecture name to darwin-thread-multi.
  113. Perlio selected.
  114. Installation prefix to use? (~name ok) [/usr/pkg]
  115. AFS does not seem to be running...
  116. What installation prefix should I use for installing files? (~name ok)
  117. [/usr/pkg]
  118. Getting the current patchlevel...
  119. Pathname where the private library files will reside? (~name ok)
  120. [/usr/pkg/lib/perl5/5.8.0]
  121. Where do you want to put the public architecture-dependent libraries? (~name ok)
  122. [/usr/pkg/lib/perl5/5.8.0/darwin-thread-multi-2level]
  123. Other username to test security of setuid scripts with? [none]
  124. I'll assume setuid scripts are *not* secure.
  125. Does your kernel have *secure* setuid scripts? [n]
  126. Do you want to do setuid/setgid emulation? [n]
  127. <malloc.h> NOT found.
  128. Checking to see how well your C compiler groks the void type...
  129. Good. It appears to support void to the level perl5 wants.
  130. Checking to see how big your pointers are...
  131. Do you wish to wrap malloc calls to protect against potential overflows? [y]
  132. Do you wish to attempt to use the malloc that comes with perl5? [n]
  133. Your system wants malloc to return 'void *', it would seem.
  134. Your system uses void free(), it would seem.
  135. Installation prefix to use for add-on modules and utilities? (~name ok)
  136. [/usr/pkg]
  137. Pathname for the site-specific library files? (~name ok)
  138. [/usr/pkg/lib/perl5/site_perl/5.8.0]
  139. Pathname for the site-specific architecture-dependent library files? (~name ok)
  140. [/usr/pkg/lib/perl5/site_perl/5.8.0/darwin-thread-multi-2level]
  141. Do you want to configure vendor-specific add-on directories? [y]
  142. Installation prefix to use for vendor-supplied add-ons? (~name ok)
  143. [/usr/pkg]
  144. Pathname for the vendor-supplied library files? (~name ok)
  145. [/usr/pkg/lib/perl5/vendor_perl/5.8.0]
  146. Pathname for vendor-supplied architecture-dependent files? (~name ok)
  147. [/usr/pkg/lib/perl5/vendor_perl/5.8.0/darwin-thread-multi-2level]
  148. Colon-separated list of additional directories for perl to search? [none]
  149. Checking out function prototypes...
  150. Pathname where the public executables will reside? (~name ok) [/usr/pkg/bin]
  151. Install any extra modules (y or n)? [n]
  152. Directory for the main Perl5 html pages? (~name ok) [none]
  153. Directory for the Perl5 module html pages? (~name ok) [none]
  154. List of earlier versions to include in @INC? [none]
  155. Do you want to install perl as /usr/bin/perl? [n]
  156. Checking for GNU C Library...
  157. Shall I use /usr/bin/nm to extract C symbols from the libraries? [y]
  158. Where is your C library? [/usr/lib/libc.dylib]
  159. Extracting names from the following files for later perusal:
  160. /usr/lib/libc.dylib
  161. /usr/lib/libm.dylib
  162. /usr/lib/libpthread.dylib
  163. This may take a while..................done.
  164. <dld.h> NOT found.
  165. dlopen() found.
  166. Do you wish to use dynamic loading? [y]
  167. Source file to use for dynamic loading [ext/DynaLoader/dl_dlopen.xs]
  168. Any special flags to pass to gcc -pipe -c to compile shared library modules?
  169. [none]
  170. What command should be used to create dynamic libraries?
  171. [env MACOSX_DEPLOYMENT_TARGET=10.3 cc]
  172. Any special flags to pass to env MACOSX_DEPLOYMENT_TARGET=10.3 cc to create a dynamically loaded library?
  173. [ -bundle -undefined dynamic_lookup -L/usr/pkg/lib]
  174. Any special flags to pass to gcc -pipe to use dynamic linking? [none]
  175. Build a shared libperl.dylib (y/n) [y]
  176. What name do you want to give to the shared libperl? [libperl.dylib]
  177. System manual is in /usr/share/man/man1.
  178. Where do the main Perl5 manual pages (source) go? (~name ok)
  179. [/usr/pkg/lib/perl5/man/man1]
  180. What suffix should be used for the main Perl5 man pages? [1]
  181. You can have filenames longer than 14 characters.
  182. Where do the perl5 library man pages (source) go? (~name ok)
  183. [/usr/pkg/lib/perl5/man/man3]
  184. What suffix should be used for the perl5 library man pages? [3]
  185. Figuring out host name...
  186. Your host name appears to be "luemmel.localnet". Right? [y]
  187. What is your domain name? [.localnet]
  188. What is your e-mail address? [[email protected]]
  189. Perl administrator e-mail address [[email protected]]
  190. Do you want to install only the version-specific parts of perl? [n]
  191. What shall I put after the #! to start up perl ("none" to not use #!)?
  192. [/usr/pkg/bin/perl]
  193. Where do you keep publicly executable scripts? (~name ok)
  194. [/usr/pkg/lib/perl5/bin]
  195. Directory /usr/pkg/lib/perl5/bin doesn't exist. Use that name anyway? [y]
  196. Pathname where the add-on public executables should be installed? (~name ok)
  197. [/usr/pkg/lib/perl5/site_perl/bin]
  198. Directory /usr/pkg/lib/perl5/site_perl/bin doesn't exist. Use that name anyway?
  199. [y]
  200. Pathname where the site-specific html pages should be installed? (~name ok)
  201. [none]
  202. Pathname where the site-specific library html pages should be installed? (~name ok)
  203. [none]
  204. Pathname where the site-specific manual pages should be installed? (~name ok)
  205. [/usr/pkg/lib/perl5/site_perl/man/man1]
  206. Pathname where the site-specific library manual pages should be installed? (~name ok)
  207. [/usr/pkg/lib/perl5/site_perl/man/man3]
  208. Pathname where add-on public executable scripts should be installed? (~name ok)
  209. [/usr/pkg/lib/perl5/site_perl/bin]
  210. Use the "fast stdio" if available? [y]
  211. off_t found.
  212. Checking to see how big your file offsets are...
  213. fpos_t found.
  214. Checking the size of fpos_t...
  215. Pathname for the vendor-supplied executables directory? (~name ok)
  216. [/usr/pkg/lib/perl5/vendor_perl/bin]
  217. Pathname for the vendor-supplied html pages? (~name ok) [none]
  218. Pathname for the vendor-supplied html pages? (~name ok) [none]
  219. Pathname for the vendor-supplied manual section 1 pages? (~name ok)
  220. [/usr/pkg/lib/perl5/vendor_perl/man/man1]
  221. Pathname for the vendor-supplied manual section 3 pages? (~name ok)
  222. [/usr/pkg/lib/perl5/vendor_perl/man/man3]
  223. Pathname for the vendor-supplied scripts directory? (~name ok)
  224. [/usr/pkg/lib/perl5/vendor_perl/bin]
  225. qgcvt() NOT found.
  226. Checking how to print long doubles...
  227. gconvert NOT found.
  228. gcvt() found.
  229. sprintf() found.
  230. I'll use sprintf to convert floats into a string.
  231. fwalk() found.
  232. access() found.
  233. <sys/file.h> defines the *_OK access constants.
  234. accessx() NOT found.
  235. aintl() NOT found.
  236. alarm() found.
  237. <pthread.h> found.
  238. <sys/types.h> found.
  239. <sys/select.h> found.
  240. Testing to see if we should include <time.h>, <sys/time.h> or both.
  241. We'll include <sys/time.h>.
  242. Checking to see if your struct tm has tm_zone field...
  243. Checking to see if your struct tm has tm_gmtoff field...
  244. asctime_r() found.
  245. atolf() NOT found.
  246. atoll() found.
  247. Checking whether your compiler can handle __attribute__((format)) ...
  248. Checking whether your compiler can handle __attribute__((malloc)) ...
  249. Checking whether your compiler can handle __attribute__((nonnull(1))) ...
  250. Checking whether your compiler can handle __attribute__((noreturn)) ...
  251. Checking whether your compiler can handle __attribute__((pure)) ...
  252. Checking whether your compiler can handle __attribute__((unused)) ...
  253. Checking whether your compiler can handle __attribute__((warn_unused_result)) ...
  254. bcmp() found.
  255. bcopy() found.
  256. <unistd.h> found.
  257. getpgrp() found.
  258. You have to use getpgrp() instead of getpgrp(pid).
  259. setpgrp() found.
  260. You have to use setpgrp() instead of setpgrp(pid,pgrp).
  261. bzero() found.
  262. You have void (*signal())().
  263. Checking whether your C compiler can cast large floats to int32.
  264. Checking whether your C compiler can cast negative float to unsigned.
  265. vprintf() found.
  266. Your vsprintf() returns (char*).
  267. chown() found.
  268. chroot() found.
  269. chsize() NOT found.
  270. class() NOT found.
  271. clearenv() NOT found.
  272. Hmm... Looks like you have Berkeley networking support.
  273. socketpair() found.
  274. Checking the availability of certain socket constants...
  275. <sys/uio.h> found.
  276. Checking to see if your system supports struct cmsghdr...
  277. Checking to see if your C compiler knows about "const"...
  278. copysignl() found.
  279. crypt() found.
  280. <crypt.h> NOT found.
  281. crypt_r() NOT found.
  282. ctermid_r() found.
  283. ctime_r() found.
  284. cuserid() NOT found.
  285. <limits.h> found.
  286. <float.h> found.
  287. DBL_DIG found.
  288. dbmclose() NOT found.
  289. difftime() found.
  290. <dirent.h> found.
  291. Your directory entries are struct dirent.
  292. Good, your directory entry keeps length information in d_namlen.
  293. <sys/dir.h> found.
  294. <sys/ndir.h> NOT found.
  295. dirfd() found.
  296. dlerror() found.
  297. <dlfcn.h> found.
  298. What is the extension of dynamically loaded modules [bundle]
  299. Checking whether your dlsym() needs a leading underscore ...
  300. dlsym doesn't need a leading underscore.
  301. drand48_r() NOT found.
  302. dup2() found.
  303. eaccess() NOT found.
  304. endgrent() found.
  305. <grp.h> found.
  306. endgrent_r() NOT found.
  307. endhostent() found.
  308. <netdb.h> found.
  309. endhostent_r() NOT found.
  310. endnetent() found.
  311. endnetent_r() NOT found.
  312. endprotoent() found.
  313. endprotoent_r() NOT found.
  314. endpwent() found.
  315. <pwd.h> found.
  316. endpwent_r() NOT found.
  317. endservent() found.
  318. endservent_r() NOT found.
  319. <sys/file.h> defines the O_* constants...
  320. and you have the 3 argument form of open().
  321. Using <string.h> instead of <strings.h>.
  322. <sys/file.h> found.
  323. We'll be including <sys/file.h>.
  324. <fcntl.h> found.
  325. We don't need to include <fcntl.h> if we include <sys/file.h>.
  326. Figuring out the flag used by open() for non-blocking I/O...
  327. Let's see what value errno gets from read() on a O_NONBLOCK file...
  328. Checking how std your stdio is...
  329. Checking to see what happens if we set the stdio ptr...
  330. Increasing ptr in your stdio leaves cnt unchanged. Good.
  331. You seem to have 'fast stdio' to directly manipulate the stdio buffers.
  332. fchdir() found.
  333. fchmod() found.
  334. fchown() found.
  335. fcntl() found.
  336. Well, your system knows about the normal fd_set typedef...
  337. and you have the normal fd_set macros (just as I'd expect).
  338. fgetpos() found.
  339. finite() found.
  340. finitel() NOT found.
  341. flock() found.
  342. fork() found.
  343. fp_class() NOT found.
  344. pathconf() found.
  345. fpathconf() found.
  346. fpclass() NOT found.
  347. fpclassify() found.
  348. fpclassl() NOT found.
  349. Checking to see if you have fpos64_t...
  350. frexpl() found.
  351. <sys/param.h> found.
  352. <sys/mount.h> found.
  353. Checking to see if your system supports struct fs_data...
  354. fseeko() found.
  355. fsetpos() found.
  356. fstatfs() found.
  357. statvfs() found.
  358. fstatvfs() found.
  359. fsync() found.
  360. ftello() found.
  361. Checking for a working futimes()
  362. Yes, it does
  363. getcwd() found.
  364. getespwnam() NOT found.
  365. getfsstat() found.
  366. getgrent() found.
  367. getgrent_r() NOT found.
  368. getgrgid_r() found.
  369. getgrnam_r() found.
  370. gethostbyaddr() found.
  371. gethostbyname() found.
  372. gethostent() found.
  373. gethostname() found.
  374. uname() found.
  375. Shall I ignore gethostname() from now on? [n]
  376. gethostbyaddr_r() NOT found.
  377. gethostbyname_r() NOT found.
  378. gethostent_r() NOT found.
  379. getitimer() found.
  380. getlogin() found.
  381. getlogin_r() found.
  382. getmnt() NOT found.
  383. getmntent() NOT found.
  384. getnetbyaddr() found.
  385. getnetbyname() found.
  386. getnetent() found.
  387. getnetbyaddr_r() NOT found.
  388. getnetbyname_r() NOT found.
  389. getnetent_r() NOT found.
  390. getpagesize() found.
  391. getprotobyname() found.
  392. getprotobynumber() found.
  393. getprotoent() found.
  394. getpgid() found.
  395. getpgrp2() NOT found.
  396. getppid() found.
  397. getpriority() found.
  398. getprotobyname_r() NOT found.
  399. getprotobynumber_r() NOT found.
  400. getprotoent_r() NOT found.
  401. getprpwnam() NOT found.
  402. getpwent() found.
  403. getpwent_r() NOT found.
  404. getpwnam_r() found.
  405. getpwuid_r() found.
  406. getservbyname() found.
  407. getservbyport() found.
  408. getservent() found.
  409. getservbyname_r() NOT found.
  410. getservbyport_r() NOT found.
  411. getservent_r() NOT found.
  412. getspnam() NOT found.
  413. <shadow.h> NOT found.
  414. getspnam_r() NOT found.
  415. gettimeofday() found.
  416. gmtime_r() found.
  417. hasmntopt() NOT found.
  418. <netinet/in.h> found.
  419. <arpa/inet.h> found.
  420. htonl() found.
  421. ilogbl() found.
  422. strchr() found.
  423. inet_aton() found.
  424. isascii() found.
  425. isfinite() found.
  426. isinf() found.
  427. isnan() found.
  428. isnanl() NOT found.
  429. killpg() found.
  430. lchown() found.
  431. LDBL_DIG found.
  432. <math.h> found.
  433. Checking to see if your libm supports _LIB_VERSION...
  434. No, it does not (probably harmless)
  435.  
  436. link() found.
  437. localtime_r() found.
  438. localeconv() found.
  439. lockf() found.
  440. lstat() found.
  441. madvise() found.
  442. malloc_size() found.
  443. malloc_good_size() found.
  444. mblen() found.
  445. mbstowcs() found.
  446. mbtowc() found.
  447. memchr() found.
  448. memcmp() found.
  449. memcpy() found.
  450. memmove() found.
  451. memset() found.
  452. mkdir() found.
  453. mkdtemp() found.
  454. mkfifo() found.
  455. mkstemp() found.
  456. mkstemps() found.
  457. mktime() found.
  458. <sys/mman.h> found.
  459. mmap() found.
  460. and it returns (void *).
  461. sqrtl() found.
  462. scalbnl() found.
  463. modfl() found.
  464. Your modfl() seems okay for large values.
  465. mprotect() found.
  466. msgctl() found.
  467. msgget() found.
  468. msgsnd() found.
  469. msgrcv() found.
  470. You have the full msg*(2) library.
  471. Checking to see if your system supports struct msghdr...
  472. msync() found.
  473. munmap() found.
  474. nice() found.
  475. <langinfo.h> found.
  476. nl_langinfo() found.
  477. Checking to see how big your characters are (hey, you never know)...
  478. What is the size of a character (in bytes)? [1]
  479. Checking to see if your C compiler knows about "volatile"...
  480. Choosing the C types to be used for Perl's internal types...
  481. Checking how many bits of your UVs your NVs can preserve...
  482. Checking whether NV 0.0 is all bits zero in memory...
  483. 0.0 is represented as all bits zero in memory
  484. Checking to see if you have off64_t...
  485. Checking what constant to use for creating joinable pthreads...
  486. You seem to use PTHREAD_CREATE_JOINABLE.
  487. pause() found.
  488. pipe() found.
  489. poll() found.
  490. *** WHOA THERE!!! ***
  491. The recommended value for $d_poll on this machine was "undef"!
  492. Keep the recommended value? [y]
  493. readlink() found.
  494. pthread_atfork found.
  495. pthread_attr_setscope() found.
  496. sched_yield() found.
  497. pthread_yield() NOT found.
  498. random_r() NOT found.
  499. readdir() found.
  500. seekdir() found.
  501. telldir() found.
  502. rewinddir() found.
  503. readdir64_r() NOT found.
  504. readdir_r() found.
  505. readv() found.
  506. recvmsg() found.
  507. rename() found.
  508. rmdir() found.
  509. <memory.h> found.
  510. Checking if your memcmp() can compare relative magnitude...
  511. select() found.
  512. semctl() found.
  513. semget() found.
  514. semop() found.
  515. You have the full sem*(2) library.
  516. You have union semun in <sys/sem.h>.
  517. You can use union semun for semctl IPC_STAT.
  518. You can also use struct semid_ds* for semctl IPC_STAT.
  519. sendmsg() found.
  520. setegid() found.
  521. seteuid() found.
  522. setgrent() found.
  523. setgrent_r() NOT found.
  524. sethostent() found.
  525. sethostent_r() NOT found.
  526. setitimer() found.
  527. setlinebuf() found.
  528. setlocale() found.
  529. <locale.h> found.
  530. setlocale_r() NOT found.
  531. setnetent() found.
  532. setnetent_r() NOT found.
  533. setprotoent() found.
  534. setpgid() found.
  535. setpgrp2() NOT found.
  536. setpriority() found.
  537. setproctitle() NOT found.
  538. setprotoent_r() NOT found.
  539. setpwent() found.
  540. setpwent_r() NOT found.
  541. setregid() found.
  542. *** WHOA THERE!!! ***
  543. The recommended value for $d_setregid on this machine was "undef"!
  544. Keep the recommended value? [y]
  545. setresgid() NOT found.
  546. setreuid() found.
  547. *** WHOA THERE!!! ***
  548. The recommended value for $d_setreuid on this machine was "undef"!
  549. Keep the recommended value? [y]
  550. setresuid() NOT found.
  551. setrgid() found.
  552. *** WHOA THERE!!! ***
  553. The recommended value for $d_setrgid on this machine was "undef"!
  554. Keep the recommended value? [y]
  555. setruid() found.
  556. *** WHOA THERE!!! ***
  557. The recommended value for $d_setruid on this machine was "undef"!
  558. Keep the recommended value? [y]
  559. setservent() found.
  560. setservent_r() NOT found.
  561. setsid() found.
  562. setvbuf() found.
  563. <sfio.h> NOT found.
  564. shmctl() found.
  565. shmget() found.
  566. shmat() found.
  567. and it returns (void *).
  568. shmdt() found.
  569. You have the full shm*(2) library.
  570. sigaction() found.
  571. sigprocmask() found.
  572. POSIX sigsetjmp found.
  573. sockatmark() found.
  574. socks5_init() NOT found.
  575. Checking whether sprintf returns the length of the string...
  576. sprintf returns the length of the string (as ANSI says it should)
  577. srand48_r() NOT found.
  578. srandom_r() NOT found.
  579. <sys/stat.h> found.
  580. Checking to see if your struct stat has st_blocks field...
  581. <sys/vfs.h> NOT found.
  582. <sys/statfs.h> NOT found.
  583. Checking to see if your system supports struct statfs...
  584. Checking to see if your struct statfs has f_flags field...
  585. Checking how to access stdio streams by file descriptor number...
  586. I can't figure out how to access stdio streams by file descriptor number.
  587. strcoll() found.
  588. Checking to see if your C compiler can copy structs...
  589. strerror() found.
  590. strerror_r() found.
  591. strftime() found.
  592. strlcat() found.
  593. strlcpy() found.
  594. strtod() found.
  595. strtol() found.
  596. strtold() found.
  597. strtoll() found.
  598. strtoq() found.
  599. strtoul() found.
  600. strtoull() found.
  601. strtouq() found.
  602. strxfrm() found.
  603. symlink() found.
  604. syscall() found.
  605. sysconf() found.
  606. system() found.
  607. tcgetpgrp() found.
  608. tcsetpgrp() found.
  609. time() found.
  610. time_t found.
  611. <sys/times.h> found.
  612. times() found.
  613. clock_t found.
  614. tmpnam_r() NOT found.
  615. truncate() found.
  616. ttyname_r() found.
  617. tzname[] found.
  618. (Testing for character data alignment may crash the test. That's okay.)
  619. It seems that you must access character data in an aligned manner.
  620. ualarm() found.
  621. umask() found.
  622. unordered() NOT found.
  623. unsetenv() found.
  624. usleep() found.
  625. ustat() NOT found.
  626. vfork() found.
  627. Do you still want to use vfork()? [y]
  628. closedir() found.
  629. Checking whether closedir() returns a status...
  630. wait4() found.
  631. waitpid() found.
  632. wcstombs() found.
  633. wctomb() found.
  634. writev() found.
  635. Checking to see how your cpp does stuff like concatenate tokens...
  636. Oh! Smells like ANSI's been here.
  637. <db.h> found.
  638. Checking Berkeley DB version ...
  639. Looks OK.
  640. Checking return type needed for hash for Berkeley DB ...
  641. Checking return type needed for prefix for Berkeley DB ...
  642. Looking for a random number function...
  643. Good, found drand48().
  644. Use which function to generate random numbers? [drand48]
  645. Determining whether or not we are on an EBCDIC system...
  646. Nope, no EBCDIC, probably ASCII or some ISO Latin. Or UTF-8.
  647. Checking how to flush all pending stdio output...
  648. Your fflush(NULL) works okay for output streams.
  649. Let's see if it clobbers input pipes...
  650. fflush(NULL) seems to behave okay with input streams.
  651. Checking the size of gid_t...
  652. Checking the sign of gid_t...
  653. Checking how to print 64-bit integers...
  654. Checking the format strings to be used for Perl's internal types...
  655. Checking the format string to be used for gids...
  656. getgroups() found.
  657. setgroups() found.
  658. What type pointer is the second argument to getgroups() and setgroups()?
  659. [gid_t]
  660. Checking if your /usr/pkgsrc/lang/perl5/work/.tools/bin/make program sets $(MAKE)...
  661. mode_t found.
  662. <stdarg.h> found.
  663. <varargs.h> found.
  664. We'll include <stdarg.h> to get va_dcl definition.
  665. It seems that you don't need va_copy().
  666. size_t found.
  667. What is the type for the 1st argument to gethostbyaddr? [char *]
  668. What is the type for the 2nd argument to gethostbyaddr? [size_t]
  669. What pager is used on your system? [/usr/bin/less]
  670. pid_t found.
  671. Checking how to generate random libraries on your machine...
  672. Your select() operates on 32 bits at a time.
  673. Generating a list of signal names and numbers...
  674. Checking the size of size_t...
  675. Checking to see if you have socklen_t...
  676. <socks.h> NOT found.
  677. I'll be using ssize_t for functions returning a byte count.
  678. Your stdio uses signed chars.
  679. Checking the size of uid_t...
  680. Checking the sign of uid_t...
  681. Checking the format string to be used for uids...
  682. Which compiler compiler (yacc or bison -y) shall I use? [yacc]
  683. <fp.h> NOT found.
  684. <fp_class.h> NOT found.
  685. <ieeefp.h> NOT found.
  686. <libutil.h> NOT found.
  687. <mach/cthreads.h> NOT found.
  688. <mntent.h> NOT found.
  689. <ndbm.h> found.
  690. dbm_open() found.
  691. <net/errno.h> NOT found.
  692. <netinet/tcp.h> found.
  693. <poll.h> found.
  694. *** WHOA THERE!!! ***
  695. The recommended value for $i_poll on this machine was "undef"!
  696. Keep the recommended value? [y]
  697. <prot.h> NOT found.
  698. Guessing which symbols your C compiler and preprocessor define...
  699. tcsetattr() found.
  700. You have POSIX termios.h... good!
  701. <stddef.h> found.
  702. <sunmath.h> NOT found.
  703. <sys/access.h> NOT found.
  704. <sys/filio.h> found.
  705. <sys/ioctl.h> found.
  706. You have socket ioctls defined in <sys/sockio.h>.
  707. <syslog.h> found.
  708. <sys/mode.h> NOT found.
  709. <sys/resource.h> found.
  710. <sys/security.h> NOT found.
  711. <sys/statvfs.h> found.
  712. <sys/un.h> found.
  713. <sys/utsname.h> found.
  714. <sys/wait.h> found.
  715. <ustat.h> NOT found.
  716. <utime.h> found.
  717. <values.h> NOT found.
  718. <vfork.h> NOT found.
  719. <gdbm.h> NOT found.
  720. Looking for extensions...
  721. What extensions do you wish to load dynamically?
  722. [B ByteLoader Cwd DB_File Data/Dumper Devel/DProf Devel/PPPort Devel/Peek Digest/MD5 Encode Fcntl File/Glob Filter/Util/Call I18N/Langinfo IO IPC/SysV List/Util MIME/Base64 NDBM_File Opcode POSIX PerlIO/encoding PerlIO/scalar PerlIO/via SDBM_File Socket Storable Sys/Hostname Sys/Syslog Time/HiRes Unicode/Normalize XS/APItest XS/Typemap attrs re threads threads/shared]
  723. What extensions do you wish to load statically? [none]
  724. Stripping down executable paths...
  725. Creating config.sh...
  726. Doing variable substitutions on .SH files...
  727. Extracting cflags (with variable substitutions)
  728. Extracting config.h (with variable substitutions)
  729. Extracting makeaperl (with variable substitutions)
  730. Extracting makedepend (with variable substitutions)
  731. Extracting makedir (with variable substitutions)
  732. Extracting Makefile (with variable substitutions)
  733. Extracting myconfig (with variable substitutions)
  734. Extracting pod/Makefile (with variable substitutions)
  735. Extracting Policy.sh (with variable substitutions)
  736. Extracting writemain (with variable substitutions)
  737. Extracting x2p/cflags (with variable substitutions)
  738. Extracting x2p/Makefile (with variable substitutions)
  739. Run make depend now? [y]
  740. sh ./makedepend MAKE=make
  741. sh writemain lib/auto/DynaLoader/DynaLoader.a > perlmain.c
  742. rm -f opmini.c
  743. cp op.c opmini.c
  744. echo av.c scope.c op.c doop.c doio.c dump.c hv.c mg.c reentr.c perl.c perly.c pp.c pp_hot.c pp_ctl.c pp_sys.c regcomp.c regexec.c utf8.c gv.c sv.c taint.c toke.c util.c deb.c run.c universal.c xsutils.c pad.c globals.c perlio.c perlapi.c numeric.c locale.c pp_pack.c pp_sort.c miniperlmain.c perlmain.c opmini.c | tr ' ' '\n' >.clist
  745. Finding dependencies for av.o.
  746. Finding dependencies for scope.o.
  747. Finding dependencies for op.o.
  748. Finding dependencies for doop.o.
  749. Finding dependencies for doio.o.
  750. Finding dependencies for dump.o.
  751. Finding dependencies for hv.o.
  752. Finding dependencies for mg.o.
  753. Finding dependencies for reentr.o.
  754. Finding dependencies for perl.o.
  755. Finding dependencies for perly.o.
  756. Finding dependencies for pp.o.
  757. Finding dependencies for pp_hot.o.
  758. Finding dependencies for pp_ctl.o.
  759. Finding dependencies for pp_sys.o.
  760. Finding dependencies for regcomp.o.
  761. Finding dependencies for regexec.o.
  762. Finding dependencies for utf8.o.
  763. Finding dependencies for gv.o.
  764. Finding dependencies for sv.o.
  765. Finding dependencies for taint.o.
  766. Finding dependencies for toke.o.
  767. Finding dependencies for util.o.
  768. Finding dependencies for deb.o.
  769. Finding dependencies for run.o.
  770. Finding dependencies for universal.o.
  771. Finding dependencies for xsutils.o.
  772. Finding dependencies for pad.o.
  773. Finding dependencies for globals.o.
  774. Finding dependencies for perlio.o.
  775. Finding dependencies for perlapi.o.
  776. Finding dependencies for numeric.o.
  777. Finding dependencies for locale.o.
  778. Finding dependencies for pp_pack.o.
  779. Finding dependencies for pp_sort.o.
  780. Finding dependencies for miniperlmain.o.
  781. Finding dependencies for perlmain.o.
  782. Finding dependencies for opmini.o.
  783. echo Makefile.SH cflags.SH config_h.SH makeaperl.SH makedepend.SH makedir.SH myconfig.SH writemain.SH pod/Makefile.SH | tr ' ' '\n' >.shlist
  784. Updating GNUmakefile...
  785. test -s perlmain.c && touch perlmain.c
  786. cd x2p; make depend
  787. sh ../makedepend MAKE=make
  788. echo hash.c str.c util.c walk.c | tr ' ' '\n' >.clist
  789. Finding dependencies for hash.o.
  790. Finding dependencies for str.o.
  791. Finding dependencies for util.o.
  792. Finding dependencies for walk.o.
  793. echo Makefile.SH cflags.SH | tr ' ' '\n' >.shlist
  794. Updating GNUmakefile...
  795. Now you must run 'make'.
  796.  
  797. If you compile perl5 on a different machine or from a different object
  798. directory, copy the Policy.sh file from this object directory to the
  799. new one before you run Configure -- this will help you with most of
  800. the policy defaults.
  801.  
  802. ===> Building for perl-5.8.8nb4
  803. `sh cflags "optimize='-O2 -mcpu=G5 -maltivec -mabi=altivec -fno-strict-aliasing -pipe -D_REENTRANT -I/usr/include'" miniperlmain.o` miniperlmain.c
  804. CCCMD = gcc -pipe -DPERL_CORE -c -fno-common -DPERL_DARWIN -no-cpp-precomp -fno-strict-aliasing -pipe -Wdeclaration-after-statement -I/usr/pkg/include -O2 -mcpu=G5 -maltivec -mabi=altivec -fno-strict-aliasing -pipe -D_REENTRANT -I/usr/include -Wall
  805. `sh cflags "optimize='-O2 -mcpu=G5 -maltivec -mabi=altivec -fno-strict-aliasing -pipe -D_REENTRANT -I/usr/include'" perl.o` perl.c
  806. CCCMD = gcc -pipe -DPERL_CORE -c -fno-common -DPERL_DARWIN -no-cpp-precomp -fno-strict-aliasing -pipe -Wdeclaration-after-statement -I/usr/pkg/include -O2 -mcpu=G5 -maltivec -mabi=altivec -fno-strict-aliasing -pipe -D_REENTRANT -I/usr/include -Wall
  807. `sh cflags "optimize='-O2 -mcpu=G5 -maltivec -mabi=altivec -fno-strict-aliasing -pipe -D_REENTRANT -I/usr/include'" gv.o` gv.c
  808. CCCMD = gcc -pipe -DPERL_CORE -c -fno-common -DPERL_DARWIN -no-cpp-precomp -fno-strict-aliasing -pipe -Wdeclaration-after-statement -I/usr/pkg/include -O2 -mcpu=G5 -maltivec -mabi=altivec -fno-strict-aliasing -pipe -D_REENTRANT -I/usr/include -Wall
  809. `sh cflags "optimize='-O2 -mcpu=G5 -maltivec -mabi=altivec -fno-strict-aliasing -pipe -D_REENTRANT -I/usr/include'" toke.o` toke.c
  810. CCCMD = gcc -pipe -DPERL_CORE -c -fno-common -DPERL_DARWIN -no-cpp-precomp -fno-strict-aliasing -pipe -Wdeclaration-after-statement -I/usr/pkg/include -O2 -mcpu=G5 -maltivec -mabi=altivec -fno-strict-aliasing -pipe -D_REENTRANT -I/usr/include -Wall
  811. `sh cflags "optimize='-O2 -mcpu=G5 -maltivec -mabi=altivec -fno-strict-aliasing -pipe -D_REENTRANT -I/usr/include'" perly.o` perly.c
  812. CCCMD = gcc -pipe -DPERL_CORE -c -fno-common -DPERL_DARWIN -no-cpp-precomp -fno-strict-aliasing -pipe -Wdeclaration-after-statement -I/usr/pkg/include -O2 -mcpu=G5 -maltivec -mabi=altivec -fno-strict-aliasing -pipe -D_REENTRANT -I/usr/include -Wall
  813. `sh cflags "optimize='-O2 -mcpu=G5 -maltivec -mabi=altivec -fno-strict-aliasing -pipe -D_REENTRANT -I/usr/include'" op.o` op.c
  814. CCCMD = gcc -pipe -DPERL_CORE -c -fno-common -DPERL_DARWIN -no-cpp-precomp -fno-strict-aliasing -pipe -Wdeclaration-after-statement -I/usr/pkg/include -O2 -mcpu=G5 -maltivec -mabi=altivec -fno-strict-aliasing -pipe -D_REENTRANT -I/usr/include -Wall
  815. `sh cflags "optimize='-O2 -mcpu=G5 -maltivec -mabi=altivec -fno-strict-aliasing -pipe -D_REENTRANT -I/usr/include'" pad.o` pad.c
  816. CCCMD = gcc -pipe -DPERL_CORE -c -fno-common -DPERL_DARWIN -no-cpp-precomp -fno-strict-aliasing -pipe -Wdeclaration-after-statement -I/usr/pkg/include -O2 -mcpu=G5 -maltivec -mabi=altivec -fno-strict-aliasing -pipe -D_REENTRANT -I/usr/include -Wall
  817. `sh cflags "optimize='-O2 -mcpu=G5 -maltivec -mabi=altivec -fno-strict-aliasing -pipe -D_REENTRANT -I/usr/include'" regcomp.o` regcomp.c
  818. CCCMD = gcc -pipe -DPERL_CORE -c -fno-common -DPERL_DARWIN -no-cpp-precomp -fno-strict-aliasing -pipe -Wdeclaration-after-statement -I/usr/pkg/include -O2 -mcpu=G5 -maltivec -mabi=altivec -fno-strict-aliasing -pipe -D_REENTRANT -I/usr/include -Wall
  819. regcomp.c: In function 'S_study_chunk':
  820. regcomp.c:723: warning: comparison is always false due to limited range of data type
  821. `sh cflags "optimize='-O2 -mcpu=G5 -maltivec -mabi=altivec -fno-strict-aliasing -pipe -D_REENTRANT -I/usr/include'" dump.o` dump.c
  822. CCCMD = gcc -pipe -DPERL_CORE -c -fno-common -DPERL_DARWIN -no-cpp-precomp -fno-strict-aliasing -pipe -Wdeclaration-after-statement -I/usr/pkg/include -O2 -mcpu=G5 -maltivec -mabi=altivec -fno-strict-aliasing -pipe -D_REENTRANT -I/usr/include -Wall
  823. `sh cflags "optimize='-O2 -mcpu=G5 -maltivec -mabi=altivec -fno-strict-aliasing -pipe -D_REENTRANT -I/usr/include'" util.o` util.c
  824. CCCMD = gcc -pipe -DPERL_CORE -c -fno-common -DPERL_DARWIN -no-cpp-precomp -fno-strict-aliasing -pipe -Wdeclaration-after-statement -I/usr/pkg/include -O2 -mcpu=G5 -maltivec -mabi=altivec -fno-strict-aliasing -pipe -D_REENTRANT -I/usr/include -Wall
  825. `sh cflags "optimize='-O2 -mcpu=G5 -maltivec -mabi=altivec -fno-strict-aliasing -pipe -D_REENTRANT -I/usr/include'" mg.o` mg.c
  826. CCCMD = gcc -pipe -DPERL_CORE -c -fno-common -DPERL_DARWIN -no-cpp-precomp -fno-strict-aliasing -pipe -Wdeclaration-after-statement -I/usr/pkg/include -O2 -mcpu=G5 -maltivec -mabi=altivec -fno-strict-aliasing -pipe -D_REENTRANT -I/usr/include -Wall
  827. `sh cflags "optimize='-O2 -mcpu=G5 -maltivec -mabi=altivec -fno-strict-aliasing -pipe -D_REENTRANT -I/usr/include'" reentr.o` reentr.c
  828. CCCMD = gcc -pipe -DPERL_CORE -c -fno-common -DPERL_DARWIN -no-cpp-precomp -fno-strict-aliasing -pipe -Wdeclaration-after-statement -I/usr/pkg/include -O2 -mcpu=G5 -maltivec -mabi=altivec -fno-strict-aliasing -pipe -D_REENTRANT -I/usr/include -Wall
  829. `sh cflags "optimize='-O2 -mcpu=G5 -maltivec -mabi=altivec -fno-strict-aliasing -pipe -D_REENTRANT -I/usr/include'" hv.o` hv.c
  830. CCCMD = gcc -pipe -DPERL_CORE -c -fno-common -DPERL_DARWIN -no-cpp-precomp -fno-strict-aliasing -pipe -Wdeclaration-after-statement -I/usr/pkg/include -O2 -mcpu=G5 -maltivec -mabi=altivec -fno-strict-aliasing -pipe -D_REENTRANT -I/usr/include -Wall
  831. `sh cflags "optimize='-O2 -mcpu=G5 -maltivec -mabi=altivec -fno-strict-aliasing -pipe -D_REENTRANT -I/usr/include'" av.o` av.c
  832. CCCMD = gcc -pipe -DPERL_CORE -c -fno-common -DPERL_DARWIN -no-cpp-precomp -fno-strict-aliasing -pipe -Wdeclaration-after-statement -I/usr/pkg/include -O2 -mcpu=G5 -maltivec -mabi=altivec -fno-strict-aliasing -pipe -D_REENTRANT -I/usr/include -Wall
  833. `sh cflags "optimize='-O2 -mcpu=G5 -maltivec -mabi=altivec -fno-strict-aliasing -pipe -D_REENTRANT -I/usr/include'" run.o` run.c
  834. CCCMD = gcc -pipe -DPERL_CORE -c -fno-common -DPERL_DARWIN -no-cpp-precomp -fno-strict-aliasing -pipe -Wdeclaration-after-statement -I/usr/pkg/include -O2 -mcpu=G5 -maltivec -mabi=altivec -fno-strict-aliasing -pipe -D_REENTRANT -I/usr/include -Wall
  835. `sh cflags "optimize='-O2 -mcpu=G5 -maltivec -mabi=altivec -fno-strict-aliasing -pipe -D_REENTRANT -I/usr/include'" pp_hot.o` pp_hot.c
  836. CCCMD = gcc -pipe -DPERL_CORE -c -fno-common -DPERL_DARWIN -no-cpp-precomp -fno-strict-aliasing -pipe -Wdeclaration-after-statement -I/usr/pkg/include -O2 -mcpu=G5 -maltivec -mabi=altivec -fno-strict-aliasing -pipe -D_REENTRANT -I/usr/include -Wall
  837. `sh cflags "optimize='-O2 -mcpu=G5 -maltivec -mabi=altivec -fno-strict-aliasing -pipe -D_REENTRANT -I/usr/include'" sv.o` sv.c
  838. CCCMD = gcc -pipe -DPERL_CORE -c -fno-common -DPERL_DARWIN -no-cpp-precomp -fno-strict-aliasing -pipe -Wdeclaration-after-statement -I/usr/pkg/include -O2 -mcpu=G5 -maltivec -mabi=altivec -fno-strict-aliasing -pipe -D_REENTRANT -I/usr/include -Wall
  839. sv.c: In function 'Perl_sv_clear':
  840. sv.c:5222: warning: ignoring return value of 'Perl_io_close', declared with attribute warn_unused_result
  841. `sh cflags "optimize='-O2 -mcpu=G5 -maltivec -mabi=altivec -fno-strict-aliasing -pipe -D_REENTRANT -I/usr/include'" pp.o` pp.c
  842. CCCMD = gcc -pipe -DPERL_CORE -c -fno-common -DPERL_DARWIN -no-cpp-precomp -fno-strict-aliasing -pipe -Wdeclaration-after-statement -I/usr/pkg/include -O2 -mcpu=G5 -maltivec -mabi=altivec -fno-strict-aliasing -pipe -D_REENTRANT -I/usr/include -Wall
  843. `sh cflags "optimize='-O2 -mcpu=G5 -maltivec -mabi=altivec -fno-strict-aliasing -pipe -D_REENTRANT -I/usr/include'" scope.o` scope.c
  844. CCCMD = gcc -pipe -DPERL_CORE -c -fno-common -DPERL_DARWIN -no-cpp-precomp -fno-strict-aliasing -pipe -Wdeclaration-after-statement -I/usr/pkg/include -O2 -mcpu=G5 -maltivec -mabi=altivec -fno-strict-aliasing -pipe -D_REENTRANT -I/usr/include -Wall
  845. `sh cflags "optimize='-O2 -mcpu=G5 -maltivec -mabi=altivec -fno-strict-aliasing -pipe -D_REENTRANT -I/usr/include'" pp_ctl.o` pp_ctl.c
  846. CCCMD = gcc -pipe -DPERL_CORE -c -fno-common -DPERL_DARWIN -no-cpp-precomp -fno-strict-aliasing -pipe -Wdeclaration-after-statement -I/usr/pkg/include -O2 -mcpu=G5 -maltivec -mabi=altivec -fno-strict-aliasing -pipe -D_REENTRANT -I/usr/include -Wall
  847. `sh cflags "optimize='-O2 -mcpu=G5 -maltivec -mabi=altivec -fno-strict-aliasing -pipe -D_REENTRANT -I/usr/include'" pp_sys.o` pp_sys.c
  848. CCCMD = gcc -pipe -DPERL_CORE -c -fno-common -DPERL_DARWIN -no-cpp-precomp -fno-strict-aliasing -pipe -Wdeclaration-after-statement -I/usr/pkg/include -O2 -mcpu=G5 -maltivec -mabi=altivec -fno-strict-aliasing -pipe -D_REENTRANT -I/usr/include -Wall
  849. pp_sys.c:320: warning: 'S_emulate_eaccess' defined but not used
  850. `sh cflags "optimize='-O2 -mcpu=G5 -maltivec -mabi=altivec -fno-strict-aliasing -pipe -D_REENTRANT -I/usr/include'" doop.o` doop.c
  851. CCCMD = gcc -pipe -DPERL_CORE -c -fno-common -DPERL_DARWIN -no-cpp-precomp -fno-strict-aliasing -pipe -Wdeclaration-after-statement -I/usr/pkg/include -O2 -mcpu=G5 -maltivec -mabi=altivec -fno-strict-aliasing -pipe -D_REENTRANT -I/usr/include -Wall
  852. `sh cflags "optimize='-O2 -mcpu=G5 -maltivec -mabi=altivec -fno-strict-aliasing -pipe -D_REENTRANT -I/usr/include'" doio.o` doio.c
  853. CCCMD = gcc -pipe -DPERL_CORE -c -fno-common -DPERL_DARWIN -no-cpp-precomp -fno-strict-aliasing -pipe -Wdeclaration-after-statement -I/usr/pkg/include -O2 -mcpu=G5 -maltivec -mabi=altivec -fno-strict-aliasing -pipe -D_REENTRANT -I/usr/include -Wall
  854. `sh cflags "optimize='-O2 -mcpu=G5 -maltivec -mabi=altivec -fno-strict-aliasing -pipe -D_REENTRANT -I/usr/include'" regexec.o` regexec.c
  855. CCCMD = gcc -pipe -DPERL_CORE -c -fno-common -DPERL_DARWIN -no-cpp-precomp -fno-strict-aliasing -pipe -Wdeclaration-after-statement -I/usr/pkg/include -O2 -mcpu=G5 -maltivec -mabi=altivec -fno-strict-aliasing -pipe -D_REENTRANT -I/usr/include -Wall
  856. `sh cflags "optimize='-O2 -mcpu=G5 -maltivec -mabi=altivec -fno-strict-aliasing -pipe -D_REENTRANT -I/usr/include'" utf8.o` utf8.c
  857. CCCMD = gcc -pipe -DPERL_CORE -c -fno-common -DPERL_DARWIN -no-cpp-precomp -fno-strict-aliasing -pipe -Wdeclaration-after-statement -I/usr/pkg/include -O2 -mcpu=G5 -maltivec -mabi=altivec -fno-strict-aliasing -pipe -D_REENTRANT -I/usr/include -Wall
  858. `sh cflags "optimize='-O2 -mcpu=G5 -maltivec -mabi=altivec -fno-strict-aliasing -pipe -D_REENTRANT -I/usr/include'" taint.o` taint.c
  859. CCCMD = gcc -pipe -DPERL_CORE -c -fno-common -DPERL_DARWIN -no-cpp-precomp -fno-strict-aliasing -pipe -Wdeclaration-after-statement -I/usr/pkg/include -O2 -mcpu=G5 -maltivec -mabi=altivec -fno-strict-aliasing -pipe -D_REENTRANT -I/usr/include -Wall
  860. `sh cflags "optimize='-O2 -mcpu=G5 -maltivec -mabi=altivec -fno-strict-aliasing -pipe -D_REENTRANT -I/usr/include'" deb.o` deb.c
  861. CCCMD = gcc -pipe -DPERL_CORE -c -fno-common -DPERL_DARWIN -no-cpp-precomp -fno-strict-aliasing -pipe -Wdeclaration-after-statement -I/usr/pkg/include -O2 -mcpu=G5 -maltivec -mabi=altivec -fno-strict-aliasing -pipe -D_REENTRANT -I/usr/include -Wall
  862. `sh cflags "optimize='-O2 -mcpu=G5 -maltivec -mabi=altivec -fno-strict-aliasing -pipe -D_REENTRANT -I/usr/include'" universal.o` universal.c
  863. CCCMD = gcc -pipe -DPERL_CORE -c -fno-common -DPERL_DARWIN -no-cpp-precomp -fno-strict-aliasing -pipe -Wdeclaration-after-statement -I/usr/pkg/include -O2 -mcpu=G5 -maltivec -mabi=altivec -fno-strict-aliasing -pipe -D_REENTRANT -I/usr/include -Wall
  864. `sh cflags "optimize='-O2 -mcpu=G5 -maltivec -mabi=altivec -fno-strict-aliasing -pipe -D_REENTRANT -I/usr/include'" xsutils.o` xsutils.c
  865. CCCMD = gcc -pipe -DPERL_CORE -c -fno-common -DPERL_DARWIN -no-cpp-precomp -fno-strict-aliasing -pipe -Wdeclaration-after-statement -I/usr/pkg/include -O2 -mcpu=G5 -maltivec -mabi=altivec -fno-strict-aliasing -pipe -D_REENTRANT -I/usr/include -Wall
  866. `sh cflags "optimize='-O2 -mcpu=G5 -maltivec -mabi=altivec -fno-strict-aliasing -pipe -D_REENTRANT -I/usr/include'" globals.o` globals.c
  867. CCCMD = gcc -pipe -DPERL_CORE -c -fno-common -DPERL_DARWIN -no-cpp-precomp -fno-strict-aliasing -pipe -Wdeclaration-after-statement -I/usr/pkg/include -O2 -mcpu=G5 -maltivec -mabi=altivec -fno-strict-aliasing -pipe -D_REENTRANT -I/usr/include -Wall
  868. `sh cflags "optimize='-O2 -mcpu=G5 -maltivec -mabi=altivec -fno-strict-aliasing -pipe -D_REENTRANT -I/usr/include'" perlio.o` perlio.c
  869. CCCMD = gcc -pipe -DPERL_CORE -c -fno-common -DPERL_DARWIN -no-cpp-precomp -fno-strict-aliasing -pipe -Wdeclaration-after-statement -I/usr/pkg/include -O2 -mcpu=G5 -maltivec -mabi=altivec -fno-strict-aliasing -pipe -D_REENTRANT -I/usr/include -Wall
  870. perlio.c: In function 'PerlIO_clone':
  871. perlio.c:649: warning: ignoring return value of 'Perl_fp_dup', declared with attribute warn_unused_result
  872. `sh cflags "optimize='-O2 -mcpu=G5 -maltivec -mabi=altivec -fno-strict-aliasing -pipe -D_REENTRANT -I/usr/include'" perlapi.o` perlapi.c
  873. CCCMD = gcc -pipe -DPERL_CORE -c -fno-common -DPERL_DARWIN -no-cpp-precomp -fno-strict-aliasing -pipe -Wdeclaration-after-statement -I/usr/pkg/include -O2 -mcpu=G5 -maltivec -mabi=altivec -fno-strict-aliasing -pipe -D_REENTRANT -I/usr/include -Wall
  874. `sh cflags "optimize='-O2 -mcpu=G5 -maltivec -mabi=altivec -fno-strict-aliasing -pipe -D_REENTRANT -I/usr/include'" numeric.o` numeric.c
  875. CCCMD = gcc -pipe -DPERL_CORE -c -fno-common -DPERL_DARWIN -no-cpp-precomp -fno-strict-aliasing -pipe -Wdeclaration-after-statement -I/usr/pkg/include -O2 -mcpu=G5 -maltivec -mabi=altivec -fno-strict-aliasing -pipe -D_REENTRANT -I/usr/include -Wall
  876. `sh cflags "optimize='-O2 -mcpu=G5 -maltivec -mabi=altivec -fno-strict-aliasing -pipe -D_REENTRANT -I/usr/include'" locale.o` locale.c
  877. CCCMD = gcc -pipe -DPERL_CORE -c -fno-common -DPERL_DARWIN -no-cpp-precomp -fno-strict-aliasing -pipe -Wdeclaration-after-statement -I/usr/pkg/include -O2 -mcpu=G5 -maltivec -mabi=altivec -fno-strict-aliasing -pipe -D_REENTRANT -I/usr/include -Wall
  878. `sh cflags "optimize='-O2 -mcpu=G5 -maltivec -mabi=altivec -fno-strict-aliasing -pipe -D_REENTRANT -I/usr/include'" pp_pack.o` pp_pack.c
  879. CCCMD = gcc -pipe -DPERL_CORE -c -fno-common -DPERL_DARWIN -no-cpp-precomp -fno-strict-aliasing -pipe -Wdeclaration-after-statement -I/usr/pkg/include -O2 -mcpu=G5 -maltivec -mabi=altivec -fno-strict-aliasing -pipe -D_REENTRANT -I/usr/include -Wall
  880. `sh cflags "optimize='-O2 -mcpu=G5 -maltivec -mabi=altivec -fno-strict-aliasing -pipe -D_REENTRANT -I/usr/include'" pp_sort.o` pp_sort.c
  881. CCCMD = gcc -pipe -DPERL_CORE -c -fno-common -DPERL_DARWIN -no-cpp-precomp -fno-strict-aliasing -pipe -Wdeclaration-after-statement -I/usr/pkg/include -O2 -mcpu=G5 -maltivec -mabi=altivec -fno-strict-aliasing -pipe -D_REENTRANT -I/usr/include -Wall
  882. env MACOSX_DEPLOYMENT_TARGET=10.3 cc -o libperl.dylib -L/usr/pkg/lib -dynamiclib -compatibility_version 5.8.0 -current_version 5.8.8 -install_name /usr/pkg/lib/perl5/5.8.0/darwin-thread-multi-2level/CORE/libperl.dylib perl.o gv.o toke.o perly.o op.o pad.o regcomp.o dump.o util.o mg.o reentr.o hv.o av.o run.o pp_hot.o sv.o pp.o scope.o pp_ctl.o pp_sys.o doop.o doio.o regexec.o utf8.o taint.o deb.o universal.o xsutils.o globals.o perlio.o perlapi.o numeric.o locale.o pp_pack.o pp_sort.o -lm -lc -lpthread
  883. `sh cflags "optimize='-O2 -mcpu=G5 -maltivec -mabi=altivec -fno-strict-aliasing -pipe -D_REENTRANT -I/usr/include'" opmini.o` -DPERL_EXTERNAL_GLOB opmini.c
  884. CCCMD = gcc -pipe -DPERL_CORE -c -fno-common -DPERL_DARWIN -no-cpp-precomp -fno-strict-aliasing -pipe -Wdeclaration-after-statement -I/usr/pkg/include -O2 -mcpu=G5 -maltivec -mabi=altivec -fno-strict-aliasing -pipe -D_REENTRANT -I/usr/include -Wall
  885. gcc -pipe -L/usr/pkg/lib -force_flat_namespace -o miniperl \
  886. miniperlmain.o opmini.o libperl.dylib -lm -lc -lpthread
  887. DYLD_LIBRARY_PATH=/usr/pkgsrc/lang/perl5/work/perl-5.8.8 ./miniperl -w -Ilib -MExporter -e '<?>' || /usr/bin/gnumake minitest
  888. Can't locate File/Glob.pm in @INC (@INC contains: lib /usr/pkg/lib/perl5/site_perl/5.8.0/darwin-thread-multi-2level /usr/pkg/lib/perl5/site_perl/5.8.0 /usr/pkg/lib/perl5/site_perl /usr/pkg/lib/perl5/vendor_perl/5.8.0/darwin-thread-multi-2level /usr/pkg/lib/perl5/vendor_perl/5.8.0 /usr/pkg/lib/perl5/vendor_perl /usr/pkg/lib/perl5/5.8.0/darwin-thread-multi-2level /usr/pkg/lib/perl5/5.8.0 .) at -e line 1.
  889. BEGIN failed--compilation aborted at -e line 1.
  890. cp ext/re/re.pm lib/re.pm
  891. DYLD_LIBRARY_PATH=/usr/pkgsrc/lang/perl5/work/perl-5.8.8 ./miniperl -Ilib configpm --heavy=lib/Config_heavy.pl lib/Config.pm
  892. DYLD_LIBRARY_PATH=/usr/pkgsrc/lang/perl5/work/perl-5.8.8 ./miniperl -Ilib lib/lib_pm.PL
  893. Extracting lib.pm (with variable substitutions)
  894. cd lib/unicore && DYLD_LIBRARY_PATH=/usr/pkgsrc/lang/perl5/work/perl-5.8.8 ../../miniperl -I../../lib mktables -w
  895. Can't locate File/Glob.pm in @INC (@INC contains: ../../lib /usr/pkg/lib/perl5/site_perl/5.8.0/darwin-thread-multi-2level /usr/pkg/lib/perl5/site_perl/5.8.0 /usr/pkg/lib/perl5/site_perl /usr/pkg/lib/perl5/vendor_perl/5.8.0/darwin-thread-multi-2level /usr/pkg/lib/perl5/vendor_perl/5.8.0 /usr/pkg/lib/perl5/vendor_perl /usr/pkg/lib/perl5/5.8.0/darwin-thread-multi-2level /usr/pkg/lib/perl5/5.8.0 .) at mktables line 2111.
  896. BEGIN failed--compilation aborted at mktables line 2111.
  897. gnumake[2]: *** [uni.data] Error 2
  898. gnumake[1]: [minitest.prep] Error 2 (ignored)
  899.  
  900. You may see some irrelevant test failures if you have been unable
  901. to build lib/Config.pm, lib/lib.pm or the Unicode data files.
  902.  
  903. cd t && (rm -f perl; /bin/ln -s ../miniperl perl) \
  904. && DYLD_LIBRARY_PATH=/usr/pkgsrc/lang/perl5/work/perl-5.8.8 ./perl TEST -minitest base/*.t comp/*.t cmd/*.t run/*.t io/*.t op/*.t uni/*.t </dev/tty
  905. t/base/cond..........ok
  906. t/base/if............ok
  907. t/base/lex...........ok
  908. t/base/num...........ok
  909. t/base/pat...........ok
  910. t/base/rs............ok
  911. t/base/term..........ok
  912. t/comp/bproto........ok
  913. t/comp/cmdopt........ok
  914. t/comp/colon.........ok
  915. t/comp/cpp...........ok
  916. t/comp/decl..........ok
  917. t/comp/hints.........ok
  918. t/comp/multiline.....ok
  919. t/comp/opsubs........ok
  920. t/comp/our...........ok
  921. t/comp/package.......ok
  922. t/comp/parser........ok
  923. t/comp/proto.........ok
  924. t/comp/redef.........ok
  925. t/comp/require.......FAILED at test 28
  926. t/comp/script........ok
  927. t/comp/term..........ok
  928. t/comp/use...........ok
  929. t/comp/utf...........skipping test on this platform
  930. t/cmd/elsif..........ok
  931. t/cmd/for............ok
  932. t/cmd/mod............ok
  933. t/cmd/subval.........ok
  934. t/cmd/switch.........ok
  935. t/cmd/while..........ok
  936. t/run/exit...........ok
  937. t/run/fresh_perl.....# PROG:
  938. # Bug 20010506.041
  939. # "abcd\x{1234}" =~ /(a)(b[c])(d+)?/i and print "ok\n";
  940. # EXPECTED:
  941. # ok
  942. # GOT:
  943. # Can't locate unicore/PVA.pl in @INC (@INC contains: ../lib /usr/pkg/lib/perl5/site_perl/5.8.0/darwin-thread-multi-2level /usr/pkg/lib/perl5/site_perl/5.8.0 /usr/pkg/lib/perl5/site_perl /usr/pkg/lib/perl5/vendor_perl/5.8.0/darwin-thread-multi-2level /usr/pkg/lib/perl5/vendor_perl/5.8.0 /usr/pkg/lib/perl5/vendor_perl /usr/pkg/lib/perl5/5.8.0/darwin-thread-multi-2level /usr/pkg/lib/perl5/5.8.0 .) at ../lib/utf8_heavy.pl line 80.
  944. # STATUS: 512
  945. # Failed at run/fresh_perl.t line 55
  946. FAILED at test 76
  947. t/run/noswitch.......ok
  948. t/run/runenv.........ok
  949. t/run/switch0........ok
  950. t/run/switchC........ok
  951. t/run/switchF........ok
  952. t/run/switchF1.......ok
  953. t/run/switchI........ok
  954. t/run/switchPx.......ok
  955. t/run/switcha........ok
  956. t/run/switchd........ok
  957. t/run/switches.......ok
  958. t/run/switchn........ok
  959. t/run/switchp........ok
  960. t/run/switcht........ok
  961. t/run/switchx........ok
  962. t/io/argv............ok
  963. t/io/binmode.........ok
  964. t/io/crlf............ok
  965. t/io/crlf_through....ok
  966. t/io/dup.............ok
  967. t/io/fflush..........ok
  968. t/io/fs..............ok
  969. t/io/inplace.........ok
  970. t/io/iprefix.........ok
  971. t/io/layers..........ok
  972. t/io/nargv...........ok
  973. t/io/open............ok
  974. t/io/openpid.........ok
  975. t/io/pipe............ok
  976. t/io/print...........ok
  977. t/io/read............ok
  978. t/io/tell............ok
  979. t/io/through.........ok
  980. t/io/utf8............Can't locate unicore/PVA.pl in @INC (@INC contains: ../lib) at ../lib/utf8_heavy.pl line 80.
  981. # Looks like you planned 55 tests but ran 52.
  982. FAILED--expected 55 tests, saw 52
  983. t/op/64bitint........skipping test on this platform
  984. t/op/alarm...........ok
  985. t/op/anonsub.........ok
  986. t/op/append..........ok
  987. t/op/args............ok
  988. t/op/arith...........ok
  989. t/op/array...........ok
  990. t/op/assignwarn......ok
  991. t/op/attrs...........ok
  992. t/op/auto............ok
  993. t/op/avhv............ok
  994. t/op/bless...........ok
  995. t/op/bop.............ok
  996. t/op/caller..........ok
  997. t/op/chars...........ok
  998. t/op/chdir...........ok
  999. t/op/chop............ok
  1000. t/op/chr.............ok
  1001. t/op/closure.........ok
  1002. t/op/cmp.............ok
  1003. t/op/concat..........ok
  1004. t/op/cond............ok
  1005. t/op/context.........ok
  1006. t/op/cproto..........ok
  1007. t/op/crypt...........ok
  1008. t/op/defins..........Can't locate File/Glob.pm in @INC (@INC contains: ../lib) at op/defins.t line 96.
  1009. BEGIN failed--compilation aborted at op/defins.t line 96.
  1010. FAILED--expected 14 tests, saw 0
  1011. t/op/delete..........ok
  1012. t/op/die.............FAILED at test 14
  1013. t/op/die_exit........ok
  1014. t/op/do..............ok
  1015. t/op/each............ok
  1016. t/op/eval............ok
  1017. t/op/exec............ok
  1018. t/op/exists_sub......ok
  1019. t/op/exp.............ok
  1020. t/op/fh..............ok
  1021. t/op/filetest........ok
  1022. t/op/flip............ok
  1023. t/op/fork............ok
  1024. t/op/getpid..........skipping test on this platform
  1025. t/op/getppid.........ok
  1026. t/op/glob............Can't locate File/Glob.pm in @INC (@INC contains: ../lib) at op/glob.t line 10.
  1027. BEGIN failed--compilation aborted at op/glob.t line 10.
  1028. FAILED--no leader found
  1029. t/op/gmagic..........ok
  1030. t/op/goto............ok
  1031. t/op/goto_xs.........skipping test on this platform
  1032. t/op/grent...........ok
  1033. t/op/grep............ok
  1034. t/op/groups..........ok
  1035. t/op/gv..............ok
  1036. t/op/hash............ok
  1037. t/op/hashassign......ok
  1038. t/op/hashwarn........ok
  1039. t/op/inc.............ok
  1040. t/op/inccode.........ok
  1041. t/op/index...........ok
  1042. t/op/int.............ok
  1043. t/op/join............ok
  1044. t/op/lc..............Can't locate unicore/PVA.pl in @INC (@INC contains: ../lib) at ../lib/utf8_heavy.pl line 80.
  1045. FAILED--no leader found
  1046. t/op/lc_user.........Can't locate unicore/PVA.pl in @INC (@INC contains: ../lib) at ../lib/utf8_heavy.pl line 80.
  1047. FAILED--no leader found
  1048. t/op/length..........ok
  1049. t/op/lex_assign......Can't locate File/Glob.pm in @INC (@INC contains: ../lib) at (eval 5) line 4, <DATA> line 153.
  1050. BEGIN failed--compilation aborted at (eval 5) line 4, <DATA> line 153.
  1051. FAILED at test 15
  1052. t/op/lfs.............skipping test on this platform
  1053. t/op/list............ok
  1054. t/op/local...........ok
  1055. t/op/localref........ok
  1056. t/op/loopctl.........ok
  1057. t/op/lop.............ok
  1058. t/op/magic...........ok
  1059. t/op/method..........ok
  1060. t/op/mkdir...........ok
  1061. t/op/my..............ok
  1062. t/op/my_stash........ok
  1063. t/op/negate..........ok
  1064. t/op/not.............ok
  1065. t/op/nothr5005.......ok
  1066. t/op/numconvert......ok
  1067. t/op/oct.............ok
  1068. t/op/or..............ok
  1069. t/op/ord.............ok
  1070. t/op/override........ok
  1071. t/op/pack............ok
  1072. t/op/pat.............Use of uninitialized value in pattern match (m//) at ../lib/charnames.pm line 111.
  1073. Unknown charname 'CYRILLIC SMALL LETTER A' at unicore/Name.pl line 1391
  1074. Use of uninitialized value in pattern match (m//) at ../lib/charnames.pm line 111.
  1075. Unknown charname 'GREEK CAPITAL LETTER ALPHA' at unicore/Name.pl line 1393
  1076. Use of uninitialized value in pattern match (m//) at ../lib/charnames.pm line 111.
  1077. Unknown charname 'HIRAGANA LETTER SMALL A' at unicore/Name.pl line 1394
  1078. Use of uninitialized value in pattern match (m//) at ../lib/charnames.pm line 111.
  1079. Unknown charname 'COMBINING GRAVE ACCENT' at unicore/Name.pl line 1395
  1080. Use of uninitialized value in pattern match (m//) at ../lib/charnames.pm line 111.
  1081. Unknown charname 'ARABIC-INDIC DIGIT ZERO' at unicore/Name.pl line 1397
  1082. Use of uninitialized value in pattern match (m//) at ../lib/charnames.pm line 111.
  1083. Unknown charname 'LATIN CAPITAL LETTER A' at unicore/Name.pl line 1806
  1084. Use of uninitialized value in pattern match (m//) at ../lib/charnames.pm line 111.
  1085. Unknown charname 'LATIN CAPITAL LETTER A WITH GRAVE' at unicore/Name.pl line 1809
  1086. Use of uninitialized value in pattern match (m//) at ../lib/charnames.pm line 111.
  1087. Unknown charname 'LATIN CAPITAL LETTER A WITH MACRON' at unicore/Name.pl line 1812
  1088. Use of uninitialized value in pattern match (m//) at ../lib/charnames.pm line 111.
  1089. Unknown charname 'LATIN SMALL LETTER B WITH STROKE' at unicore/Name.pl line 1815
  1090. Use of uninitialized value in pattern match (m//) at ../lib/charnames.pm line 111.
  1091. Unknown charname 'KATAKANA LETTER SMALL A' at unicore/Name.pl line 1818
  1092. Can't locate unicore/PVA.pl in @INC (@INC contains: ../lib) at ../lib/utf8_heavy.pl line 80.
  1093. FAILED--no leader found
  1094. t/op/pos.............ok
  1095. t/op/pow.............ok
  1096. t/op/push............ok
  1097. t/op/pwent...........FAILED at test 1
  1098. t/op/qq..............ok
  1099. t/op/quotemeta.......ok
  1100. t/op/rand............ok
  1101. t/op/range...........ok
  1102. t/op/read............ok
  1103. t/op/readdir.........Can't locate File/Glob.pm in @INC (@INC contains: ../lib) at op/readdir.t line 35.
  1104. BEGIN failed--compilation aborted at op/readdir.t line 35.
  1105. FAILED--no leader found
  1106. t/op/readline........ok
  1107. t/op/recurse.........ok
  1108. t/op/ref.............ok
  1109. t/op/regexp..........ok
  1110. t/op/regexp_noamp....ok
  1111. t/op/regmesg.........FAILED at test 36
  1112. t/op/repeat..........ok
  1113. t/op/reverse.........ok
  1114. t/op/runlevel........ok
  1115. t/op/sleep...........ok
  1116. t/op/sort............ok
  1117. t/op/splice..........ok
  1118. t/op/split...........ok
  1119. t/op/sprintf.........ok
  1120. t/op/sprintf2........ok
  1121. t/op/srand...........ok
  1122. t/op/sselect.........ok
  1123. t/op/stash...........ok
  1124. t/op/stat............ok
  1125. t/op/study...........ok
  1126. t/op/sub.............ok
  1127. t/op/sub_lval........ok
  1128. t/op/subst...........ok
  1129. t/op/subst_amp.......ok
  1130. t/op/subst_wamp......ok
  1131. t/op/substr..........ok
  1132. t/op/sysio...........ok
  1133. t/op/taint...........Can't locate File/Glob.pm in @INC (@INC contains: ../lib) at op/taint.t line 321.
  1134. BEGIN failed--compilation aborted at op/taint.t line 321.
  1135. FAILED--no leader found
  1136. t/op/threads.........skipping test on this platform
  1137. t/op/tie.............ok
  1138. t/op/tiearray........ok
  1139. t/op/tiehandle.......ok
  1140. t/op/time............ok
  1141. t/op/tr..............ok
  1142. t/op/undef...........ok
  1143. t/op/universal.......ok
  1144. t/op/unshift.........ok
  1145. t/op/utf8decode......ok
  1146. t/op/utfhash.........Can't locate unicore/PVA.pl in @INC (@INC contains: ../lib) at ../lib/utf8_heavy.pl line 80.
  1147. # Looks like you planned 97 tests but ran 0.
  1148. FAILED--expected 97 tests, saw 0
  1149. t/op/utftaint........skipping test on this platform
  1150. t/op/vec.............ok
  1151. t/op/ver.............ok
  1152. t/op/wantarray.......ok
  1153. t/op/write...........ok
  1154. t/uni/chomp..........skipping test on this platform
  1155. t/uni/class..........Can't locate unicore/PVA.pl in @INC (@INC contains: ../lib .) at ../lib/utf8_heavy.pl line 80.
  1156. # Looks like you planned 4670 tests but ran 0.
  1157. FAILED--expected 4670 tests, saw 0
  1158. t/uni/fold...........Can't locate unicore/PVA.pl in @INC (@INC contains: ../lib) at ../lib/utf8_heavy.pl line 80.
  1159. FAILED--expected 981 tests, saw 0
  1160. t/uni/lower..........Can't locate unicore/PVA.pl in @INC (@INC contains: ../lib uni .) at ../lib/utf8_heavy.pl line 80.
  1161. FAILED--no leader found
  1162. t/uni/sprintf........ok
  1163. t/uni/title..........Can't locate unicore/PVA.pl in @INC (@INC contains: ../lib uni .) at ../lib/utf8_heavy.pl line 80.
  1164. FAILED--no leader found
  1165. t/uni/tr_7jis........skipping test on this platform
  1166. t/uni/tr_eucjp.......skipping test on this platform
  1167. t/uni/tr_sjis........skipping test on this platform
  1168. t/uni/tr_utf8........skipping test on this platform
  1169. t/uni/upper..........Can't locate unicore/PVA.pl in @INC (@INC contains: ../lib uni .) at ../lib/utf8_heavy.pl line 80.
  1170. FAILED--no leader found
  1171. t/uni/write..........ok
  1172. Failed 20 test scripts out of 194, 89.69% okay.
  1173. ### Since not all tests were successful, you may want to run some of
  1174. ### them individually and examine any diagnostic messages they produce.
  1175. ### See the INSTALL document's section on "make test".
  1176. ### You have a good chance to get more information by running
  1177. ### ./perl harness
  1178. ### in the 't' directory since most (>=80%) of the tests succeeded.
  1179. ### You may have to set your dynamic library search path,
  1180. ### DYLD_LIBRARY_PATH, to point to the build directory:
  1181. ### setenv DYLD_LIBRARY_PATH `pwd`:$DYLD_LIBRARY_PATH; cd t; ./perl harness
  1182. ### DYLD_LIBRARY_PATH=`pwd`:$DYLD_LIBRARY_PATH; export DYLD_LIBRARY_PATH; cd t; ./perl harness
  1183. ### export DYLD_LIBRARY_PATH=`pwd`:$DYLD_LIBRARY_PATH; cd t; ./perl harness
  1184. ### for csh-style shells, like tcsh; or for traditional/modern
  1185. ### Bourne-style shells, like bash, ksh, and zsh, respectively.
  1186. u=0.49 s=0.49 cu=10.51 cs=9.46 scripts=194 tests=42576
  1187. gnumake[1]: [minitest] Error 1 (ignored)
  1188. gnumake: [extra.pods] Error 1 (ignored)
  1189. AutoSplitting perl library
  1190. DYLD_LIBRARY_PATH=/usr/pkgsrc/lang/perl5/work/perl-5.8.8 ./miniperl -Ilib -e 'use AutoSplit; \
  1191. autosplit_lib_modules(@ARGV)' lib/*.pm
  1192. DYLD_LIBRARY_PATH=/usr/pkgsrc/lang/perl5/work/perl-5.8.8 ./miniperl -Ilib -e 'use AutoSplit; \
  1193. autosplit_lib_modules(@ARGV)' lib/*/*.pm
  1194. /usr/bin/gnumake lib/re.pm
  1195. gnumake[1]: `lib/re.pm' is up to date.
  1196. DYLD_LIBRARY_PATH=/usr/pkgsrc/lang/perl5/work/perl-5.8.8 ./miniperl minimod.pl > lib/ExtUtils/Miniperl.pm
  1197. cd lib/unicore && DYLD_LIBRARY_PATH=/usr/pkgsrc/lang/perl5/work/perl-5.8.8 ../../miniperl -I../../lib mktables -w
  1198. Can't locate File/Glob.pm in @INC (@INC contains: ../../lib /usr/pkg/lib/perl5/site_perl/5.8.0/darwin-thread-multi-2level /usr/pkg/lib/perl5/site_perl/5.8.0 /usr/pkg/lib/perl5/site_perl /usr/pkg/lib/perl5/vendor_perl/5.8.0/darwin-thread-multi-2level /usr/pkg/lib/perl5/vendor_perl/5.8.0 /usr/pkg/lib/perl5/vendor_perl /usr/pkg/lib/perl5/5.8.0/darwin-thread-multi-2level /usr/pkg/lib/perl5/5.8.0 .) at mktables line 2111.
  1199. BEGIN failed--compilation aborted at mktables line 2111.
  1200. gnumake: *** [uni.data] Error 2
  1201. *** Error code 2
  1202.  
  1203. Stop.
  1204. bmake: stopped in /usr/pkgsrc/lang/perl5
  1205. *** Error code 1
  1206.  
  1207. Stop.
  1208. bmake: stopped in /usr/pkgsrc/lang/perl5
  1209. sh-3.2#
  1210.  
Advertisement
Add Comment
Please, Sign In to add comment