Want more features on Pastebin? Sign Up, it's FREE!
Guest

Untitled

By: a guest on Apr 30th, 2013  |  syntax: None  |  size: 8.29 KB  |  views: 60  |  expires: Never
download  |  raw  |  embed  |  report abuse  |  print
Text below is selected. Please press Ctrl+C to copy to your clipboard. (⌘+C on Mac)
  1. ake[1]: Entering directory `/home/tiberious/builds/vegastrike/src/vegastrike-src-0.5.1.r1'
  2. depbase=`echo src/networking/lowlevel/netbuffer.o | sed 's|[^/]*$|.deps/&|;s|\.o$||'`; \
  3. if g++ -DHAVE_CONFIG_H -I. -I. -I.   -I/usr/include -DBOOST_PYTHON_NO_PY_SIGNATURES  -D_FORTIFY_SOURCE=2   -DHAVE_SDL=1 -DSDL_WINDOWING=1      -DHAVE_AL=1   -DHAVE_OGG  -DNV_CUBE_MAP=1 -DDATA_DIR=\"/usr/share/vegastrike\"  -I/usr/include/python2.7 -DHAVE_PYTHON=1    -I./src   -march=x86-64 -mtune=generic  -pipe -fstack-protector --param=ssp-buffer-size=4 -fpermissive -pipe -DNV_CUBE_MAP  -I/usr/include/SDL -D_GNU_SOURCE=1 -D_REENTRANT -pthread -MT src/networking/lowlevel/netbuffer.o -MD -MP -MF "$depbase.Tpo" -c -o src/networking/lowlevel/netbuffer.o src/networking/lowlevel/netbuffer.cpp; \
  4. then mv -f "$depbase.Tpo" "$depbase.Po"; else rm -f "$depbase.Tpo"; exit 1; fi
  5. In file included from /usr/include/assert.h:36:0,
  6.                  from src/networking/lowlevel/netbuffer.cpp:1:
  7. /usr/include/features.h:330:4: warning: #warning _FORTIFY_SOURCE requires compiling with optimization (-O) [-Wcpp]
  8.  #  warning _FORTIFY_SOURCE requires compiling with optimization (-O)
  9.     ^
  10. depbase=`echo src/networking/lowlevel/netui.o | sed 's|[^/]*$|.deps/&|;s|\.o$||'`; \
  11. if g++ -DHAVE_CONFIG_H -I. -I. -I.   -I/usr/include -DBOOST_PYTHON_NO_PY_SIGNATURES  -D_FORTIFY_SOURCE=2   -DHAVE_SDL=1 -DSDL_WINDOWING=1      -DHAVE_AL=1   -DHAVE_OGG  -DNV_CUBE_MAP=1 -DDATA_DIR=\"/usr/share/vegastrike\"  -I/usr/include/python2.7 -DHAVE_PYTHON=1    -I./src   -march=x86-64 -mtune=generic  -pipe -fstack-protector --param=ssp-buffer-size=4 -fpermissive -pipe -DNV_CUBE_MAP  -I/usr/include/SDL -D_GNU_SOURCE=1 -D_REENTRANT -pthread -MT src/networking/lowlevel/netui.o -MD -MP -MF "$depbase.Tpo" -c -o src/networking/lowlevel/netui.o src/networking/lowlevel/netui.cpp; \
  12. then mv -f "$depbase.Tpo" "$depbase.Po"; else rm -f "$depbase.Tpo"; exit 1; fi
  13. In file included from /usr/include/c++/4.8.0/x86_64-unknown-linux-gnu/bits/os_defines.h:39:0,
  14.                  from /usr/include/c++/4.8.0/x86_64-unknown-linux-gnu/bits/c++config.h:420,
  15.                  from /usr/include/c++/4.8.0/bits/stl_algobase.h:59,
  16.                  from /usr/include/c++/4.8.0/bits/stl_tree.h:61,
  17.                  from /usr/include/c++/4.8.0/map:60,
  18.                  from src/networking/lowlevel/netui.cpp:2:
  19. /usr/include/features.h:330:4: warning: #warning _FORTIFY_SOURCE requires compiling with optimization (-O) [-Wcpp]
  20.  #  warning _FORTIFY_SOURCE requires compiling with optimization (-O)
  21.     ^
  22. depbase=`echo src/networking/lowlevel/packet.o | sed 's|[^/]*$|.deps/&|;s|\.o$||'`; \
  23. if g++ -DHAVE_CONFIG_H -I. -I. -I.   -I/usr/include -DBOOST_PYTHON_NO_PY_SIGNATURES  -D_FORTIFY_SOURCE=2   -DHAVE_SDL=1 -DSDL_WINDOWING=1      -DHAVE_AL=1   -DHAVE_OGG  -DNV_CUBE_MAP=1 -DDATA_DIR=\"/usr/share/vegastrike\"  -I/usr/include/python2.7 -DHAVE_PYTHON=1    -I./src   -march=x86-64 -mtune=generic  -pipe -fstack-protector --param=ssp-buffer-size=4 -fpermissive -pipe -DNV_CUBE_MAP  -I/usr/include/SDL -D_GNU_SOURCE=1 -D_REENTRANT -pthread -MT src/networking/lowlevel/packet.o -MD -MP -MF "$depbase.Tpo" -c -o src/networking/lowlevel/packet.o src/networking/lowlevel/packet.cpp; \
  24. then mv -f "$depbase.Tpo" "$depbase.Po"; else rm -f "$depbase.Tpo"; exit 1; fi
  25. In file included from /usr/include/unistd.h:25:0,
  26.                  from src/networking/lowlevel/packet.cpp:4:
  27. /usr/include/features.h:330:4: warning: #warning _FORTIFY_SOURCE requires compiling with optimization (-O) [-Wcpp]
  28.  #  warning _FORTIFY_SOURCE requires compiling with optimization (-O)
  29.     ^
  30. depbase=`echo src/networking/lowlevel/packetmem.o | sed 's|[^/]*$|.deps/&|;s|\.o$||'`; \
  31. if g++ -DHAVE_CONFIG_H -I. -I. -I.   -I/usr/include -DBOOST_PYTHON_NO_PY_SIGNATURES  -D_FORTIFY_SOURCE=2   -DHAVE_SDL=1 -DSDL_WINDOWING=1      -DHAVE_AL=1   -DHAVE_OGG  -DNV_CUBE_MAP=1 -DDATA_DIR=\"/usr/share/vegastrike\"  -I/usr/include/python2.7 -DHAVE_PYTHON=1    -I./src   -march=x86-64 -mtune=generic  -pipe -fstack-protector --param=ssp-buffer-size=4 -fpermissive -pipe -DNV_CUBE_MAP  -I/usr/include/SDL -D_GNU_SOURCE=1 -D_REENTRANT -pthread -MT src/networking/lowlevel/packetmem.o -MD -MP -MF "$depbase.Tpo" -c -o src/networking/lowlevel/packetmem.o src/networking/lowlevel/packetmem.cpp; \
  32. then mv -f "$depbase.Tpo" "$depbase.Po"; else rm -f "$depbase.Tpo"; exit 1; fi
  33. In file included from /usr/include/assert.h:36:0,
  34.                  from src/networking/lowlevel/packetmem.cpp:2:
  35. /usr/include/features.h:330:4: warning: #warning _FORTIFY_SOURCE requires compiling with optimization (-O) [-Wcpp]
  36.  #  warning _FORTIFY_SOURCE requires compiling with optimization (-O)
  37.     ^
  38. src/networking/lowlevel/packetmem.cpp: In member function ‘void PacketMem::inner_set(void*, size_t, bool)’:
  39. src/networking/lowlevel/packetmem.cpp:105:26: error: no matching function for call to ‘boost::shared_array<char>::reset(int)’
  40.          _buffer.reset( 0 );
  41.                           ^
  42. src/networking/lowlevel/packetmem.cpp:105:26: note: candidates are:
  43. In file included from /usr/include/boost/shared_array.hpp:17:0,
  44.                  from src/networking/lowlevel/packetmem.h:10,
  45.                  from src/networking/lowlevel/packetmem.cpp:11:
  46. /usr/include/boost/smart_ptr/shared_array.hpp:166:10: note: void boost::shared_array<T>::reset() [with T = char]
  47.      void reset() BOOST_NOEXCEPT
  48.           ^
  49. /usr/include/boost/smart_ptr/shared_array.hpp:166:10: note:   candidate expects 0 arguments, 1 provided
  50. /usr/include/boost/smart_ptr/shared_array.hpp:171:28: note: template<class Y> void boost::shared_array<T>::reset(Y*) [with Y = Y; T = char]
  51.      template<class Y> void reset( Y * p ) // Y must be complete
  52.                             ^
  53. /usr/include/boost/smart_ptr/shared_array.hpp:171:28: note:   template argument deduction/substitution failed:
  54. src/networking/lowlevel/packetmem.cpp:105:26: note:   mismatched types ‘Y*’ and ‘int’
  55.          _buffer.reset( 0 );
  56.                           ^
  57. In file included from /usr/include/boost/shared_array.hpp:17:0,
  58.                  from src/networking/lowlevel/packetmem.h:10,
  59.                  from src/networking/lowlevel/packetmem.cpp:11:
  60. /usr/include/boost/smart_ptr/shared_array.hpp:177:37: note: template<class Y, class D> void boost::shared_array<T>::reset(Y*, D) [with Y = Y; D = D; T = char]
  61.      template<class Y, class D> void reset( Y * p, D d )
  62.                                      ^
  63. /usr/include/boost/smart_ptr/shared_array.hpp:177:37: note:   template argument deduction/substitution failed:
  64. src/networking/lowlevel/packetmem.cpp:105:26: note:   mismatched types ‘Y*’ and ‘int’
  65.          _buffer.reset( 0 );
  66.                           ^
  67. In file included from /usr/include/boost/shared_array.hpp:17:0,
  68.                  from src/networking/lowlevel/packetmem.h:10,
  69.                  from src/networking/lowlevel/packetmem.cpp:11:
  70. /usr/include/boost/smart_ptr/shared_array.hpp:182:46: note: template<class Y, class D, class A> void boost::shared_array<T>::reset(Y*, D, A) [with Y = Y; D = D; A = A; T = char]
  71.      template<class Y, class D, class A> void reset( Y * p, D d, A a )
  72.                                               ^
  73. /usr/include/boost/smart_ptr/shared_array.hpp:182:46: note:   template argument deduction/substitution failed:
  74. src/networking/lowlevel/packetmem.cpp:105:26: note:   mismatched types ‘Y*’ and ‘int’
  75.          _buffer.reset( 0 );
  76.                           ^
  77. In file included from /usr/include/boost/shared_array.hpp:17:0,
  78.                  from src/networking/lowlevel/packetmem.h:10,
  79.                  from src/networking/lowlevel/packetmem.cpp:11:
  80. /usr/include/boost/smart_ptr/shared_array.hpp:187:28: note: template<class Y> void boost::shared_array<T>::reset(const boost::shared_array<Y>&, boost::shared_array<T>::element_type*) [with Y = Y; T = char]
  81.      template<class Y> void reset( shared_array<Y> const & r, element_type * p )
  82.                             ^
  83. /usr/include/boost/smart_ptr/shared_array.hpp:187:28: note:   template argument deduction/substitution failed:
  84. src/networking/lowlevel/packetmem.cpp:105:26: note:   mismatched types ‘const boost::shared_array<T>’ and ‘int’
  85.          _buffer.reset( 0 );
  86.                           ^
  87. make[1]: *** [src/networking/lowlevel/packetmem.o] Error 1
  88. make[1]: Leaving directory `/home/tiberious/builds/vegastrike/src/vegastrike-src-0.5.1.r1'
  89. make: *** [all] Error 2
clone this paste RAW Paste Data