zombah

spdiff compile error

Sep 24th, 2012
197
0
Never
Not a member of Pastebin yet? Sign Up, it unlocks many cool features!
text 1.66 KB | None | 0 0
  1. ../../../../../../kernel/toshiba/paz00/sound/soc/tegra/tegra_alc5632.c: In function 'tegra_spdif_hw_params':
  2. ../../../../../../kernel/toshiba/paz00/sound/soc/tegra/tegra_alc5632.c:138:42: error: dereferencing pointer to incomplet
  3. e type
  4. ../../../../../../kernel/toshiba/paz00/sound/soc/tegra/tegra_alc5632.c:140:16: error: dereferencing pointer to incomplet
  5. e type
  6. ../../../../../../kernel/toshiba/paz00/sound/soc/tegra/tegra_alc5632.c:141:18: error: dereferencing pointer to incomplet
  7. e type
  8. ../../../../../../kernel/toshiba/paz00/sound/soc/tegra/tegra_alc5632.c:148:41: error: dereferencing pointer to incomplet
  9. e type../../../../../../kernel/toshiba/paz00/sound/soc/tegra/tegra_alc5632.c: At top level:../../../../../../kernel/toshiba/paz00/sound/soc/tegra/tegra_alc5632.c:301:3: error: expected ',' or ';' before '.' toke
  10. n
  11. ../../../../../../kernel/toshiba/paz00/sound/soc/tegra/tegra_alc5632.c:309:3: error: expected identifier or '(' before '
  12. ,' token../../../../../../kernel/toshiba/paz00/sound/soc/tegra/tegra_alc5632.c:318:3: error: expected identifier or '(' before ',' token
  13. ../../../../../../kernel/toshiba/paz00/sound/soc/tegra/tegra_alc5632.c:163:27: warning: 'tegra_alc5632_asoc_ops' defined
  14. but not used [-Wunused-variable]../../../../../../kernel/toshiba/paz00/sound/soc/tegra/tegra_alc5632.c:168:27: warning: 'tegra_spdif_ops' defined but not used [-Wunused-variable]
  15. ../../../../../../kernel/toshiba/paz00/sound/soc/tegra/tegra_alc5632.c:259:12: warning: 'tegra_alc5632_asoc_init' defined but not used [-Wunused-function]make[5]: *** [sound/soc/tegra/tegra_alc5632.o] Ошибка 1
  16. make[4]: *** [sound/soc/tegra] Ошибка 2make[3]: *** [sound/soc] Ошибка 2
Advertisement
Add Comment
Please, Sign In to add comment