Pastebin is 300% more awesome when you are logged in. Sign Up, it's FREE!
Guest

grub-customizer Build Error

By: Voidi on May 15th, 2013  |  syntax: None  |  size: 3.98 KB  |  hits: 45  |  expires: Never
download  |  raw  |  embed  |  report abuse  |  print
Text below is selected. Please press Ctrl+C to copy to your clipboard. (⌘+C on Mac)
  1. In file included from /usr/include/gtkmm-2.4/gtkmm/main.h:33:0,
  2.                  from /tmp/yaourt-tmp-tobias/aur-grub-customizer/src/grub-customizer-3.0.4/src/Controller/GLib/ThreadController.h:24,
  3.                  from /tmp/yaourt-tmp-tobias/aur-grub-customizer/src/grub-customizer-3.0.4/src/Controller/GLib/ThreadController.cpp:19:
  4. /usr/include/gdkmm-2.4/gdkmm/types.h:92:7: Fehler: »Value« ist kein Klassentemplate
  5.  class Value<Gdk::ByteOrder> : public Glib::Value_Enum<Gdk::ByteOrder>
  6.        ^
  7. /usr/include/gdkmm-2.4/gdkmm/types.h:92:54: Fehler: expected template-name before »<« token
  8.  class Value<Gdk::ByteOrder> : public Glib::Value_Enum<Gdk::ByteOrder>
  9.                                                       ^
  10. /usr/include/gdkmm-2.4/gdkmm/types.h:92:54: Fehler: expected »{« before »<« token
  11. /usr/include/gdkmm-2.4/gdkmm/types.h:92:54: Fehler: expected unqualified-id before »<« token
  12. /usr/include/gdkmm-2.4/gdkmm/types.h:174:7: Fehler: »Value« ist kein Klassentemplate
  13.  class Value<Gdk::ModifierType> : public Glib::Value_Flags<Gdk::ModifierType>
  14.        ^
  15. /usr/include/gdkmm-2.4/gdkmm/types.h:174:30: Fehler: »Glib::Value« ist kein Template-Typ
  16.  class Value<Gdk::ModifierType> : public Glib::Value_Flags<Gdk::ModifierType>
  17.                               ^
  18. /usr/include/gdkmm-2.4/gdkmm/types.h:174:58: Fehler: expected template-name before »<« token
  19.  class Value<Gdk::ModifierType> : public Glib::Value_Flags<Gdk::ModifierType>
  20.                                                           ^
  21. /usr/include/gdkmm-2.4/gdkmm/types.h:207:7: Fehler: »Value« ist kein Klassentemplate
  22.  class Value<Gdk::Status> : public Glib::Value_Enum<Gdk::Status>
  23.        ^
  24. /usr/include/gdkmm-2.4/gdkmm/types.h:207:24: Fehler: »Glib::Value« ist kein Template-Typ
  25.  class Value<Gdk::Status> : public Glib::Value_Enum<Gdk::Status>
  26.                         ^
  27. /usr/include/gdkmm-2.4/gdkmm/types.h:207:51: Fehler: expected template-name before »<« token
  28.  class Value<Gdk::Status> : public Glib::Value_Enum<Gdk::Status>
  29.                                                    ^
  30. /usr/include/gdkmm-2.4/gdkmm/types.h:274:7: Fehler: »Value« ist kein Klassentemplate
  31.  class Value<Gdk::InputCondition> : public Glib::Value_Flags<Gdk::InputCondition>
  32.        ^
  33. /usr/include/gdkmm-2.4/gdkmm/types.h:274:32: Fehler: »Glib::Value« ist kein Template-Typ
  34.  class Value<Gdk::InputCondition> : public Glib::Value_Flags<Gdk::InputCondition>
  35.                                 ^
  36. /usr/include/gdkmm-2.4/gdkmm/types.h:274:60: Fehler: expected template-name before »<« token
  37.  class Value<Gdk::InputCondition> : public Glib::Value_Flags<Gdk::InputCondition>
  38.                                                             ^
  39. /usr/include/gdkmm-2.4/gdkmm/types.h:357:9: Fehler: »ArrayHandle« in Namensbereich »Glib« bezeichnet keinen Typ
  40.  typedef Glib::ArrayHandle<std::string,AtomStringTraits> ArrayHandle_AtomString;
  41.          ^
  42. /usr/include/gdkmm-2.4/gdkmm/types.h:358:9: Fehler: »ListHandle« in Namensbereich »Glib« bezeichnet keinen Typ
  43.  typedef Glib::ListHandle<std::string,AtomStringTraits> ListHandle_AtomString;
  44.          ^
  45. In file included from /tmp/yaourt-tmp-tobias/aur-grub-customizer/src/grub-customizer-3.0.4/src/Controller/GLib/ThreadController.h:24:0,
  46.                  from /tmp/yaourt-tmp-tobias/aur-grub-customizer/src/grub-customizer-3.0.4/src/Controller/GLib/ThreadController.cpp:19:
  47. /usr/include/gtkmm-2.4/gtkmm/main.h:151:39: Fehler: »Glib::OptionContext« wurde nicht deklariert
  48.    Main(int& argc, char**& argv, Glib::OptionContext& option_context);
  49.                                        ^
  50. /usr/include/gtkmm-2.4/gtkmm/main.h:204:42: Fehler: »Glib::OptionContext« wurde nicht deklariert
  51.    static void add_gtk_option_group(Glib::OptionContext& option_context, bool open_default_display = true);
  52.                                           ^
  53. make[2]: *** [CMakeFiles/grub-customizer.dir/src/Controller/GLib/ThreadController.cpp.o] Fehler 1
  54. make[1]: *** [CMakeFiles/grub-customizer.dir/all] Fehler 2
  55. make: *** [all] Fehler 2