Guest User

Untitled

a guest
Sep 16th, 2013
156
0
Never
Not a member of Pastebin yet? Sign Up, it unlocks many cool features!
text 70.21 KB | None | 0 0
  1. This file contains any messages produced by compilers while
  2. running configure, to aid debugging if configure makes a mistake.
  3.  
  4. It was created by Bitcoin configure 0.8.99, which was
  5. generated by GNU Autoconf 2.69. Invocation command line was
  6.  
  7. $ ./configure --libdir=/opt/local/lib/ --disable-tests --disable-debug --without-qt
  8.  
  9. ## --------- ##
  10. ## Platform. ##
  11. ## --------- ##
  12.  
  13. hostname = Jonass-MacBook-Pro-4.local
  14. uname -m = x86_64
  15. uname -r = 12.4.0
  16. uname -s = Darwin
  17. uname -v = Darwin Kernel Version 12.4.0: Wed May 1 17:57:12 PDT 2013; root:xnu-2050.24.15~1/RELEASE_X86_64
  18.  
  19. /usr/bin/uname -p = i386
  20. /bin/uname -X = unknown
  21.  
  22. /bin/arch = unknown
  23. /usr/bin/arch -k = unknown
  24. /usr/convex/getsysinfo = unknown
  25. /usr/bin/hostinfo = Mach kernel version:
  26. Darwin Kernel Version 12.4.0: Wed May 1 17:57:12 PDT 2013; root:xnu-2050.24.15~1/RELEASE_X86_64
  27. Kernel configured for up to 8 processors.
  28. 4 processors are physically available.
  29. 8 processors are logically available.
  30. Processor type: i486 (Intel 80486)
  31. Processors active: 0 1 2 3 4 5 6 7
  32. Primary memory available: 4.00 gigabytes
  33. Default processor set: 123 tasks, 628 threads, 8 processors
  34. Load average: 1.05, Mach factor: 6.94
  35. /bin/machine = unknown
  36. /usr/bin/oslevel = unknown
  37. /bin/universe = unknown
  38.  
  39. PATH: /opt/local/bin
  40. PATH: /opt/local/sbin
  41. PATH: /usr/bin
  42. PATH: /bin
  43. PATH: /usr/sbin
  44. PATH: /sbin
  45. PATH: /usr/local/bin
  46. PATH: /opt/X11/bin
  47.  
  48.  
  49. ## ----------- ##
  50. ## Core tests. ##
  51. ## ----------- ##
  52.  
  53. configure:2582: checking build system type
  54. configure:2596: result: x86_64-apple-darwin12.4.0
  55. configure:2616: checking host system type
  56. configure:2629: result: x86_64-apple-darwin12.4.0
  57. configure:2767: checking for a BSD-compatible install
  58. configure:2835: result: /usr/bin/install -c
  59. configure:2846: checking whether build environment is sane
  60. configure:2901: result: yes
  61. configure:3052: checking for a thread-safe mkdir -p
  62. configure:3091: result: src/build-aux/install-sh -c -d
  63. configure:3098: checking for gawk
  64. configure:3128: result: no
  65. configure:3098: checking for mawk
  66. configure:3128: result: no
  67. configure:3098: checking for nawk
  68. configure:3128: result: no
  69. configure:3098: checking for awk
  70. configure:3114: found /usr/bin/awk
  71. configure:3125: result: awk
  72. configure:3136: checking whether make sets $(MAKE)
  73. configure:3158: result: yes
  74. configure:3187: checking whether make supports nested variables
  75. configure:3204: result: yes
  76. configure:3276: checking whether to enable maintainer-specific portions of Makefiles
  77. configure:3285: result: yes
  78. configure:3310: checking whether make supports nested variables
  79. configure:3327: result: yes
  80. configure:3380: checking if compiling with debugging symbols
  81. configure:3536: checking for g++
  82. configure:3552: found /usr/bin/g++
  83. configure:3563: result: g++
  84. configure:3590: checking for C++ compiler version
  85. configure:3599: g++ --version >&5
  86. Apple LLVM version 5.0 (clang-500.2.75) (based on LLVM 3.3svn)
  87. Target: x86_64-apple-darwin12.4.0
  88. Thread model: posix
  89. Configured with: --prefix=/Applications/Xcode.app/Contents/Developer/usr --with-gxx-include-dir=/usr/include/c++/4.2.1
  90. configure:3610: $? = 0
  91. configure:3599: g++ -v >&5
  92. Configured with: --prefix=/Applications/Xcode.app/Contents/Developer/usr --with-gxx-include-dir=/usr/include/c++/4.2.1
  93. Apple LLVM version 5.0 (clang-500.2.75) (based on LLVM 3.3svn)
  94. Target: x86_64-apple-darwin12.4.0
  95. Thread model: posix
  96. configure:3610: $? = 0
  97. configure:3599: g++ -V >&5
  98. clang: error: argument to '-V' is missing (expected 1 value)
  99. clang: error: no input files
  100. configure:3610: $? = 1
  101. configure:3599: g++ -qversion >&5
  102. clang: error: no input files
  103. configure:3610: $? = 1
  104. configure:3630: checking whether the C++ compiler works
  105. configure:3652: g++ conftest.cpp >&5
  106. configure:3656: $? = 0
  107. configure:3704: result: yes
  108. configure:3707: checking for C++ compiler default output file name
  109. configure:3709: result: a.out
  110. configure:3715: checking for suffix of executables
  111. configure:3722: g++ -o conftest conftest.cpp >&5
  112. configure:3726: $? = 0
  113. configure:3748: result:
  114. configure:3770: checking whether we are cross compiling
  115. configure:3778: g++ -o conftest conftest.cpp >&5
  116. configure:3782: $? = 0
  117. configure:3789: ./conftest
  118. configure:3793: $? = 0
  119. configure:3808: result: no
  120. configure:3813: checking for suffix of object files
  121. configure:3835: g++ -c conftest.cpp >&5
  122. configure:3839: $? = 0
  123. configure:3860: result: o
  124. configure:3864: checking whether we are using the GNU C++ compiler
  125. configure:3883: g++ -c conftest.cpp >&5
  126. configure:3883: $? = 0
  127. configure:3892: result: yes
  128. configure:3901: checking whether g++ accepts -g
  129. configure:3921: g++ -c -g conftest.cpp >&5
  130. configure:3921: $? = 0
  131. configure:3962: result: yes
  132. configure:3996: checking for style of include used by make
  133. configure:4024: result: GNU
  134. configure:4050: checking dependency style of g++
  135. configure:4161: result: gcc3
  136. configure:4224: checking for gcc
  137. configure:4240: found /usr/bin/gcc
  138. configure:4251: result: gcc
  139. configure:4480: checking for C compiler version
  140. configure:4489: gcc --version >&5
  141. Apple LLVM version 5.0 (clang-500.2.75) (based on LLVM 3.3svn)
  142. Target: x86_64-apple-darwin12.4.0
  143. Thread model: posix
  144. Configured with: --prefix=/Applications/Xcode.app/Contents/Developer/usr --with-gxx-include-dir=/usr/include/c++/4.2.1
  145. configure:4500: $? = 0
  146. configure:4489: gcc -v >&5
  147. Configured with: --prefix=/Applications/Xcode.app/Contents/Developer/usr --with-gxx-include-dir=/usr/include/c++/4.2.1
  148. Apple LLVM version 5.0 (clang-500.2.75) (based on LLVM 3.3svn)
  149. Target: x86_64-apple-darwin12.4.0
  150. Thread model: posix
  151. configure:4500: $? = 0
  152. configure:4489: gcc -V >&5
  153. clang: error: argument to '-V' is missing (expected 1 value)
  154. clang: error: no input files
  155. configure:4500: $? = 1
  156. configure:4489: gcc -qversion >&5
  157. clang: error: no input files
  158. configure:4500: $? = 1
  159. configure:4504: checking whether we are using the GNU C compiler
  160. configure:4523: gcc -c conftest.c >&5
  161. configure:4523: $? = 0
  162. configure:4532: result: yes
  163. configure:4541: checking whether gcc accepts -g
  164. configure:4561: gcc -c -g conftest.c >&5
  165. configure:4561: $? = 0
  166. configure:4602: result: yes
  167. configure:4619: checking for gcc option to accept ISO C89
  168. configure:4682: gcc -c conftest.c >&5
  169. configure:4682: $? = 0
  170. configure:4695: result: none needed
  171. configure:4717: checking dependency style of gcc
  172. configure:4828: result: gcc3
  173. configure:4848: checking how to run the C preprocessor
  174. configure:4879: gcc -E conftest.c
  175. configure:4879: $? = 0
  176. configure:4893: gcc -E conftest.c
  177. conftest.c:9:10: fatal error: 'ac_nonexistent.h' file not found
  178. #include <ac_nonexistent.h>
  179. ^
  180. 1 error generated.
  181. configure:4893: $? = 1
  182. configure: failed program was:
  183. | /* confdefs.h */
  184. | #define PACKAGE_NAME "Bitcoin"
  185. | #define PACKAGE_TARNAME "bitcoin"
  186. | #define PACKAGE_VERSION "0.8.99"
  187. | #define PACKAGE_STRING "Bitcoin 0.8.99"
  188. | #define PACKAGE_BUGREPORT "[email protected]"
  189. | #define PACKAGE_URL ""
  190. | /* end confdefs.h. */
  191. | #include <ac_nonexistent.h>
  192. configure:4918: result: gcc -E
  193. configure:4938: gcc -E conftest.c
  194. configure:4938: $? = 0
  195. configure:4952: gcc -E conftest.c
  196. conftest.c:9:10: fatal error: 'ac_nonexistent.h' file not found
  197. #include <ac_nonexistent.h>
  198. ^
  199. 1 error generated.
  200. configure:4952: $? = 1
  201. configure: failed program was:
  202. | /* confdefs.h */
  203. | #define PACKAGE_NAME "Bitcoin"
  204. | #define PACKAGE_TARNAME "bitcoin"
  205. | #define PACKAGE_VERSION "0.8.99"
  206. | #define PACKAGE_STRING "Bitcoin 0.8.99"
  207. | #define PACKAGE_BUGREPORT "[email protected]"
  208. | #define PACKAGE_URL ""
  209. | /* end confdefs.h. */
  210. | #include <ac_nonexistent.h>
  211. configure:4985: checking how to run the C++ preprocessor
  212. configure:5012: g++ -E conftest.cpp
  213. configure:5012: $? = 0
  214. configure:5026: g++ -E conftest.cpp
  215. conftest.cpp:9:10: fatal error: 'ac_nonexistent.h' file not found
  216. #include <ac_nonexistent.h>
  217. ^
  218. 1 error generated.
  219. configure:5026: $? = 1
  220. configure: failed program was:
  221. | /* confdefs.h */
  222. | #define PACKAGE_NAME "Bitcoin"
  223. | #define PACKAGE_TARNAME "bitcoin"
  224. | #define PACKAGE_VERSION "0.8.99"
  225. | #define PACKAGE_STRING "Bitcoin 0.8.99"
  226. | #define PACKAGE_BUGREPORT "[email protected]"
  227. | #define PACKAGE_URL ""
  228. | /* end confdefs.h. */
  229. | #include <ac_nonexistent.h>
  230. configure:5051: result: g++ -E
  231. configure:5071: g++ -E conftest.cpp
  232. configure:5071: $? = 0
  233. configure:5085: g++ -E conftest.cpp
  234. conftest.cpp:9:10: fatal error: 'ac_nonexistent.h' file not found
  235. #include <ac_nonexistent.h>
  236. ^
  237. 1 error generated.
  238. configure:5085: $? = 1
  239. configure: failed program was:
  240. | /* confdefs.h */
  241. | #define PACKAGE_NAME "Bitcoin"
  242. | #define PACKAGE_TARNAME "bitcoin"
  243. | #define PACKAGE_VERSION "0.8.99"
  244. | #define PACKAGE_STRING "Bitcoin 0.8.99"
  245. | #define PACKAGE_BUGREPORT "[email protected]"
  246. | #define PACKAGE_URL ""
  247. | /* end confdefs.h. */
  248. | #include <ac_nonexistent.h>
  249. configure:5168: checking for gcc
  250. configure:5184: found /usr/bin/gcc
  251. configure:5195: result: gcc
  252. configure:5220: checking for Objective C compiler version
  253. configure:5229: gcc --version >&5
  254. Apple LLVM version 5.0 (clang-500.2.75) (based on LLVM 3.3svn)
  255. Target: x86_64-apple-darwin12.4.0
  256. Thread model: posix
  257. Configured with: --prefix=/Applications/Xcode.app/Contents/Developer/usr --with-gxx-include-dir=/usr/include/c++/4.2.1
  258. configure:5240: $? = 0
  259. configure:5229: gcc -v >&5
  260. Configured with: --prefix=/Applications/Xcode.app/Contents/Developer/usr --with-gxx-include-dir=/usr/include/c++/4.2.1
  261. Apple LLVM version 5.0 (clang-500.2.75) (based on LLVM 3.3svn)
  262. Target: x86_64-apple-darwin12.4.0
  263. Thread model: posix
  264. configure:5240: $? = 0
  265. configure:5229: gcc -V >&5
  266. clang: error: argument to '-V' is missing (expected 1 value)
  267. clang: error: no input files
  268. configure:5240: $? = 1
  269. configure:5229: gcc -qversion >&5
  270. clang: error: no input files
  271. configure:5240: $? = 1
  272. configure:5244: checking whether we are using the GNU Objective C compiler
  273. configure:5263: gcc -c conftest.m >&5
  274. configure:5263: $? = 0
  275. configure:5272: result: yes
  276. configure:5281: checking whether gcc accepts -g
  277. configure:5301: gcc -c -g conftest.m >&5
  278. configure:5301: $? = 0
  279. configure:5342: result: yes
  280. configure:5367: checking dependency style of gcc
  281. configure:5476: result: gcc3
  282. configure:5545: checking for g++
  283. configure:5561: found /usr/bin/g++
  284. configure:5572: result: g++
  285. configure:5597: checking for Objective C++ compiler version
  286. configure:5606: g++ --version >&5
  287. Apple LLVM version 5.0 (clang-500.2.75) (based on LLVM 3.3svn)
  288. Target: x86_64-apple-darwin12.4.0
  289. Thread model: posix
  290. Configured with: --prefix=/Applications/Xcode.app/Contents/Developer/usr --with-gxx-include-dir=/usr/include/c++/4.2.1
  291. configure:5617: $? = 0
  292. configure:5606: g++ -v >&5
  293. Configured with: --prefix=/Applications/Xcode.app/Contents/Developer/usr --with-gxx-include-dir=/usr/include/c++/4.2.1
  294. Apple LLVM version 5.0 (clang-500.2.75) (based on LLVM 3.3svn)
  295. Target: x86_64-apple-darwin12.4.0
  296. Thread model: posix
  297. configure:5617: $? = 0
  298. configure:5606: g++ -V >&5
  299. clang: error: argument to '-V' is missing (expected 1 value)
  300. clang: error: no input files
  301. configure:5617: $? = 1
  302. configure:5606: g++ -qversion >&5
  303. clang: error: no input files
  304. configure:5617: $? = 1
  305. configure:5621: checking whether we are using the GNU Objective C++ compiler
  306. configure:5640: g++ -c conftest.mm >&5
  307. configure:5640: $? = 0
  308. configure:5649: result: yes
  309. configure:5658: checking whether g++ accepts -g
  310. configure:5678: g++ -c -g conftest.mm >&5
  311. configure:5678: $? = 0
  312. configure:5719: result: yes
  313. configure:5744: checking dependency style of g++
  314. configure:5853: result: gcc3
  315. configure:5869: checking for a sed that does not truncate output
  316. configure:5933: result: /usr/bin/sed
  317. configure:5984: checking for ar
  318. configure:6002: found /opt/local/bin/ar
  319. configure:6014: result: /opt/local/bin/ar
  320. configure:6082: checking for ranlib
  321. configure:6100: found /opt/local/bin/ranlib
  322. configure:6112: result: /opt/local/bin/ranlib
  323. configure:6180: checking for windres
  324. configure:6213: result: no
  325. configure:6278: checking for strip
  326. configure:6296: found /opt/local/bin/strip
  327. configure:6308: result: /opt/local/bin/strip
  328. configure:6376: checking for gcov
  329. configure:6394: found /usr/bin/gcov
  330. configure:6406: result: /usr/bin/gcov
  331. configure:6430: checking for lcov
  332. configure:6463: result: no
  333. configure:6470: checking for java
  334. configure:6488: found /usr/bin/java
  335. configure:6500: result: /usr/bin/java
  336. configure:6510: checking for genhtml
  337. configure:6543: result: no
  338. configure:6550: checking for git
  339. configure:6568: found /usr/bin/git
  340. configure:6580: result: /usr/bin/git
  341. configure:6592: checking for moc-qt4
  342. configure:6626: result: no
  343. configure:6592: checking for moc4
  344. configure:6626: result: no
  345. configure:6592: checking for moc
  346. configure:6611: found /opt/local/bin/moc
  347. configure:6623: result: /opt/local/bin/moc
  348. configure:6638: checking for uic-qt4
  349. configure:6672: result: no
  350. configure:6638: checking for uic4
  351. configure:6672: result: no
  352. configure:6638: checking for uic
  353. configure:6657: found /opt/local/bin/uic
  354. configure:6669: result: /opt/local/bin/uic
  355. configure:6684: checking for rcc-qt4
  356. configure:6718: result: no
  357. configure:6684: checking for rcc4
  358. configure:6718: result: no
  359. configure:6684: checking for rcc
  360. configure:6703: found /opt/local/bin/rcc
  361. configure:6715: result: /opt/local/bin/rcc
  362. configure:6730: checking for lrelease-qt4
  363. configure:6764: result: no
  364. configure:6730: checking for lrelease4
  365. configure:6764: result: no
  366. configure:6730: checking for lrelease
  367. configure:6749: found /opt/local/bin/lrelease
  368. configure:6761: result: /opt/local/bin/lrelease
  369. configure:6776: checking for lupdate-qt4
  370. configure:6810: result: no
  371. configure:6776: checking for lupdate4
  372. configure:6810: result: no
  373. configure:6776: checking for lupdate
  374. configure:6795: found /opt/local/bin/lupdate
  375. configure:6807: result: /opt/local/bin/lupdate
  376. configure:6820: checking for protoc
  377. configure:6839: found /opt/local/bin/protoc
  378. configure:6851: result: /opt/local/bin/protoc
  379. configure:6861: checking for ccache
  380. configure:6894: result: no
  381. configure:6901: checking for xgettext
  382. configure:6919: found /opt/local/bin/xgettext
  383. configure:6931: result: /opt/local/bin/xgettext
  384. configure:6993: checking for pkg-config
  385. configure:7011: found /opt/local/bin/pkg-config
  386. configure:7023: result: /opt/local/bin/pkg-config
  387. configure:7048: checking pkg-config is at least version 0.9.0
  388. configure:7051: result: yes
  389. configure:7879: checking for port
  390. configure:7895: found /opt/local/bin/port
  391. configure:7906: result: port
  392. configure:7921: checking for brew
  393. configure:7951: result: no
  394. configure:8008: checking whether C++ compiler accepts -mmacosx-version-min=10.5
  395. configure:8027: g++ -c -Wall -Wextra -Wformat -Wformat-security -Wno-unused-parameter -mmacosx-version-min=10.5 -DBOOST_SPIRIT_THREADSAFE -DHAVE_BUILD_INFO -I/opt/local/include -I/opt/local/include/db48 conftest.cpp >&5
  396. configure:8027: $? = 0
  397. configure:8035: result: yes
  398. configure:8043: checking whether C++ compiler accepts -arch i386
  399. configure:8062: g++ -c -Wall -Wextra -Wformat -Wformat-security -Wno-unused-parameter -arch i386 -DBOOST_SPIRIT_THREADSAFE -DHAVE_BUILD_INFO -I/opt/local/include -I/opt/local/include/db48 conftest.cpp >&5
  400. configure:8062: $? = 0
  401. configure:8070: result: yes
  402. configure:8153: checking for grep that handles long lines and -e
  403. configure:8211: result: /usr/bin/grep
  404. configure:8216: checking for egrep
  405. configure:8278: result: /usr/bin/grep -E
  406. configure:8283: checking for ANSI C header files
  407. configure:8303: g++ -c -O2 -mmacosx-version-min=10.5 -arch i386 -O3 -Wall -Wextra -Wformat -Wformat-security -Wno-unused-parameter -DBOOST_SPIRIT_THREADSAFE -DHAVE_BUILD_INFO -I/opt/local/include -I/opt/local/include/db48 -DMAC_OSX conftest.cpp >&5
  408. configure:8303: $? = 0
  409. configure:8376: g++ -o conftest -O2 -mmacosx-version-min=10.5 -arch i386 -O3 -Wall -Wextra -Wformat -Wformat-security -Wno-unused-parameter -DBOOST_SPIRIT_THREADSAFE -DHAVE_BUILD_INFO -I/opt/local/include -I/opt/local/include/db48 -DMAC_OSX conftest.cpp -L/opt/local/lib -L/opt/local/lib/db48 >&5
  410. configure:8376: $? = 0
  411. configure:8376: ./conftest
  412. configure:8376: $? = 0
  413. configure:8387: result: yes
  414. configure:8400: checking for sys/types.h
  415. configure:8400: g++ -c -O2 -mmacosx-version-min=10.5 -arch i386 -O3 -Wall -Wextra -Wformat -Wformat-security -Wno-unused-parameter -DBOOST_SPIRIT_THREADSAFE -DHAVE_BUILD_INFO -I/opt/local/include -I/opt/local/include/db48 -DMAC_OSX conftest.cpp >&5
  416. configure:8400: $? = 0
  417. configure:8400: result: yes
  418. configure:8400: checking for sys/stat.h
  419. configure:8400: g++ -c -O2 -mmacosx-version-min=10.5 -arch i386 -O3 -Wall -Wextra -Wformat -Wformat-security -Wno-unused-parameter -DBOOST_SPIRIT_THREADSAFE -DHAVE_BUILD_INFO -I/opt/local/include -I/opt/local/include/db48 -DMAC_OSX conftest.cpp >&5
  420. configure:8400: $? = 0
  421. configure:8400: result: yes
  422. configure:8400: checking for stdlib.h
  423. configure:8400: g++ -c -O2 -mmacosx-version-min=10.5 -arch i386 -O3 -Wall -Wextra -Wformat -Wformat-security -Wno-unused-parameter -DBOOST_SPIRIT_THREADSAFE -DHAVE_BUILD_INFO -I/opt/local/include -I/opt/local/include/db48 -DMAC_OSX conftest.cpp >&5
  424. configure:8400: $? = 0
  425. configure:8400: result: yes
  426. configure:8400: checking for string.h
  427. configure:8400: g++ -c -O2 -mmacosx-version-min=10.5 -arch i386 -O3 -Wall -Wextra -Wformat -Wformat-security -Wno-unused-parameter -DBOOST_SPIRIT_THREADSAFE -DHAVE_BUILD_INFO -I/opt/local/include -I/opt/local/include/db48 -DMAC_OSX conftest.cpp >&5
  428. configure:8400: $? = 0
  429. configure:8400: result: yes
  430. configure:8400: checking for memory.h
  431. configure:8400: g++ -c -O2 -mmacosx-version-min=10.5 -arch i386 -O3 -Wall -Wextra -Wformat -Wformat-security -Wno-unused-parameter -DBOOST_SPIRIT_THREADSAFE -DHAVE_BUILD_INFO -I/opt/local/include -I/opt/local/include/db48 -DMAC_OSX conftest.cpp >&5
  432. configure:8400: $? = 0
  433. configure:8400: result: yes
  434. configure:8400: checking for strings.h
  435. configure:8400: g++ -c -O2 -mmacosx-version-min=10.5 -arch i386 -O3 -Wall -Wextra -Wformat -Wformat-security -Wno-unused-parameter -DBOOST_SPIRIT_THREADSAFE -DHAVE_BUILD_INFO -I/opt/local/include -I/opt/local/include/db48 -DMAC_OSX conftest.cpp >&5
  436. configure:8400: $? = 0
  437. configure:8400: result: yes
  438. configure:8400: checking for inttypes.h
  439. configure:8400: g++ -c -O2 -mmacosx-version-min=10.5 -arch i386 -O3 -Wall -Wextra -Wformat -Wformat-security -Wno-unused-parameter -DBOOST_SPIRIT_THREADSAFE -DHAVE_BUILD_INFO -I/opt/local/include -I/opt/local/include/db48 -DMAC_OSX conftest.cpp >&5
  440. configure:8400: $? = 0
  441. configure:8400: result: yes
  442. configure:8400: checking for stdint.h
  443. configure:8400: g++ -c -O2 -mmacosx-version-min=10.5 -arch i386 -O3 -Wall -Wextra -Wformat -Wformat-security -Wno-unused-parameter -DBOOST_SPIRIT_THREADSAFE -DHAVE_BUILD_INFO -I/opt/local/include -I/opt/local/include/db48 -DMAC_OSX conftest.cpp >&5
  444. configure:8400: $? = 0
  445. configure:8400: result: yes
  446. configure:8400: checking for unistd.h
  447. configure:8400: g++ -c -O2 -mmacosx-version-min=10.5 -arch i386 -O3 -Wall -Wextra -Wformat -Wformat-security -Wno-unused-parameter -DBOOST_SPIRIT_THREADSAFE -DHAVE_BUILD_INFO -I/opt/local/include -I/opt/local/include/db48 -DMAC_OSX conftest.cpp >&5
  448. configure:8400: $? = 0
  449. configure:8400: result: yes
  450. configure:8412: checking whether byte ordering is bigendian
  451. configure:8427: g++ -c -O2 -mmacosx-version-min=10.5 -arch i386 -O3 -Wall -Wextra -Wformat -Wformat-security -Wno-unused-parameter -DBOOST_SPIRIT_THREADSAFE -DHAVE_BUILD_INFO -I/opt/local/include -I/opt/local/include/db48 -DMAC_OSX conftest.cpp >&5
  452. configure:8427: $? = 0
  453. configure:8472: g++ -c -O2 -mmacosx-version-min=10.5 -arch i386 -O3 -Wall -Wextra -Wformat -Wformat-security -Wno-unused-parameter -DBOOST_SPIRIT_THREADSAFE -DHAVE_BUILD_INFO -I/opt/local/include -I/opt/local/include/db48 -DMAC_OSX conftest.cpp >&5
  454. configure:8472: $? = 0
  455. configure:8490: g++ -c -O2 -mmacosx-version-min=10.5 -arch i386 -O3 -Wall -Wextra -Wformat -Wformat-security -Wno-unused-parameter -DBOOST_SPIRIT_THREADSAFE -DHAVE_BUILD_INFO -I/opt/local/include -I/opt/local/include/db48 -DMAC_OSX conftest.cpp >&5
  456. conftest.cpp:26:8: error: use of undeclared identifier 'big'
  457. not big endian
  458. ^
  459. 1 error generated.
  460. configure:8490: $? = 1
  461. configure: failed program was:
  462. | /* confdefs.h */
  463. | #define PACKAGE_NAME "Bitcoin"
  464. | #define PACKAGE_TARNAME "bitcoin"
  465. | #define PACKAGE_VERSION "0.8.99"
  466. | #define PACKAGE_STRING "Bitcoin 0.8.99"
  467. | #define PACKAGE_BUGREPORT "[email protected]"
  468. | #define PACKAGE_URL ""
  469. | #define STDC_HEADERS 1
  470. | #define HAVE_SYS_TYPES_H 1
  471. | #define HAVE_SYS_STAT_H 1
  472. | #define HAVE_STDLIB_H 1
  473. | #define HAVE_STRING_H 1
  474. | #define HAVE_MEMORY_H 1
  475. | #define HAVE_STRINGS_H 1
  476. | #define HAVE_INTTYPES_H 1
  477. | #define HAVE_STDINT_H 1
  478. | #define HAVE_UNISTD_H 1
  479. | /* end confdefs.h. */
  480. | #include <sys/types.h>
  481. | #include <sys/param.h>
  482. |
  483. | int
  484. | main ()
  485. | {
  486. | #if BYTE_ORDER != BIG_ENDIAN
  487. | not big endian
  488. | #endif
  489. |
  490. | ;
  491. | return 0;
  492. | }
  493. configure:8618: result: no
  494. configure:8755: checking whether pthreads work with -pthread
  495. configure:8843: gcc -o conftest -pthread -DBOOST_SPIRIT_THREADSAFE -DHAVE_BUILD_INFO -I/opt/local/include -I/opt/local/include/db48 -DMAC_OSX conftest.c -L/opt/local/lib -L/opt/local/lib/db48 >&5
  496. configure:8843: $? = 0
  497. configure:8852: result: yes
  498. configure:8871: checking for joinable pthread attribute
  499. configure:8886: gcc -o conftest -pthread -DBOOST_SPIRIT_THREADSAFE -DHAVE_BUILD_INFO -I/opt/local/include -I/opt/local/include/db48 -DMAC_OSX conftest.c -L/opt/local/lib -L/opt/local/lib/db48 >&5
  500. configure:8886: $? = 0
  501. configure:8892: result: PTHREAD_CREATE_JOINABLE
  502. configure:8902: checking if more special flags are required for pthreads
  503. configure:8916: result: -D_THREAD_SAFE
  504. configure:8922: checking for PTHREAD_PRIO_INHERIT
  505. configure:8940: gcc -o conftest -pthread -DBOOST_SPIRIT_THREADSAFE -DHAVE_BUILD_INFO -I/opt/local/include -I/opt/local/include/db48 -DMAC_OSX conftest.c -L/opt/local/lib -L/opt/local/lib/db48 >&5
  506. configure:8940: $? = 0
  507. configure:8949: result: yes
  508. configure:9060: checking for special C compiler options needed for large files
  509. configure:9105: result: no
  510. configure:9111: checking for _FILE_OFFSET_BITS value needed for large files
  511. configure:9136: g++ -c -O2 -mmacosx-version-min=10.5 -arch i386 -O3 -Wall -Wextra -Wformat -Wformat-security -Wno-unused-parameter -DBOOST_SPIRIT_THREADSAFE -DHAVE_BUILD_INFO -I/opt/local/include -I/opt/local/include/db48 -DMAC_OSX conftest.cpp >&5
  512. configure:9136: $? = 0
  513. configure:9168: result: no
  514. configure:9266: checking whether the linker accepts -Wl,--large-address-aware
  515. configure:9285: g++ -o conftest -O2 -mmacosx-version-min=10.5 -arch i386 -O3 -Wall -Wextra -Wformat -Wformat-security -Wno-unused-parameter -DBOOST_SPIRIT_THREADSAFE -DHAVE_BUILD_INFO -I/opt/local/include -I/opt/local/include/db48 -DMAC_OSX -Wl,--large-address-aware conftest.cpp -L/opt/local/lib -L/opt/local/lib/db48 >&5
  516. ld: unknown option: --large-address-aware
  517. clang: error: linker command failed with exit code 1 (use -v to see invocation)
  518. configure:9285: $? = 1
  519. configure: failed program was:
  520. | /* confdefs.h */
  521. | #define PACKAGE_NAME "Bitcoin"
  522. | #define PACKAGE_TARNAME "bitcoin"
  523. | #define PACKAGE_VERSION "0.8.99"
  524. | #define PACKAGE_STRING "Bitcoin 0.8.99"
  525. | #define PACKAGE_BUGREPORT "[email protected]"
  526. | #define PACKAGE_URL ""
  527. | #define STDC_HEADERS 1
  528. | #define HAVE_SYS_TYPES_H 1
  529. | #define HAVE_SYS_STAT_H 1
  530. | #define HAVE_STDLIB_H 1
  531. | #define HAVE_STRING_H 1
  532. | #define HAVE_MEMORY_H 1
  533. | #define HAVE_STRINGS_H 1
  534. | #define HAVE_INTTYPES_H 1
  535. | #define HAVE_STDINT_H 1
  536. | #define HAVE_UNISTD_H 1
  537. | #define HAVE_PTHREAD_PRIO_INHERIT 1
  538. | #define HAVE_PTHREAD 1
  539. | /* end confdefs.h. */
  540. |
  541. | int
  542. | main ()
  543. | {
  544. |
  545. | ;
  546. | return 0;
  547. | }
  548. configure:9294: result: no
  549. configure:9304: checking whether C++ compiler accepts -Wstack-protector
  550. configure:9323: g++ -c -O2 -mmacosx-version-min=10.5 -arch i386 -O3 -Wall -Wextra -Wformat -Wformat-security -Wno-unused-parameter -Wstack-protector -DBOOST_SPIRIT_THREADSAFE -DHAVE_BUILD_INFO -I/opt/local/include -I/opt/local/include/db48 -DMAC_OSX conftest.cpp >&5
  551. configure:9323: $? = 0
  552. configure:9331: result: yes
  553. configure:9339: checking whether C++ compiler accepts -fPIE
  554. configure:9358: g++ -c -O2 -mmacosx-version-min=10.5 -arch i386 -O3 -Wall -Wextra -Wformat -Wformat-security -Wno-unused-parameter -fPIE -DBOOST_SPIRIT_THREADSAFE -DHAVE_BUILD_INFO -I/opt/local/include -I/opt/local/include/db48 -DMAC_OSX conftest.cpp >&5
  555. configure:9358: $? = 0
  556. configure:9366: result: yes
  557. configure:9375: checking whether C++ preprocessor accepts -D_FORTIFY_SOURCE=2
  558. configure:9394: g++ -E -DBOOST_SPIRIT_THREADSAFE -DHAVE_BUILD_INFO -I/opt/local/include -I/opt/local/include/db48 -DMAC_OSX -D_FORTIFY_SOURCE=2 conftest.cpp
  559. configure:9394: $? = 0
  560. configure:9402: result: yes
  561. configure:9411: checking whether the linker accepts -Wl,--dynamicbase
  562. configure:9430: g++ -o conftest -O2 -mmacosx-version-min=10.5 -arch i386 -O3 -Wall -Wextra -Wformat -Wformat-security -Wno-unused-parameter -DBOOST_SPIRIT_THREADSAFE -DHAVE_BUILD_INFO -I/opt/local/include -I/opt/local/include/db48 -DMAC_OSX -Wl,--dynamicbase conftest.cpp -L/opt/local/lib -L/opt/local/lib/db48 >&5
  563. ld: unknown option: --dynamicbase
  564. clang: error: linker command failed with exit code 1 (use -v to see invocation)
  565. configure:9430: $? = 1
  566. configure: failed program was:
  567. | /* confdefs.h */
  568. | #define PACKAGE_NAME "Bitcoin"
  569. | #define PACKAGE_TARNAME "bitcoin"
  570. | #define PACKAGE_VERSION "0.8.99"
  571. | #define PACKAGE_STRING "Bitcoin 0.8.99"
  572. | #define PACKAGE_BUGREPORT "[email protected]"
  573. | #define PACKAGE_URL ""
  574. | #define STDC_HEADERS 1
  575. | #define HAVE_SYS_TYPES_H 1
  576. | #define HAVE_SYS_STAT_H 1
  577. | #define HAVE_STDLIB_H 1
  578. | #define HAVE_STRING_H 1
  579. | #define HAVE_MEMORY_H 1
  580. | #define HAVE_STRINGS_H 1
  581. | #define HAVE_INTTYPES_H 1
  582. | #define HAVE_STDINT_H 1
  583. | #define HAVE_UNISTD_H 1
  584. | #define HAVE_PTHREAD_PRIO_INHERIT 1
  585. | #define HAVE_PTHREAD 1
  586. | /* end confdefs.h. */
  587. |
  588. | int
  589. | main ()
  590. | {
  591. |
  592. | ;
  593. | return 0;
  594. | }
  595. configure:9439: result: no
  596. configure:9447: checking whether the linker accepts -Wl,--nxcompat
  597. configure:9466: g++ -o conftest -O2 -mmacosx-version-min=10.5 -arch i386 -O3 -Wall -Wextra -Wformat -Wformat-security -Wno-unused-parameter -DBOOST_SPIRIT_THREADSAFE -DHAVE_BUILD_INFO -I/opt/local/include -I/opt/local/include/db48 -DMAC_OSX -Wl,--nxcompat conftest.cpp -L/opt/local/lib -L/opt/local/lib/db48 >&5
  598. ld: unknown option: --nxcompat
  599. clang: error: linker command failed with exit code 1 (use -v to see invocation)
  600. configure:9466: $? = 1
  601. configure: failed program was:
  602. | /* confdefs.h */
  603. | #define PACKAGE_NAME "Bitcoin"
  604. | #define PACKAGE_TARNAME "bitcoin"
  605. | #define PACKAGE_VERSION "0.8.99"
  606. | #define PACKAGE_STRING "Bitcoin 0.8.99"
  607. | #define PACKAGE_BUGREPORT "[email protected]"
  608. | #define PACKAGE_URL ""
  609. | #define STDC_HEADERS 1
  610. | #define HAVE_SYS_TYPES_H 1
  611. | #define HAVE_SYS_STAT_H 1
  612. | #define HAVE_STDLIB_H 1
  613. | #define HAVE_STRING_H 1
  614. | #define HAVE_MEMORY_H 1
  615. | #define HAVE_STRINGS_H 1
  616. | #define HAVE_INTTYPES_H 1
  617. | #define HAVE_STDINT_H 1
  618. | #define HAVE_UNISTD_H 1
  619. | #define HAVE_PTHREAD_PRIO_INHERIT 1
  620. | #define HAVE_PTHREAD 1
  621. | /* end confdefs.h. */
  622. |
  623. | int
  624. | main ()
  625. | {
  626. |
  627. | ;
  628. | return 0;
  629. | }
  630. configure:9475: result: no
  631. configure:9483: checking whether the linker accepts -Wl,-z,relro
  632. configure:9502: g++ -o conftest -O2 -mmacosx-version-min=10.5 -arch i386 -O3 -Wall -Wextra -Wformat -Wformat-security -Wno-unused-parameter -DBOOST_SPIRIT_THREADSAFE -DHAVE_BUILD_INFO -I/opt/local/include -I/opt/local/include/db48 -DMAC_OSX -Wl,-z,relro conftest.cpp -L/opt/local/lib -L/opt/local/lib/db48 >&5
  633. ld: unknown option: -z
  634. clang: error: linker command failed with exit code 1 (use -v to see invocation)
  635. configure:9502: $? = 1
  636. configure: failed program was:
  637. | /* confdefs.h */
  638. | #define PACKAGE_NAME "Bitcoin"
  639. | #define PACKAGE_TARNAME "bitcoin"
  640. | #define PACKAGE_VERSION "0.8.99"
  641. | #define PACKAGE_STRING "Bitcoin 0.8.99"
  642. | #define PACKAGE_BUGREPORT "[email protected]"
  643. | #define PACKAGE_URL ""
  644. | #define STDC_HEADERS 1
  645. | #define HAVE_SYS_TYPES_H 1
  646. | #define HAVE_SYS_STAT_H 1
  647. | #define HAVE_STDLIB_H 1
  648. | #define HAVE_STRING_H 1
  649. | #define HAVE_MEMORY_H 1
  650. | #define HAVE_STRINGS_H 1
  651. | #define HAVE_INTTYPES_H 1
  652. | #define HAVE_STDINT_H 1
  653. | #define HAVE_UNISTD_H 1
  654. | #define HAVE_PTHREAD_PRIO_INHERIT 1
  655. | #define HAVE_PTHREAD 1
  656. | /* end confdefs.h. */
  657. |
  658. | int
  659. | main ()
  660. | {
  661. |
  662. | ;
  663. | return 0;
  664. | }
  665. configure:9511: result: no
  666. configure:9519: checking whether the linker accepts -Wl,-z,now
  667. configure:9538: g++ -o conftest -O2 -mmacosx-version-min=10.5 -arch i386 -O3 -Wall -Wextra -Wformat -Wformat-security -Wno-unused-parameter -DBOOST_SPIRIT_THREADSAFE -DHAVE_BUILD_INFO -I/opt/local/include -I/opt/local/include/db48 -DMAC_OSX -Wl,-z,now conftest.cpp -L/opt/local/lib -L/opt/local/lib/db48 >&5
  668. ld: unknown option: -z
  669. clang: error: linker command failed with exit code 1 (use -v to see invocation)
  670. configure:9538: $? = 1
  671. configure: failed program was:
  672. | /* confdefs.h */
  673. | #define PACKAGE_NAME "Bitcoin"
  674. | #define PACKAGE_TARNAME "bitcoin"
  675. | #define PACKAGE_VERSION "0.8.99"
  676. | #define PACKAGE_STRING "Bitcoin 0.8.99"
  677. | #define PACKAGE_BUGREPORT "[email protected]"
  678. | #define PACKAGE_URL ""
  679. | #define STDC_HEADERS 1
  680. | #define HAVE_SYS_TYPES_H 1
  681. | #define HAVE_SYS_STAT_H 1
  682. | #define HAVE_STDLIB_H 1
  683. | #define HAVE_STRING_H 1
  684. | #define HAVE_MEMORY_H 1
  685. | #define HAVE_STRINGS_H 1
  686. | #define HAVE_INTTYPES_H 1
  687. | #define HAVE_STDINT_H 1
  688. | #define HAVE_UNISTD_H 1
  689. | #define HAVE_PTHREAD_PRIO_INHERIT 1
  690. | #define HAVE_PTHREAD 1
  691. | /* end confdefs.h. */
  692. |
  693. | int
  694. | main ()
  695. | {
  696. |
  697. | ;
  698. | return 0;
  699. | }
  700. configure:9547: result: no
  701. configure:9558: checking whether C++ compiler accepts -fno-stack-protector
  702. configure:9577: g++ -c -O2 -mmacosx-version-min=10.5 -arch i386 -O3 -Wall -Wextra -Wformat -Wformat-security -Wno-unused-parameter -fno-stack-protector -DBOOST_SPIRIT_THREADSAFE -DHAVE_BUILD_INFO -I/opt/local/include -I/opt/local/include/db48 -DMAC_OSX conftest.cpp >&5
  703. configure:9577: $? = 0
  704. configure:9585: result: yes
  705. configure:9593: checking whether C++ compiler accepts -fstack-protector-all
  706. configure:9612: g++ -c -O2 -mmacosx-version-min=10.5 -arch i386 -O3 -Wall -Wextra -Wformat -Wformat-security -Wno-unused-parameter -fstack-protector-all -DBOOST_SPIRIT_THREADSAFE -DHAVE_BUILD_INFO -I/opt/local/include -I/opt/local/include/db48 -DMAC_OSX conftest.cpp >&5
  707. configure:9612: $? = 0
  708. configure:9620: result: yes
  709. configure:9630: checking whether the linker accepts -pie
  710. configure:9649: g++ -o conftest -O2 -mmacosx-version-min=10.5 -arch i386 -O3 -Wall -Wextra -Wformat -Wformat-security -Wno-unused-parameter -DBOOST_SPIRIT_THREADSAFE -DHAVE_BUILD_INFO -I/opt/local/include -I/opt/local/include/db48 -DMAC_OSX -pie conftest.cpp -L/opt/local/lib -L/opt/local/lib/db48 >&5
  711. clang: warning: argument unused during compilation: '-pie'
  712. configure:9649: $? = 0
  713. configure:9658: result: yes
  714. configure:9675: checking whether the linker accepts -Wl,-dead_strip
  715. configure:9694: g++ -o conftest -O2 -mmacosx-version-min=10.5 -arch i386 -O3 -Wall -Wextra -Wformat -Wformat-security -Wno-unused-parameter -Wstack-protector -fPIE -fno-stack-protector -fstack-protector-all -DBOOST_SPIRIT_THREADSAFE -DHAVE_BUILD_INFO -I/opt/local/include -I/opt/local/include/db48 -DMAC_OSX -D_FORTIFY_SOURCE=2 -pie -Wl,-dead_strip conftest.cpp -L/opt/local/lib -L/opt/local/lib/db48 >&5
  716. clang: warning: argument unused during compilation: '-pie'
  717. configure:9694: $? = 0
  718. configure:9703: result: yes
  719. configure:9716: checking stdio.h usability
  720. configure:9716: g++ -c -O2 -mmacosx-version-min=10.5 -arch i386 -O3 -Wall -Wextra -Wformat -Wformat-security -Wno-unused-parameter -Wstack-protector -fPIE -fno-stack-protector -fstack-protector-all -DBOOST_SPIRIT_THREADSAFE -DHAVE_BUILD_INFO -I/opt/local/include -I/opt/local/include/db48 -DMAC_OSX -D_FORTIFY_SOURCE=2 conftest.cpp >&5
  721. configure:9716: $? = 0
  722. configure:9716: result: yes
  723. configure:9716: checking stdio.h presence
  724. configure:9716: g++ -E -DBOOST_SPIRIT_THREADSAFE -DHAVE_BUILD_INFO -I/opt/local/include -I/opt/local/include/db48 -DMAC_OSX -D_FORTIFY_SOURCE=2 conftest.cpp
  725. configure:9716: $? = 0
  726. configure:9716: result: yes
  727. configure:9716: checking for stdio.h
  728. configure:9716: result: yes
  729. configure:9716: checking for stdlib.h
  730. configure:9716: result: yes
  731. configure:9716: checking for unistd.h
  732. configure:9716: result: yes
  733. configure:9716: checking for strings.h
  734. configure:9716: result: yes
  735. configure:9716: checking for sys/types.h
  736. configure:9716: result: yes
  737. configure:9716: checking for sys/stat.h
  738. configure:9716: result: yes
  739. configure:9727: checking for MSG_NOSIGNAL
  740. configure:9740: g++ -c -O2 -mmacosx-version-min=10.5 -arch i386 -O3 -Wall -Wextra -Wformat -Wformat-security -Wno-unused-parameter -Wstack-protector -fPIE -fno-stack-protector -fstack-protector-all -DBOOST_SPIRIT_THREADSAFE -DHAVE_BUILD_INFO -I/opt/local/include -I/opt/local/include/db48 -DMAC_OSX -D_FORTIFY_SOURCE=2 conftest.cpp >&5
  741. conftest.cpp:31:10: error: use of undeclared identifier 'MSG_NOSIGNAL'
  742. int f = MSG_NOSIGNAL;
  743. ^
  744. 1 error generated.
  745. configure:9740: $? = 1
  746. configure: failed program was:
  747. | /* confdefs.h */
  748. | #define PACKAGE_NAME "Bitcoin"
  749. | #define PACKAGE_TARNAME "bitcoin"
  750. | #define PACKAGE_VERSION "0.8.99"
  751. | #define PACKAGE_STRING "Bitcoin 0.8.99"
  752. | #define PACKAGE_BUGREPORT "[email protected]"
  753. | #define PACKAGE_URL ""
  754. | #define STDC_HEADERS 1
  755. | #define HAVE_SYS_TYPES_H 1
  756. | #define HAVE_SYS_STAT_H 1
  757. | #define HAVE_STDLIB_H 1
  758. | #define HAVE_STRING_H 1
  759. | #define HAVE_MEMORY_H 1
  760. | #define HAVE_STRINGS_H 1
  761. | #define HAVE_INTTYPES_H 1
  762. | #define HAVE_STDINT_H 1
  763. | #define HAVE_UNISTD_H 1
  764. | #define HAVE_PTHREAD_PRIO_INHERIT 1
  765. | #define HAVE_PTHREAD 1
  766. | #define HAVE_STDIO_H 1
  767. | #define HAVE_STDLIB_H 1
  768. | #define HAVE_UNISTD_H 1
  769. | #define HAVE_STRINGS_H 1
  770. | #define HAVE_SYS_TYPES_H 1
  771. | #define HAVE_SYS_STAT_H 1
  772. | /* end confdefs.h. */
  773. | #include <sys/socket.h>
  774. | int
  775. | main ()
  776. | {
  777. | int f = MSG_NOSIGNAL;
  778. | ;
  779. | return 0;
  780. | }
  781. configure:9746: result: no
  782. configure:9753: checking for Berkeley DB C++ headers
  783. configure:9784: g++ -c -O2 -mmacosx-version-min=10.5 -arch i386 -O3 -Wall -Wextra -Wformat -Wformat-security -Wno-unused-parameter -Wstack-protector -fPIE -fno-stack-protector -fstack-protector-all -DBOOST_SPIRIT_THREADSAFE -DHAVE_BUILD_INFO -I/opt/local/include -I/opt/local/include/db48 -DMAC_OSX -D_FORTIFY_SOURCE=2 conftest.cpp >&5
  784. conftest.cpp:28:16: fatal error: 'bdb4.8/db_cxx.h' file not found
  785. #include <bdb4.8/db_cxx.h>
  786. ^
  787. 1 error generated.
  788. configure:9784: $? = 1
  789. configure: failed program was:
  790. | /* confdefs.h */
  791. | #define PACKAGE_NAME "Bitcoin"
  792. | #define PACKAGE_TARNAME "bitcoin"
  793. | #define PACKAGE_VERSION "0.8.99"
  794. | #define PACKAGE_STRING "Bitcoin 0.8.99"
  795. | #define PACKAGE_BUGREPORT "[email protected]"
  796. | #define PACKAGE_URL ""
  797. | #define STDC_HEADERS 1
  798. | #define HAVE_SYS_TYPES_H 1
  799. | #define HAVE_SYS_STAT_H 1
  800. | #define HAVE_STDLIB_H 1
  801. | #define HAVE_STRING_H 1
  802. | #define HAVE_MEMORY_H 1
  803. | #define HAVE_STRINGS_H 1
  804. | #define HAVE_INTTYPES_H 1
  805. | #define HAVE_STDINT_H 1
  806. | #define HAVE_UNISTD_H 1
  807. | #define HAVE_PTHREAD_PRIO_INHERIT 1
  808. | #define HAVE_PTHREAD 1
  809. | #define HAVE_STDIO_H 1
  810. | #define HAVE_STDLIB_H 1
  811. | #define HAVE_UNISTD_H 1
  812. | #define HAVE_STRINGS_H 1
  813. | #define HAVE_SYS_TYPES_H 1
  814. | #define HAVE_SYS_STAT_H 1
  815. | /* end confdefs.h. */
  816. |
  817. | #include <bdb4.8/db_cxx.h>
  818. |
  819. | int
  820. | main ()
  821. | {
  822. |
  823. | #if !((DB_VERSION_MAJOR == 4 && DB_VERSION_MINOR >= 8) || DB_VERSION_MAJOR > 4)
  824. | #error "failed to find bdb 4.8+"
  825. | #endif
  826. |
  827. | ;
  828. | return 0;
  829. | }
  830. configure:9784: g++ -c -O2 -mmacosx-version-min=10.5 -arch i386 -O3 -Wall -Wextra -Wformat -Wformat-security -Wno-unused-parameter -Wstack-protector -fPIE -fno-stack-protector -fstack-protector-all -DBOOST_SPIRIT_THREADSAFE -DHAVE_BUILD_INFO -I/opt/local/include -I/opt/local/include/db48 -DMAC_OSX -D_FORTIFY_SOURCE=2 conftest.cpp >&5
  831. conftest.cpp:28:16: fatal error: 'libdb4.8/db_cxx.h' file not found
  832. #include <libdb4.8/db_cxx.h>
  833. ^
  834. 1 error generated.
  835. configure:9784: $? = 1
  836. configure: failed program was:
  837. | /* confdefs.h */
  838. | #define PACKAGE_NAME "Bitcoin"
  839. | #define PACKAGE_TARNAME "bitcoin"
  840. | #define PACKAGE_VERSION "0.8.99"
  841. | #define PACKAGE_STRING "Bitcoin 0.8.99"
  842. | #define PACKAGE_BUGREPORT "[email protected]"
  843. | #define PACKAGE_URL ""
  844. | #define STDC_HEADERS 1
  845. | #define HAVE_SYS_TYPES_H 1
  846. | #define HAVE_SYS_STAT_H 1
  847. | #define HAVE_STDLIB_H 1
  848. | #define HAVE_STRING_H 1
  849. | #define HAVE_MEMORY_H 1
  850. | #define HAVE_STRINGS_H 1
  851. | #define HAVE_INTTYPES_H 1
  852. | #define HAVE_STDINT_H 1
  853. | #define HAVE_UNISTD_H 1
  854. | #define HAVE_PTHREAD_PRIO_INHERIT 1
  855. | #define HAVE_PTHREAD 1
  856. | #define HAVE_STDIO_H 1
  857. | #define HAVE_STDLIB_H 1
  858. | #define HAVE_UNISTD_H 1
  859. | #define HAVE_STRINGS_H 1
  860. | #define HAVE_SYS_TYPES_H 1
  861. | #define HAVE_SYS_STAT_H 1
  862. | /* end confdefs.h. */
  863. |
  864. | #include <libdb4.8/db_cxx.h>
  865. |
  866. | int
  867. | main ()
  868. | {
  869. |
  870. | #if !((DB_VERSION_MAJOR == 4 && DB_VERSION_MINOR >= 8) || DB_VERSION_MAJOR > 4)
  871. | #error "failed to find bdb 4.8+"
  872. | #endif
  873. |
  874. | ;
  875. | return 0;
  876. | }
  877. configure:9784: g++ -c -O2 -mmacosx-version-min=10.5 -arch i386 -O3 -Wall -Wextra -Wformat -Wformat-security -Wno-unused-parameter -Wstack-protector -fPIE -fno-stack-protector -fstack-protector-all -DBOOST_SPIRIT_THREADSAFE -DHAVE_BUILD_INFO -I/opt/local/include -I/opt/local/include/db48 -DMAC_OSX -D_FORTIFY_SOURCE=2 conftest.cpp >&5
  878. conftest.cpp:28:16: fatal error: 'db4.8/db_cxx.h' file not found
  879. #include <db4.8/db_cxx.h>
  880. ^
  881. 1 error generated.
  882. configure:9784: $? = 1
  883. configure: failed program was:
  884. | /* confdefs.h */
  885. | #define PACKAGE_NAME "Bitcoin"
  886. | #define PACKAGE_TARNAME "bitcoin"
  887. | #define PACKAGE_VERSION "0.8.99"
  888. | #define PACKAGE_STRING "Bitcoin 0.8.99"
  889. | #define PACKAGE_BUGREPORT "[email protected]"
  890. | #define PACKAGE_URL ""
  891. | #define STDC_HEADERS 1
  892. | #define HAVE_SYS_TYPES_H 1
  893. | #define HAVE_SYS_STAT_H 1
  894. | #define HAVE_STDLIB_H 1
  895. | #define HAVE_STRING_H 1
  896. | #define HAVE_MEMORY_H 1
  897. | #define HAVE_STRINGS_H 1
  898. | #define HAVE_INTTYPES_H 1
  899. | #define HAVE_STDINT_H 1
  900. | #define HAVE_UNISTD_H 1
  901. | #define HAVE_PTHREAD_PRIO_INHERIT 1
  902. | #define HAVE_PTHREAD 1
  903. | #define HAVE_STDIO_H 1
  904. | #define HAVE_STDLIB_H 1
  905. | #define HAVE_UNISTD_H 1
  906. | #define HAVE_STRINGS_H 1
  907. | #define HAVE_SYS_TYPES_H 1
  908. | #define HAVE_SYS_STAT_H 1
  909. | /* end confdefs.h. */
  910. |
  911. | #include <db4.8/db_cxx.h>
  912. |
  913. | int
  914. | main ()
  915. | {
  916. |
  917. | #if !((DB_VERSION_MAJOR == 4 && DB_VERSION_MINOR >= 8) || DB_VERSION_MAJOR > 4)
  918. | #error "failed to find bdb 4.8+"
  919. | #endif
  920. |
  921. | ;
  922. | return 0;
  923. | }
  924. configure:9784: g++ -c -O2 -mmacosx-version-min=10.5 -arch i386 -O3 -Wall -Wextra -Wformat -Wformat-security -Wno-unused-parameter -Wstack-protector -fPIE -fno-stack-protector -fstack-protector-all -DBOOST_SPIRIT_THREADSAFE -DHAVE_BUILD_INFO -I/opt/local/include -I/opt/local/include/db48 -DMAC_OSX -D_FORTIFY_SOURCE=2 conftest.cpp >&5
  925. conftest.cpp:28:16: fatal error: 'bdb48/db_cxx.h' file not found
  926. #include <bdb48/db_cxx.h>
  927. ^
  928. 1 error generated.
  929. configure:9784: $? = 1
  930. configure: failed program was:
  931. | /* confdefs.h */
  932. | #define PACKAGE_NAME "Bitcoin"
  933. | #define PACKAGE_TARNAME "bitcoin"
  934. | #define PACKAGE_VERSION "0.8.99"
  935. | #define PACKAGE_STRING "Bitcoin 0.8.99"
  936. | #define PACKAGE_BUGREPORT "[email protected]"
  937. | #define PACKAGE_URL ""
  938. | #define STDC_HEADERS 1
  939. | #define HAVE_SYS_TYPES_H 1
  940. | #define HAVE_SYS_STAT_H 1
  941. | #define HAVE_STDLIB_H 1
  942. | #define HAVE_STRING_H 1
  943. | #define HAVE_MEMORY_H 1
  944. | #define HAVE_STRINGS_H 1
  945. | #define HAVE_INTTYPES_H 1
  946. | #define HAVE_STDINT_H 1
  947. | #define HAVE_UNISTD_H 1
  948. | #define HAVE_PTHREAD_PRIO_INHERIT 1
  949. | #define HAVE_PTHREAD 1
  950. | #define HAVE_STDIO_H 1
  951. | #define HAVE_STDLIB_H 1
  952. | #define HAVE_UNISTD_H 1
  953. | #define HAVE_STRINGS_H 1
  954. | #define HAVE_SYS_TYPES_H 1
  955. | #define HAVE_SYS_STAT_H 1
  956. | /* end confdefs.h. */
  957. |
  958. | #include <bdb48/db_cxx.h>
  959. |
  960. | int
  961. | main ()
  962. | {
  963. |
  964. | #if !((DB_VERSION_MAJOR == 4 && DB_VERSION_MINOR >= 8) || DB_VERSION_MAJOR > 4)
  965. | #error "failed to find bdb 4.8+"
  966. | #endif
  967. |
  968. | ;
  969. | return 0;
  970. | }
  971. configure:9784: g++ -c -O2 -mmacosx-version-min=10.5 -arch i386 -O3 -Wall -Wextra -Wformat -Wformat-security -Wno-unused-parameter -Wstack-protector -fPIE -fno-stack-protector -fstack-protector-all -DBOOST_SPIRIT_THREADSAFE -DHAVE_BUILD_INFO -I/opt/local/include -I/opt/local/include/db48 -DMAC_OSX -D_FORTIFY_SOURCE=2 conftest.cpp >&5
  972. conftest.cpp:28:16: fatal error: 'libdb48/db_cxx.h' file not found
  973. #include <libdb48/db_cxx.h>
  974. ^
  975. 1 error generated.
  976. configure:9784: $? = 1
  977. configure: failed program was:
  978. | /* confdefs.h */
  979. | #define PACKAGE_NAME "Bitcoin"
  980. | #define PACKAGE_TARNAME "bitcoin"
  981. | #define PACKAGE_VERSION "0.8.99"
  982. | #define PACKAGE_STRING "Bitcoin 0.8.99"
  983. | #define PACKAGE_BUGREPORT "[email protected]"
  984. | #define PACKAGE_URL ""
  985. | #define STDC_HEADERS 1
  986. | #define HAVE_SYS_TYPES_H 1
  987. | #define HAVE_SYS_STAT_H 1
  988. | #define HAVE_STDLIB_H 1
  989. | #define HAVE_STRING_H 1
  990. | #define HAVE_MEMORY_H 1
  991. | #define HAVE_STRINGS_H 1
  992. | #define HAVE_INTTYPES_H 1
  993. | #define HAVE_STDINT_H 1
  994. | #define HAVE_UNISTD_H 1
  995. | #define HAVE_PTHREAD_PRIO_INHERIT 1
  996. | #define HAVE_PTHREAD 1
  997. | #define HAVE_STDIO_H 1
  998. | #define HAVE_STDLIB_H 1
  999. | #define HAVE_UNISTD_H 1
  1000. | #define HAVE_STRINGS_H 1
  1001. | #define HAVE_SYS_TYPES_H 1
  1002. | #define HAVE_SYS_STAT_H 1
  1003. | /* end confdefs.h. */
  1004. |
  1005. | #include <libdb48/db_cxx.h>
  1006. |
  1007. | int
  1008. | main ()
  1009. | {
  1010. |
  1011. | #if !((DB_VERSION_MAJOR == 4 && DB_VERSION_MINOR >= 8) || DB_VERSION_MAJOR > 4)
  1012. | #error "failed to find bdb 4.8+"
  1013. | #endif
  1014. |
  1015. | ;
  1016. | return 0;
  1017. | }
  1018. configure:9784: g++ -c -O2 -mmacosx-version-min=10.5 -arch i386 -O3 -Wall -Wextra -Wformat -Wformat-security -Wno-unused-parameter -Wstack-protector -fPIE -fno-stack-protector -fstack-protector-all -DBOOST_SPIRIT_THREADSAFE -DHAVE_BUILD_INFO -I/opt/local/include -I/opt/local/include/db48 -DMAC_OSX -D_FORTIFY_SOURCE=2 conftest.cpp >&5
  1019. configure:9784: $? = 0
  1020. configure:9813: g++ -c -O2 -mmacosx-version-min=10.5 -arch i386 -O3 -Wall -Wextra -Wformat -Wformat-security -Wno-unused-parameter -Wstack-protector -fPIE -fno-stack-protector -fstack-protector-all -DBOOST_SPIRIT_THREADSAFE -DHAVE_BUILD_INFO -I/opt/local/include -I/opt/local/include/db48 -DMAC_OSX -D_FORTIFY_SOURCE=2 conftest.cpp >&5
  1021. configure:9813: $? = 0
  1022. configure:9859: result:
  1023. configure:9871: checking for main in -ldb_cxx-4.8
  1024. configure:9890: g++ -o conftest -O2 -mmacosx-version-min=10.5 -arch i386 -O3 -Wall -Wextra -Wformat -Wformat-security -Wno-unused-parameter -Wstack-protector -fPIE -fno-stack-protector -fstack-protector-all -DBOOST_SPIRIT_THREADSAFE -DHAVE_BUILD_INFO -I/opt/local/include -I/opt/local/include/db48 -DMAC_OSX -D_FORTIFY_SOURCE=2 -pie -Wl,-dead_strip conftest.cpp -ldb_cxx-4.8 -L/opt/local/lib -L/opt/local/lib/db48 >&5
  1025. clang: warning: argument unused during compilation: '-pie'
  1026. ld: warning: ignoring file /opt/local/lib/db48/libdb_cxx-4.8.dylib, file was built for x86_64 which is not the architecture being linked (i386): /opt/local/lib/db48/libdb_cxx-4.8.dylib
  1027. configure:9890: $? = 0
  1028. configure:9900: result: yes
  1029. configure:9917: checking for main in -lminiupnpc
  1030. configure:9936: g++ -o conftest -O2 -mmacosx-version-min=10.5 -arch i386 -O3 -Wall -Wextra -Wformat -Wformat-security -Wno-unused-parameter -Wstack-protector -fPIE -fno-stack-protector -fstack-protector-all -DBOOST_SPIRIT_THREADSAFE -DHAVE_BUILD_INFO -I/opt/local/include -I/opt/local/include/db48 -DMAC_OSX -D_FORTIFY_SOURCE=2 -pie -Wl,-dead_strip conftest.cpp -lminiupnpc -L/opt/local/lib -L/opt/local/lib/db48 >&5
  1031. clang: warning: argument unused during compilation: '-pie'
  1032. ld: warning: ignoring file /opt/local/lib/libminiupnpc.dylib, file was built for x86_64 which is not the architecture being linked (i386): /opt/local/lib/libminiupnpc.dylib
  1033. configure:9936: $? = 0
  1034. configure:9945: result: yes
  1035. configure:10008: checking for boostlib >= 1.20.0
  1036. configure:10077: g++ -c -O2 -mmacosx-version-min=10.5 -arch i386 -O3 -Wall -Wextra -Wformat -Wformat-security -Wno-unused-parameter -Wstack-protector -fPIE -fno-stack-protector -fstack-protector-all -DBOOST_SPIRIT_THREADSAFE -DHAVE_BUILD_INFO -I/opt/local/include -I/opt/local/include/db48 -DMAC_OSX -D_FORTIFY_SOURCE=2 -I/opt/local/include conftest.cpp >&5
  1037. configure:10077: $? = 0
  1038. configure:10079: result: yes
  1039. configure:10257: checking whether the Boost::System library is available
  1040. configure:10281: g++ -c -O2 -mmacosx-version-min=10.5 -arch i386 -O3 -Wall -Wextra -Wformat -Wformat-security -Wno-unused-parameter -Wstack-protector -fPIE -fno-stack-protector -fstack-protector-all -DBOOST_SPIRIT_THREADSAFE -DHAVE_BUILD_INFO -I/opt/local/include -I/opt/local/include/db48 -DMAC_OSX -D_FORTIFY_SOURCE=2 -I/opt/local/include conftest.cpp >&5
  1041. conftest.cpp:33:1: warning: expression result unused [-Wunused-value]
  1042. boost::system::system_category
  1043. ^~~~~~~~~~~~~~~~~~~~~~~~~~~~~~
  1044. 1 warning generated.
  1045. configure:10281: $? = 0
  1046. configure:10296: result: yes
  1047. configure:10311: checking for exit in -lboost_system-mt
  1048. configure:10336: g++ -o conftest -O2 -mmacosx-version-min=10.5 -arch i386 -O3 -Wall -Wextra -Wformat -Wformat-security -Wno-unused-parameter -Wstack-protector -fPIE -fno-stack-protector -fstack-protector-all -DBOOST_SPIRIT_THREADSAFE -DHAVE_BUILD_INFO -I/opt/local/include -I/opt/local/include/db48 -DMAC_OSX -D_FORTIFY_SOURCE=2 -I/opt/local/include -pie -Wl,-dead_strip -L/opt/local/lib conftest.cpp -lboost_system-mt -lminiupnpc -L/opt/local/lib -L/opt/local/lib/db48 >&5
  1049. clang: warning: argument unused during compilation: '-pie'
  1050. ld: warning: ld: warning: ignoring file /opt/local/lib/libboost_system-mt.dylib, file was built for x86_64 which is not the architecture being linked (i386): /opt/local/lib/libboost_system-mt.dylibignoring file /opt/local/lib/libminiupnpc.dylib, file was built for x86_64 which is not the architecture being linked (i386): /opt/local/lib/libminiupnpc.dylib
  1051.  
  1052. configure:10336: $? = 0
  1053. configure:10346: result: yes
  1054. configure:10501: checking whether the Boost::Filesystem library is available
  1055. configure:10525: g++ -c -O2 -mmacosx-version-min=10.5 -arch i386 -O3 -Wall -Wextra -Wformat -Wformat-security -Wno-unused-parameter -Wstack-protector -fPIE -fno-stack-protector -fstack-protector-all -DBOOST_SPIRIT_THREADSAFE -DHAVE_BUILD_INFO -I/opt/local/include -I/opt/local/include/db48 -DMAC_OSX -D_FORTIFY_SOURCE=2 -I/opt/local/include conftest.cpp >&5
  1056. configure:10525: $? = 0
  1057. configure:10539: result: yes
  1058. configure:10550: checking for exit in -lboost_filesystem-mt
  1059. configure:10575: g++ -o conftest -O2 -mmacosx-version-min=10.5 -arch i386 -O3 -Wall -Wextra -Wformat -Wformat-security -Wno-unused-parameter -Wstack-protector -fPIE -fno-stack-protector -fstack-protector-all -DBOOST_SPIRIT_THREADSAFE -DHAVE_BUILD_INFO -I/opt/local/include -I/opt/local/include/db48 -DMAC_OSX -D_FORTIFY_SOURCE=2 -I/opt/local/include -pie -Wl,-dead_strip -L/opt/local/lib conftest.cpp -lboost_filesystem-mt -lminiupnpc -L/opt/local/lib -L/opt/local/lib/db48 -lboost_system-mt >&5
  1060. clang: warning: argument unused during compilation: '-pie'
  1061. ld: warning: ld: warning: ignoring file /opt/local/lib/libboost_filesystem-mt.dylib, file was built for x86_64 which is not the architecture being linked (i386): /opt/local/lib/libboost_filesystem-mt.dylibignoring file /opt/local/lib/libminiupnpc.dylib, file was built for x86_64 which is not the architecture being linked (i386): /opt/local/lib/libminiupnpc.dylibld: warning:
  1062.  
  1063. ignoring file /opt/local/lib/libboost_system-mt.dylib, file was built for x86_64 which is not the architecture being linked (i386): /opt/local/lib/libboost_system-mt.dylib
  1064. configure:10575: $? = 0
  1065. configure:10585: result: yes
  1066. configure:10735: checking whether the Boost::Program_Options library is available
  1067. configure:10759: g++ -c -O2 -mmacosx-version-min=10.5 -arch i386 -O3 -Wall -Wextra -Wformat -Wformat-security -Wno-unused-parameter -Wstack-protector -fPIE -fno-stack-protector -fstack-protector-all -DBOOST_SPIRIT_THREADSAFE -DHAVE_BUILD_INFO -I/opt/local/include -I/opt/local/include/db48 -DMAC_OSX -D_FORTIFY_SOURCE=2 -I/opt/local/include conftest.cpp >&5
  1068. configure:10759: $? = 0
  1069. configure:10773: result: yes
  1070. configure:10784: checking for exit in -lboost_program_options-mt
  1071. configure:10809: g++ -o conftest -O2 -mmacosx-version-min=10.5 -arch i386 -O3 -Wall -Wextra -Wformat -Wformat-security -Wno-unused-parameter -Wstack-protector -fPIE -fno-stack-protector -fstack-protector-all -DBOOST_SPIRIT_THREADSAFE -DHAVE_BUILD_INFO -I/opt/local/include -I/opt/local/include/db48 -DMAC_OSX -D_FORTIFY_SOURCE=2 -I/opt/local/include -pie -Wl,-dead_strip -L/opt/local/lib conftest.cpp -lboost_program_options-mt -lminiupnpc -L/opt/local/lib -L/opt/local/lib/db48 >&5
  1072. clang: warning: argument unused during compilation: '-pie'
  1073. ld: warning: ld: warning: ignoring file /opt/local/lib/libminiupnpc.dylib, file was built for x86_64 which is not the architecture being linked (i386): /opt/local/lib/libminiupnpc.dylibignoring file /opt/local/lib/libboost_program_options-mt.dylib, file was built for x86_64 which is not the architecture being linked (i386): /opt/local/lib/libboost_program_options-mt.dylib
  1074.  
  1075. configure:10809: $? = 0
  1076. configure:10819: result: yes
  1077. configure:10962: checking whether the Boost::Thread library is available
  1078. configure:10998: g++ -c -O2 -mmacosx-version-min=10.5 -arch i386 -O3 -Wall -Wextra -Wformat -Wformat-security -Wno-unused-parameter -Wstack-protector -fPIE -fno-stack-protector -fstack-protector-all -DBOOST_SPIRIT_THREADSAFE -DHAVE_BUILD_INFO -I/opt/local/include -I/opt/local/include/db48 -DMAC_OSX -D_FORTIFY_SOURCE=2 -I/opt/local/include conftest.cpp >&5
  1079. configure:10998: $? = 0
  1080. configure:11013: result: yes
  1081. configure:11042: checking for exit in -lboost_thread-mt
  1082. configure:11067: g++ -o conftest -O2 -mmacosx-version-min=10.5 -arch i386 -O3 -Wall -Wextra -Wformat -Wformat-security -Wno-unused-parameter -Wstack-protector -fPIE -fno-stack-protector -fstack-protector-all -DBOOST_SPIRIT_THREADSAFE -DHAVE_BUILD_INFO -I/opt/local/include -I/opt/local/include/db48 -DMAC_OSX -D_FORTIFY_SOURCE=2 -I/opt/local/include -pie -Wl,-dead_strip -L/opt/local/lib conftest.cpp -lboost_thread-mt -lminiupnpc -L/opt/local/lib -L/opt/local/lib/db48 >&5
  1083. clang: warning: argument unused during compilation: '-pie'
  1084. ld: warning: ld: warning: ignoring file /opt/local/lib/libboost_thread-mt.dylib, file was built for x86_64 which is not the architecture being linked (i386): /opt/local/lib/libboost_thread-mt.dylibignoring file /opt/local/lib/libminiupnpc.dylib, file was built for x86_64 which is not the architecture being linked (i386): /opt/local/lib/libminiupnpc.dylib
  1085.  
  1086. configure:11067: $? = 0
  1087. configure:11077: result: yes
  1088. configure:11237: checking whether the Boost::Chrono library is available
  1089. configure:11261: g++ -c -O2 -mmacosx-version-min=10.5 -arch i386 -O3 -Wall -Wextra -Wformat -Wformat-security -Wno-unused-parameter -Wstack-protector -fPIE -fno-stack-protector -fstack-protector-all -DBOOST_SPIRIT_THREADSAFE -DHAVE_BUILD_INFO -I/opt/local/include -I/opt/local/include/db48 -DMAC_OSX -D_FORTIFY_SOURCE=2 -I/opt/local/include conftest.cpp >&5
  1090. configure:11261: $? = 0
  1091. configure:11276: result: yes
  1092. configure:11291: checking for exit in -lboost_chrono-mt
  1093. configure:11316: g++ -o conftest -O2 -mmacosx-version-min=10.5 -arch i386 -O3 -Wall -Wextra -Wformat -Wformat-security -Wno-unused-parameter -Wstack-protector -fPIE -fno-stack-protector -fstack-protector-all -DBOOST_SPIRIT_THREADSAFE -DHAVE_BUILD_INFO -I/opt/local/include -I/opt/local/include/db48 -DMAC_OSX -D_FORTIFY_SOURCE=2 -I/opt/local/include -pie -Wl,-dead_strip -L/opt/local/lib conftest.cpp -lboost_chrono-mt -lminiupnpc -L/opt/local/lib -L/opt/local/lib/db48 >&5
  1094. clang: warning: argument unused during compilation: '-pie'
  1095. ld: warning: ld: warning: ignoring file /opt/local/lib/libboost_chrono-mt.dylib, file was built for x86_64 which is not the architecture being linked (i386): /opt/local/lib/libboost_chrono-mt.dylibignoring file /opt/local/lib/libminiupnpc.dylib, file was built for x86_64 which is not the architecture being linked (i386): /opt/local/lib/libminiupnpc.dylib
  1096.  
  1097. configure:11316: $? = 0
  1098. configure:11326: result: yes
  1099. configure:11654: g++ -o conftest -O2 -mmacosx-version-min=10.5 -arch i386 -O3 -Wall -Wextra -Wformat -Wformat-security -Wno-unused-parameter -Wstack-protector -fPIE -fno-stack-protector -fstack-protector-all -DBOOST_SPIRIT_THREADSAFE -DHAVE_BUILD_INFO -I/opt/local/include -I/opt/local/include/db48 -DMAC_OSX -D_FORTIFY_SOURCE=2 -pie -Wl,-dead_strip conftest.cpp -lminiupnpc -L/opt/local/lib -L/opt/local/lib/db48 -L/opt/local/lib -lboost_system-mt -lboost_filesystem-mt -lboost_program_options-mt -lboost_thread-mt -lboost_chrono-mt >&5
  1100. clang: warning: argument unused during compilation: '-pie'
  1101. ld: warning: ld: warning: ignoring file /opt/local/lib/libminiupnpc.dylib, file was built for x86_64 which is not the architecture being linked (i386): /opt/local/lib/libminiupnpc.dylibld: warning: ld: warning: ignoring file /opt/local/lib/libboost_system-mt.dylib, file was built for x86_64 which is not the architecture being linked (i386): /opt/local/lib/libboost_system-mt.dylib
  1102. ignoring file /opt/local/lib/libboost_filesystem-mt.dylib, file was built for x86_64 which is not the architecture being linked (i386): /opt/local/lib/libboost_filesystem-mt.dylibignoring file /opt/local/lib/libboost_program_options-mt.dylib, file was built for x86_64 which is not the architecture being linked (i386): /opt/local/lib/libboost_program_options-mt.dylib
  1103.  
  1104.  
  1105. ld: warning: ignoring file /opt/local/lib/libboost_thread-mt.dylib, file was built for x86_64 which is not the architecture being linked (i386): /opt/local/lib/libboost_thread-mt.dylibld: warning:
  1106. ignoring file /opt/local/lib/libboost_chrono-mt.dylib, file was built for x86_64 which is not the architecture being linked (i386): /opt/local/lib/libboost_chrono-mt.dylib
  1107. Undefined symbols for architecture i386:
  1108. "boost::system::generic_category()", referenced from:
  1109. __GLOBAL__I_a in conftest-tkbUyS.o
  1110. "boost::system::system_category()", referenced from:
  1111. __GLOBAL__I_a in conftest-tkbUyS.o
  1112. ld: symbol(s) not found for architecture i386
  1113. clang: error: linker command failed with exit code 1 (use -v to see invocation)
  1114. configure:11654: $? = 1
  1115. configure: failed program was:
  1116. | /* confdefs.h */
  1117. | #define PACKAGE_NAME "Bitcoin"
  1118. | #define PACKAGE_TARNAME "bitcoin"
  1119. | #define PACKAGE_VERSION "0.8.99"
  1120. | #define PACKAGE_STRING "Bitcoin 0.8.99"
  1121. | #define PACKAGE_BUGREPORT "[email protected]"
  1122. | #define PACKAGE_URL ""
  1123. | #define STDC_HEADERS 1
  1124. | #define HAVE_SYS_TYPES_H 1
  1125. | #define HAVE_SYS_STAT_H 1
  1126. | #define HAVE_STDLIB_H 1
  1127. | #define HAVE_STRING_H 1
  1128. | #define HAVE_MEMORY_H 1
  1129. | #define HAVE_STRINGS_H 1
  1130. | #define HAVE_INTTYPES_H 1
  1131. | #define HAVE_STDINT_H 1
  1132. | #define HAVE_UNISTD_H 1
  1133. | #define HAVE_PTHREAD_PRIO_INHERIT 1
  1134. | #define HAVE_PTHREAD 1
  1135. | #define HAVE_STDIO_H 1
  1136. | #define HAVE_STDLIB_H 1
  1137. | #define HAVE_UNISTD_H 1
  1138. | #define HAVE_STRINGS_H 1
  1139. | #define HAVE_SYS_TYPES_H 1
  1140. | #define HAVE_SYS_STAT_H 1
  1141. | #define HAVE_LIBMINIUPNPC 1
  1142. | #define HAVE_BOOST /**/
  1143. | #define HAVE_BOOST_SYSTEM /**/
  1144. | #define HAVE_BOOST_FILESYSTEM /**/
  1145. | #define HAVE_BOOST_PROGRAM_OPTIONS /**/
  1146. | #define HAVE_BOOST_THREAD /**/
  1147. | #define HAVE_BOOST_CHRONO /**/
  1148. | /* end confdefs.h. */
  1149. |
  1150. | #include <boost/thread/thread.hpp>
  1151. | #include <boost/version.hpp>
  1152. |
  1153. | int
  1154. | main ()
  1155. | {
  1156. |
  1157. | #if BOOST_VERSION >= 105000 && (!defined(BOOST_HAS_NANOSLEEP) || BOOST_VERSION >= 105200)
  1158. | boost::this_thread::sleep_for(boost::chrono::milliseconds(0));
  1159. | #else
  1160. | choke me
  1161. | #endif
  1162. |
  1163. | ;
  1164. | return 0;
  1165. | }
  1166. configure:11691: g++ -o conftest -O2 -mmacosx-version-min=10.5 -arch i386 -O3 -Wall -Wextra -Wformat -Wformat-security -Wno-unused-parameter -Wstack-protector -fPIE -fno-stack-protector -fstack-protector-all -DBOOST_SPIRIT_THREADSAFE -DHAVE_BUILD_INFO -I/opt/local/include -I/opt/local/include/db48 -DMAC_OSX -D_FORTIFY_SOURCE=2 -pie -Wl,-dead_strip conftest.cpp -lminiupnpc -L/opt/local/lib -L/opt/local/lib/db48 -L/opt/local/lib -lboost_system-mt -lboost_filesystem-mt -lboost_program_options-mt -lboost_thread-mt >&5
  1167. clang: warning: argument unused during compilation: '-pie'
  1168. ld: warning: ld: warning: ld: warning: ignoring file /opt/local/lib/libboost_system-mt.dylib, file was built for x86_64 which is not the architecture being linked (i386): /opt/local/lib/libboost_system-mt.dylibld: warning: ignoring file /opt/local/lib/libminiupnpc.dylib, file was built for x86_64 which is not the architecture being linked (i386): /opt/local/lib/libminiupnpc.dylibignoring file /opt/local/lib/libboost_filesystem-mt.dylib, file was built for x86_64 which is not the architecture being linked (i386): /opt/local/lib/libboost_filesystem-mt.dylib
  1169. ignoring file /opt/local/lib/libboost_program_options-mt.dylib, file was built for x86_64 which is not the architecture being linked (i386): /opt/local/lib/libboost_program_options-mt.dylib
  1170.  
  1171.  
  1172. ld: warning: ignoring file /opt/local/lib/libboost_thread-mt.dylib, file was built for x86_64 which is not the architecture being linked (i386): /opt/local/lib/libboost_thread-mt.dylib
  1173. Undefined symbols for architecture i386:
  1174. "boost::system::generic_category()", referenced from:
  1175. __GLOBAL__I_a in conftest-vhu80d.o
  1176. "boost::system::system_category()", referenced from:
  1177. __GLOBAL__I_a in conftest-vhu80d.o
  1178. "boost::this_thread::hiden::sleep_until(timespec const&)", referenced from:
  1179. _main in conftest-vhu80d.o
  1180. ld: symbol(s) not found for architecture i386
  1181. clang: error: linker command failed with exit code 1 (use -v to see invocation)
  1182. configure:11691: $? = 1
  1183. configure: failed program was:
  1184. | /* confdefs.h */
  1185. | #define PACKAGE_NAME "Bitcoin"
  1186. | #define PACKAGE_TARNAME "bitcoin"
  1187. | #define PACKAGE_VERSION "0.8.99"
  1188. | #define PACKAGE_STRING "Bitcoin 0.8.99"
  1189. | #define PACKAGE_BUGREPORT "[email protected]"
  1190. | #define PACKAGE_URL ""
  1191. | #define STDC_HEADERS 1
  1192. | #define HAVE_SYS_TYPES_H 1
  1193. | #define HAVE_SYS_STAT_H 1
  1194. | #define HAVE_STDLIB_H 1
  1195. | #define HAVE_STRING_H 1
  1196. | #define HAVE_MEMORY_H 1
  1197. | #define HAVE_STRINGS_H 1
  1198. | #define HAVE_INTTYPES_H 1
  1199. | #define HAVE_STDINT_H 1
  1200. | #define HAVE_UNISTD_H 1
  1201. | #define HAVE_PTHREAD_PRIO_INHERIT 1
  1202. | #define HAVE_PTHREAD 1
  1203. | #define HAVE_STDIO_H 1
  1204. | #define HAVE_STDLIB_H 1
  1205. | #define HAVE_UNISTD_H 1
  1206. | #define HAVE_STRINGS_H 1
  1207. | #define HAVE_SYS_TYPES_H 1
  1208. | #define HAVE_SYS_STAT_H 1
  1209. | #define HAVE_LIBMINIUPNPC 1
  1210. | #define HAVE_BOOST /**/
  1211. | #define HAVE_BOOST_SYSTEM /**/
  1212. | #define HAVE_BOOST_FILESYSTEM /**/
  1213. | #define HAVE_BOOST_PROGRAM_OPTIONS /**/
  1214. | #define HAVE_BOOST_THREAD /**/
  1215. | #define HAVE_BOOST_CHRONO /**/
  1216. | /* end confdefs.h. */
  1217. |
  1218. | #include <boost/version.hpp>
  1219. | #include <boost/thread.hpp>
  1220. | #include <boost/date_time/posix_time/posix_time_types.hpp>
  1221. |
  1222. | int
  1223. | main ()
  1224. | {
  1225. |
  1226. | #if BOOST_VERSION <= 105600
  1227. | boost::this_thread::sleep(boost::posix_time::milliseconds(0));
  1228. | #else
  1229. | choke me
  1230. | #endif
  1231. |
  1232. | ;
  1233. | return 0;
  1234. | }
  1235. configure:11704: error: No working boost sleep implementation found
  1236.  
  1237. ## ---------------- ##
  1238. ## Cache variables. ##
  1239. ## ---------------- ##
  1240.  
  1241. ac_cv_build=x86_64-apple-darwin12.4.0
  1242. ac_cv_c_bigendian=no
  1243. ac_cv_c_compiler_gnu=yes
  1244. ac_cv_cxx_compiler_gnu=yes
  1245. ac_cv_env_CCC_set=
  1246. ac_cv_env_CCC_value=
  1247. ac_cv_env_CC_set=
  1248. ac_cv_env_CC_value=
  1249. ac_cv_env_CFLAGS_set=
  1250. ac_cv_env_CFLAGS_value=
  1251. ac_cv_env_CPPFLAGS_set=
  1252. ac_cv_env_CPPFLAGS_value=
  1253. ac_cv_env_CPP_set=
  1254. ac_cv_env_CPP_value=
  1255. ac_cv_env_CRYPTO_CFLAGS_set=
  1256. ac_cv_env_CRYPTO_CFLAGS_value=
  1257. ac_cv_env_CRYPTO_LIBS_set=
  1258. ac_cv_env_CRYPTO_LIBS_value=
  1259. ac_cv_env_CXXCPP_set=
  1260. ac_cv_env_CXXCPP_value=
  1261. ac_cv_env_CXXFLAGS_set=
  1262. ac_cv_env_CXXFLAGS_value=
  1263. ac_cv_env_CXX_set=
  1264. ac_cv_env_CXX_value=
  1265. ac_cv_env_LDFLAGS_set=
  1266. ac_cv_env_LDFLAGS_value=
  1267. ac_cv_env_LIBS_set=
  1268. ac_cv_env_LIBS_value=
  1269. ac_cv_env_OBJCFLAGS_set=
  1270. ac_cv_env_OBJCFLAGS_value=
  1271. ac_cv_env_OBJCXXFLAGS_set=
  1272. ac_cv_env_OBJCXXFLAGS_value=
  1273. ac_cv_env_OBJCXX_set=
  1274. ac_cv_env_OBJCXX_value=
  1275. ac_cv_env_OBJC_set=
  1276. ac_cv_env_OBJC_value=
  1277. ac_cv_env_PKG_CONFIG_LIBDIR_set=
  1278. ac_cv_env_PKG_CONFIG_LIBDIR_value=
  1279. ac_cv_env_PKG_CONFIG_PATH_set=
  1280. ac_cv_env_PKG_CONFIG_PATH_value=
  1281. ac_cv_env_PKG_CONFIG_set=
  1282. ac_cv_env_PKG_CONFIG_value=
  1283. ac_cv_env_PROTOBUF_CFLAGS_set=
  1284. ac_cv_env_PROTOBUF_CFLAGS_value=
  1285. ac_cv_env_PROTOBUF_LIBS_set=
  1286. ac_cv_env_PROTOBUF_LIBS_value=
  1287. ac_cv_env_QR_CFLAGS_set=
  1288. ac_cv_env_QR_CFLAGS_value=
  1289. ac_cv_env_QR_LIBS_set=
  1290. ac_cv_env_QR_LIBS_value=
  1291. ac_cv_env_QT_CFLAGS_set=
  1292. ac_cv_env_QT_CFLAGS_value=
  1293. ac_cv_env_QT_DBUS_CFLAGS_set=
  1294. ac_cv_env_QT_DBUS_CFLAGS_value=
  1295. ac_cv_env_QT_DBUS_LIBS_set=
  1296. ac_cv_env_QT_DBUS_LIBS_value=
  1297. ac_cv_env_QT_LIBS_set=
  1298. ac_cv_env_QT_LIBS_value=
  1299. ac_cv_env_QT_TEST_CFLAGS_set=
  1300. ac_cv_env_QT_TEST_CFLAGS_value=
  1301. ac_cv_env_QT_TEST_LIBS_set=
  1302. ac_cv_env_QT_TEST_LIBS_value=
  1303. ac_cv_env_SSL_CFLAGS_set=
  1304. ac_cv_env_SSL_CFLAGS_value=
  1305. ac_cv_env_SSL_LIBS_set=
  1306. ac_cv_env_SSL_LIBS_value=
  1307. ac_cv_env_build_alias_set=
  1308. ac_cv_env_build_alias_value=
  1309. ac_cv_env_host_alias_set=
  1310. ac_cv_env_host_alias_value=
  1311. ac_cv_env_target_alias_set=
  1312. ac_cv_env_target_alias_value=
  1313. ac_cv_header_inttypes_h=yes
  1314. ac_cv_header_memory_h=yes
  1315. ac_cv_header_stdc=yes
  1316. ac_cv_header_stdint_h=yes
  1317. ac_cv_header_stdio_h=yes
  1318. ac_cv_header_stdlib_h=yes
  1319. ac_cv_header_string_h=yes
  1320. ac_cv_header_strings_h=yes
  1321. ac_cv_header_sys_stat_h=yes
  1322. ac_cv_header_sys_types_h=yes
  1323. ac_cv_header_unistd_h=yes
  1324. ac_cv_host=x86_64-apple-darwin12.4.0
  1325. ac_cv_lib_boost_chrono_mt___exit=yes
  1326. ac_cv_lib_boost_filesystem_mt___exit=yes
  1327. ac_cv_lib_boost_program_options_mt___exit=yes
  1328. ac_cv_lib_boost_system_mt___exit=yes
  1329. ac_cv_lib_boost_thread_mt___exit=yes
  1330. ac_cv_lib_db_cxx_4_8___main=yes
  1331. ac_cv_lib_miniupnpc_main=yes
  1332. ac_cv_objc_compiler_gnu=yes
  1333. ac_cv_objcxx_compiler_gnu=yes
  1334. ac_cv_objext=o
  1335. ac_cv_path_EGREP='/usr/bin/grep -E'
  1336. ac_cv_path_GIT=/usr/bin/git
  1337. ac_cv_path_GREP=/usr/bin/grep
  1338. ac_cv_path_JAVA=/usr/bin/java
  1339. ac_cv_path_LRELEASE=/opt/local/bin/lrelease
  1340. ac_cv_path_LUPDATE=/opt/local/bin/lupdate
  1341. ac_cv_path_MOC=/opt/local/bin/moc
  1342. ac_cv_path_PROTOC=/opt/local/bin/protoc
  1343. ac_cv_path_RCC=/opt/local/bin/rcc
  1344. ac_cv_path_SED=/usr/bin/sed
  1345. ac_cv_path_UIC=/opt/local/bin/uic
  1346. ac_cv_path_XGETTEXT=/opt/local/bin/xgettext
  1347. ac_cv_path_ac_pt_AR=/opt/local/bin/ar
  1348. ac_cv_path_ac_pt_GCOV=/usr/bin/gcov
  1349. ac_cv_path_ac_pt_PKG_CONFIG=/opt/local/bin/pkg-config
  1350. ac_cv_path_ac_pt_RANLIB=/opt/local/bin/ranlib
  1351. ac_cv_path_ac_pt_STRIP=/opt/local/bin/strip
  1352. ac_cv_path_install='/usr/bin/install -c'
  1353. ac_cv_prog_AWK=awk
  1354. ac_cv_prog_CPP='gcc -E'
  1355. ac_cv_prog_CXXCPP='g++ -E'
  1356. ac_cv_prog_PORT=port
  1357. ac_cv_prog_ac_ct_CC=gcc
  1358. ac_cv_prog_ac_ct_CXX=g++
  1359. ac_cv_prog_ac_ct_OBJC=gcc
  1360. ac_cv_prog_ac_ct_OBJCXX=g++
  1361. ac_cv_prog_cc_c89=
  1362. ac_cv_prog_cc_g=yes
  1363. ac_cv_prog_cxx_g=yes
  1364. ac_cv_prog_make_make_set=yes
  1365. ac_cv_prog_objc_g=yes
  1366. ac_cv_prog_objcxx_g=yes
  1367. ac_cv_sys_file_offset_bits=no
  1368. ac_cv_sys_largefile_CC=no
  1369. am_cv_CC_dependencies_compiler_type=gcc3
  1370. am_cv_CXX_dependencies_compiler_type=gcc3
  1371. am_cv_OBJCXX_dependencies_compiler_type=gcc3
  1372. am_cv_OBJC_dependencies_compiler_type=gcc3
  1373. am_cv_make_support_nested_variables=yes
  1374. ax_cv_PTHREAD_PRIO_INHERIT=yes
  1375. ax_cv_boost_chrono=yes
  1376. ax_cv_boost_filesystem=yes
  1377. ax_cv_boost_program_options=yes
  1378. ax_cv_boost_system=yes
  1379. ax_cv_boost_thread=yes
  1380. ax_cv_check_cxxcppflags___D_FORTIFY_SOURCE_2=yes
  1381. ax_cv_check_cxxflags___Wstack_protector=yes
  1382. ax_cv_check_cxxflags___arch_i386=yes
  1383. ax_cv_check_cxxflags___fPIE=yes
  1384. ax_cv_check_cxxflags___fno_stack_protector=yes
  1385. ax_cv_check_cxxflags___fstack_protector_all=yes
  1386. ax_cv_check_cxxflags___mmacosx_version_min_10_5=yes
  1387. ax_cv_check_ldflags___Wl___dynamicbase=no
  1388. ax_cv_check_ldflags___Wl___large_address_aware=no
  1389. ax_cv_check_ldflags___Wl___nxcompat=no
  1390. ax_cv_check_ldflags___Wl__dead_strip=yes
  1391. ax_cv_check_ldflags___Wl__z_now=no
  1392. ax_cv_check_ldflags___Wl__z_relro=no
  1393. ax_cv_check_ldflags___pie=yes
  1394.  
  1395. ## ----------------- ##
  1396. ## Output variables. ##
  1397. ## ----------------- ##
  1398.  
  1399. ACLOCAL='${SHELL} /Users/jonasschnelli/Documents/bitcoin/bitcoin3/src/build-aux/missing aclocal-1.13'
  1400. AMDEPBACKSLASH='\'
  1401. AMDEP_FALSE='#'
  1402. AMDEP_TRUE=''
  1403. AMTAR='$${TAR-tar}'
  1404. AM_BACKSLASH='\'
  1405. AM_DEFAULT_V='$(AM_DEFAULT_VERBOSITY)'
  1406. AM_DEFAULT_VERBOSITY='0'
  1407. AM_V='$(V)'
  1408. AR='/opt/local/bin/ar'
  1409. AUTOCONF='${SHELL} /Users/jonasschnelli/Documents/bitcoin/bitcoin3/src/build-aux/missing autoconf'
  1410. AUTOHEADER='${SHELL} /Users/jonasschnelli/Documents/bitcoin/bitcoin3/src/build-aux/missing autoheader'
  1411. AUTOMAKE='${SHELL} /Users/jonasschnelli/Documents/bitcoin/bitcoin3/src/build-aux/missing automake-1.13'
  1412. AWK='awk'
  1413. BDB_CPPFLAGS=' -I'
  1414. BDB_LIBS='-ldb_cxx-4.8'
  1415. BOOST_CHRONO_LIB='-lboost_chrono-mt'
  1416. BOOST_CPPFLAGS='-I/opt/local/include'
  1417. BOOST_FILESYSTEM_LIB='-lboost_filesystem-mt'
  1418. BOOST_LDFLAGS='-L/opt/local/lib'
  1419. BOOST_LIBS='-L/opt/local/lib -lboost_system-mt -lboost_filesystem-mt -lboost_program_options-mt -lboost_thread-mt'
  1420. BOOST_PROGRAM_OPTIONS_LIB='-lboost_program_options-mt'
  1421. BOOST_SYSTEM_LIB='-lboost_system-mt'
  1422. BOOST_THREAD_LIB='-lboost_thread-mt'
  1423. BOOST_UNIT_TEST_FRAMEWORK_LIB=''
  1424. BREW=''
  1425. BUILD_QT=''
  1426. BUILD_TEST=''
  1427. BUILD_TEST_QT=''
  1428. CC='gcc'
  1429. CCACHE=''
  1430. CCDEPMODE='depmode=gcc3'
  1431. CFLAGS=''
  1432. CLIENT_VERSION_BUILD=''
  1433. CLIENT_VERSION_IS_RELEASE=''
  1434. CLIENT_VERSION_MAJOR=''
  1435. CLIENT_VERSION_MINOR=''
  1436. CLIENT_VERSION_REVISION=''
  1437. COPYRIGHT_YEAR=''
  1438. CPP='gcc -E'
  1439. CPPFLAGS=' -DBOOST_SPIRIT_THREADSAFE -DHAVE_BUILD_INFO -I/opt/local/include -I/opt/local/include/db48 -DMAC_OSX -D_FORTIFY_SOURCE=2'
  1440. CRYPTO_CFLAGS=''
  1441. CRYPTO_LIBS=''
  1442. CXX='g++'
  1443. CXXCPP='g++ -E'
  1444. CXXDEPMODE='depmode=gcc3'
  1445. CXXFLAGS='-O2 -mmacosx-version-min=10.5 -arch i386 -O3 -Wall -Wextra -Wformat -Wformat-security -Wno-unused-parameter -Wstack-protector -fPIE -fno-stack-protector -fstack-protector-all'
  1446. CYGPATH_W='echo'
  1447. DEFS=''
  1448. DEPDIR='.deps'
  1449. ECHO_C='\c'
  1450. ECHO_N=''
  1451. ECHO_T=''
  1452. EGREP='/usr/bin/grep -E'
  1453. EXEEXT=''
  1454. GCOV='/usr/bin/gcov'
  1455. GENHTML=''
  1456. GIT='/usr/bin/git'
  1457. GREP='/usr/bin/grep'
  1458. INCLUDES=' -D_THREAD_SAFE -pthread'
  1459. INSTALL_DATA='${INSTALL} -m 644'
  1460. INSTALL_PROGRAM='${INSTALL}'
  1461. INSTALL_SCRIPT='${INSTALL}'
  1462. INSTALL_STRIP_PROGRAM='$(install_sh) -c -s'
  1463. JAVA='/usr/bin/java'
  1464. JAVA_COMPARISON_TOOL=''
  1465. LCOV=''
  1466. LDFLAGS=' -pie -Wl,-dead_strip'
  1467. LEVELDB_TARGET_FLAGS='TARGET_OS=Darwin'
  1468. LIBOBJS=''
  1469. LIBS='-lminiupnpc -L/opt/local/lib -L/opt/local/lib/db48'
  1470. LRELEASE='/opt/local/bin/lrelease'
  1471. LTLIBOBJS=''
  1472. LUPDATE='/opt/local/bin/lupdate'
  1473. MAINT=''
  1474. MAINTAINER_MODE_FALSE='#'
  1475. MAINTAINER_MODE_TRUE=''
  1476. MAKEINFO='${SHELL} /Users/jonasschnelli/Documents/bitcoin/bitcoin3/src/build-aux/missing makeinfo'
  1477. MAKENSIS=''
  1478. MKDIR_P='src/build-aux/install-sh -c -d'
  1479. MOC='/opt/local/bin/moc'
  1480. MOC_DEFS=''
  1481. OBJC='gcc'
  1482. OBJCDEPMODE='depmode=gcc3'
  1483. OBJCFLAGS='-g -O2'
  1484. OBJCXX='g++'
  1485. OBJCXXDEPMODE='depmode=gcc3'
  1486. OBJCXXFLAGS='-O2 -mmacosx-version-min=10.5 -arch i386 -O3 -Wall -Wextra -Wformat -Wformat-security -Wno-unused-parameter -Wstack-protector -fPIE -fno-stack-protector -fstack-protector-all'
  1487. OBJEXT='o'
  1488. PACKAGE='bitcoin'
  1489. PACKAGE_BUGREPORT='[email protected]'
  1490. PACKAGE_NAME='Bitcoin'
  1491. PACKAGE_STRING='Bitcoin 0.8.99'
  1492. PACKAGE_TARNAME='bitcoin'
  1493. PACKAGE_URL=''
  1494. PACKAGE_VERSION='0.8.99'
  1495. PATH_SEPARATOR=':'
  1496. PKG_CONFIG='/opt/local/bin/pkg-config'
  1497. PKG_CONFIG_LIBDIR=''
  1498. PKG_CONFIG_PATH=''
  1499. PORT='port'
  1500. PROTOBUF_CFLAGS=''
  1501. PROTOBUF_LIBS=''
  1502. PROTOC='/opt/local/bin/protoc'
  1503. PTHREAD_CC='gcc'
  1504. PTHREAD_CFLAGS='-D_THREAD_SAFE -pthread'
  1505. PTHREAD_LIBS=''
  1506. QR_CFLAGS=''
  1507. QR_LIBS=''
  1508. QT_CFLAGS=''
  1509. QT_DBUS_CFLAGS=''
  1510. QT_DBUS_INCLUDES=''
  1511. QT_DBUS_LIBS=''
  1512. QT_INCLUDES=''
  1513. QT_LIBS=''
  1514. QT_TEST_CFLAGS=''
  1515. QT_TEST_INCLUDES=''
  1516. QT_TEST_LIBS=''
  1517. RANLIB='/opt/local/bin/ranlib'
  1518. RCC='/opt/local/bin/rcc'
  1519. SED='/usr/bin/sed'
  1520. SET_MAKE=''
  1521. SHELL='/bin/sh'
  1522. SSL_CFLAGS=''
  1523. SSL_LIBS=''
  1524. STRIP='/opt/local/bin/strip'
  1525. TARGET_DARWIN_FALSE=''
  1526. TARGET_DARWIN_TRUE=''
  1527. TARGET_WINDOWS_FALSE=''
  1528. TARGET_WINDOWS_TRUE=''
  1529. TESTDEFS='-DBOOST_TEST_DYN_LINK'
  1530. UIC='/opt/local/bin/uic'
  1531. USE_COMPARISON_TOOL_FALSE=''
  1532. USE_COMPARISON_TOOL_TRUE=''
  1533. USE_IPV6=''
  1534. USE_LCOV_FALSE=''
  1535. USE_LCOV_TRUE=''
  1536. USE_QRCODE=''
  1537. USE_QRCODE_FALSE=''
  1538. USE_QRCODE_TRUE=''
  1539. USE_UPNP=''
  1540. VERSION='0.8.99'
  1541. WINDRES=''
  1542. XGETTEXT='/opt/local/bin/xgettext'
  1543. ac_ct_CC='gcc'
  1544. ac_ct_CXX='g++'
  1545. ac_ct_OBJC='gcc'
  1546. ac_ct_OBJCXX='g++'
  1547. am__EXEEXT_FALSE=''
  1548. am__EXEEXT_TRUE=''
  1549. am__fastdepCC_FALSE='#'
  1550. am__fastdepCC_TRUE=''
  1551. am__fastdepCXX_FALSE='#'
  1552. am__fastdepCXX_TRUE=''
  1553. am__fastdepOBJCXX_FALSE='#'
  1554. am__fastdepOBJCXX_TRUE=''
  1555. am__fastdepOBJC_FALSE='#'
  1556. am__fastdepOBJC_TRUE=''
  1557. am__include='include'
  1558. am__isrc=''
  1559. am__leading_dot='.'
  1560. am__nodep='_no'
  1561. am__quote=''
  1562. am__tar='$${TAR-tar} chof - "$$tardir"'
  1563. am__untar='$${TAR-tar} xf -'
  1564. ax_pthread_config=''
  1565. bindir='${exec_prefix}/bin'
  1566. build='x86_64-apple-darwin12.4.0'
  1567. build_alias=''
  1568. build_cpu='x86_64'
  1569. build_os='darwin12.4.0'
  1570. build_vendor='apple'
  1571. datadir='${datarootdir}'
  1572. datarootdir='${prefix}/share'
  1573. docdir='${datarootdir}/doc/${PACKAGE_TARNAME}'
  1574. dvidir='${docdir}'
  1575. exec_prefix='NONE'
  1576. host='x86_64-apple-darwin12.4.0'
  1577. host_alias=''
  1578. host_cpu='x86_64'
  1579. host_os='darwin12.4.0'
  1580. host_vendor='apple'
  1581. htmldir='${docdir}'
  1582. includedir='${prefix}/include'
  1583. infodir='${datarootdir}/info'
  1584. install_sh='${SHELL} /Users/jonasschnelli/Documents/bitcoin/bitcoin3/src/build-aux/install-sh'
  1585. libdir='/opt/local/lib'
  1586. libexecdir='${exec_prefix}/libexec'
  1587. localedir='${datarootdir}/locale'
  1588. localstatedir='${prefix}/var'
  1589. mandir='${datarootdir}/man'
  1590. mkdir_p='$(MKDIR_P)'
  1591. oldincludedir='/usr/include'
  1592. pdfdir='${docdir}'
  1593. prefix='NONE'
  1594. program_transform_name='s,x,x,'
  1595. psdir='${docdir}'
  1596. sbindir='${exec_prefix}/sbin'
  1597. sharedstatedir='${prefix}/com'
  1598. sysconfdir='${prefix}/etc'
  1599. target_alias=''
  1600.  
  1601. ## ----------- ##
  1602. ## confdefs.h. ##
  1603. ## ----------- ##
  1604.  
  1605. /* confdefs.h */
  1606. #define PACKAGE_NAME "Bitcoin"
  1607. #define PACKAGE_TARNAME "bitcoin"
  1608. #define PACKAGE_VERSION "0.8.99"
  1609. #define PACKAGE_STRING "Bitcoin 0.8.99"
  1610. #define PACKAGE_BUGREPORT "[email protected]"
  1611. #define PACKAGE_URL ""
  1612. #define STDC_HEADERS 1
  1613. #define HAVE_SYS_TYPES_H 1
  1614. #define HAVE_SYS_STAT_H 1
  1615. #define HAVE_STDLIB_H 1
  1616. #define HAVE_STRING_H 1
  1617. #define HAVE_MEMORY_H 1
  1618. #define HAVE_STRINGS_H 1
  1619. #define HAVE_INTTYPES_H 1
  1620. #define HAVE_STDINT_H 1
  1621. #define HAVE_UNISTD_H 1
  1622. #define HAVE_PTHREAD_PRIO_INHERIT 1
  1623. #define HAVE_PTHREAD 1
  1624. #define HAVE_STDIO_H 1
  1625. #define HAVE_STDLIB_H 1
  1626. #define HAVE_UNISTD_H 1
  1627. #define HAVE_STRINGS_H 1
  1628. #define HAVE_SYS_TYPES_H 1
  1629. #define HAVE_SYS_STAT_H 1
  1630. #define HAVE_LIBMINIUPNPC 1
  1631. #define HAVE_BOOST /**/
  1632. #define HAVE_BOOST_SYSTEM /**/
  1633. #define HAVE_BOOST_FILESYSTEM /**/
  1634. #define HAVE_BOOST_PROGRAM_OPTIONS /**/
  1635. #define HAVE_BOOST_THREAD /**/
  1636. #define HAVE_BOOST_CHRONO /**/
  1637.  
  1638. configure: exit 1
Advertisement
Add Comment
Please, Sign In to add comment