SHARE
TWEET

Untitled

a guest May 9th, 2012 79 Never
  1.   CC       caja-zoom-control.o
  2.   CCLD     caja
  3. /usr/bin/ld: ../libcaja-private/.libs/libcaja-private.a(caja-module.o): undefined reference to symbol 'g_module_symbol'
  4. /usr/bin/ld: note: 'g_module_symbol' is defined in DSO /usr/lib/libgmodule-2.0.so.0 so try adding it to the linker command line
  5. /usr/lib/libgmodule-2.0.so.0: could not read symbols: Invalid operation
  6. collect2: error: ld returned 1 exit status
  7. make[4]: *** [caja] Error 1
  8. make[4]: Leaving directory `/home/nikos/AUR/mate-file-manager/src/mate-file-manager-build/src'
  9. make[3]: *** [all-recursive] Error 1
  10. make[3]: Leaving directory `/home/nikos/AUR/mate-file-manager/src/mate-file-manager-build/src'
  11. make[2]: *** [all] Error 2
  12. make[2]: Leaving directory `/home/nikos/AUR/mate-file-manager/src/mate-file-manager-build/src'
  13. make[1]: *** [all-recursive] Error 1
  14. make[1]: Leaving directory `/home/nikos/AUR/mate-file-manager/src/mate-file-manager-build'
  15. make: *** [all] Error 2
RAW Paste Data
Top