Guest User

Untitled

a guest
Jan 30th, 2017
321
0
Never
Not a member of Pastebin yet? Sign Up, it unlocks many cool features!
text 58.00 KB | None | 0 0
  1. Error: Unresolved reference. None of the following candidates is applicable because of receiver type mismatch:
  2. @InlineOnly public inline fun <T> Array<out ???>.isEmpty(): Boolean defined in kotlin.collections
  3. @InlineOnly public inline fun BooleanArray.isEmpty(): Boolean defined in kotlin.collections
  4. @InlineOnly public inline fun ByteArray.isEmpty(): Boolean defined in kotlin.collections
  5. @InlineOnly public inline fun CharArray.isEmpty(): Boolean defined in kotlin.collections
  6. @InlineOnly public inline fun CharSequence.isEmpty(): Boolean defined in kotlin.text
  7. @InlineOnly public inline fun DoubleArray.isEmpty(): Boolean defined in kotlin.collections
  8. @InlineOnly public inline fun FloatArray.isEmpty(): Boolean defined in kotlin.collections
  9. @InlineOnly public inline fun IntArray.isEmpty(): Boolean defined in kotlin.collections
  10. @InlineOnly public inline fun LongArray.isEmpty(): Boolean defined in kotlin.collections
  11. @InlineOnly public inline fun ShortArray.isEmpty(): Boolean defined in kotlin.collections (/home/bartosz/Desktop/dev/java/Minecraft/CubicChunks/CubicChunks/build.gradle.kts (331:46))
  12. Error: Type mismatch: inferred type is Any? but String! was expected (/home/bartosz/Desktop/dev/java/Minecraft/CubicChunks/CubicChunks/build.gradle.kts (331:82))
  13. Error: org.jetbrains.kotlin.codegen.CompilationException: Back-end (JVM) Internal error: No resolved call for 'isEmpty()' at (331,46) in /home/bartosz/Desktop/dev/java/Minecraft/CubicChunks/CubicChunks/build.gradle.kts
  14. Cause: No resolved call for 'isEmpty()' at (331,46) in /home/bartosz/Desktop/dev/java/Minecraft/CubicChunks/CubicChunks/build.gradle.kts
  15. File being compiled and position: (331,46) in /home/bartosz/Desktop/dev/java/Minecraft/CubicChunks/CubicChunks/build.gradle.kts
  16. PsiElement: isEmpty()
  17. The root cause was thrown at: callUtil.kt:187
  18. at org.jetbrains.kotlin.codegen.ExpressionCodegen.genQualified(ExpressionCodegen.java:350)
  19. at org.jetbrains.kotlin.codegen.ExpressionCodegen.genQualified(ExpressionCodegen.java:313)
  20. at org.jetbrains.kotlin.codegen.ExpressionCodegen.visitDotQualifiedExpression(ExpressionCodegen.java:3354)
  21. at org.jetbrains.kotlin.codegen.ExpressionCodegen.visitDotQualifiedExpression(ExpressionCodegen.java:121)
  22. at org.jetbrains.kotlin.psi.KtDotQualifiedExpression.accept(KtDotQualifiedExpression.kt:31)
  23. at org.jetbrains.kotlin.codegen.ExpressionCodegen.genQualified(ExpressionCodegen.java:331)
  24. at org.jetbrains.kotlin.codegen.ExpressionCodegen.genQualified(ExpressionCodegen.java:313)
  25. at org.jetbrains.kotlin.codegen.ExpressionCodegen.gen(ExpressionCodegen.java:356)
  26. at org.jetbrains.kotlin.codegen.ExpressionCodegen.generateIfExpression(ExpressionCodegen.java:501)
  27. at org.jetbrains.kotlin.codegen.ExpressionCodegen.visitIfExpression(ExpressionCodegen.java:496)
  28. at org.jetbrains.kotlin.codegen.ExpressionCodegen.visitIfExpression(ExpressionCodegen.java:121)
  29. at org.jetbrains.kotlin.psi.KtIfExpression.accept(KtIfExpression.java:33)
  30. at org.jetbrains.kotlin.codegen.ExpressionCodegen.genQualified(ExpressionCodegen.java:331)
  31. at org.jetbrains.kotlin.codegen.ExpressionCodegen.genQualified(ExpressionCodegen.java:313)
  32. at org.jetbrains.kotlin.codegen.ExpressionCodegen.gen(ExpressionCodegen.java:356)
  33. at org.jetbrains.kotlin.codegen.ExpressionCodegen.visitProperty(ExpressionCodegen.java:3894)
  34. at org.jetbrains.kotlin.codegen.ExpressionCodegen.visitProperty(ExpressionCodegen.java:121)
  35. at org.jetbrains.kotlin.psi.KtProperty.accept(KtProperty.java:57)
  36. at org.jetbrains.kotlin.codegen.CodegenStatementVisitor.visitKtElement(CodegenStatementVisitor.java:31)
  37. at org.jetbrains.kotlin.codegen.CodegenStatementVisitor.visitKtElement(CodegenStatementVisitor.java:22)
  38. at org.jetbrains.kotlin.psi.KtVisitor.visitExpression(KtVisitor.java:178)
  39. at org.jetbrains.kotlin.psi.KtVisitor.visitDeclaration(KtVisitor.java:29)
  40. at org.jetbrains.kotlin.psi.KtVisitor.visitNamedDeclaration(KtVisitor.java:390)
  41. at org.jetbrains.kotlin.psi.KtVisitor.visitProperty(KtVisitor.java:57)
  42. at org.jetbrains.kotlin.psi.KtProperty.accept(KtProperty.java:57)
  43. at org.jetbrains.kotlin.codegen.ExpressionCodegen.genQualified(ExpressionCodegen.java:331)
  44. at org.jetbrains.kotlin.codegen.ExpressionCodegen.genStatement(ExpressionCodegen.java:394)
  45. at org.jetbrains.kotlin.codegen.ExpressionCodegen.generateBlock(ExpressionCodegen.java:1840)
  46. at org.jetbrains.kotlin.codegen.ExpressionCodegen.generateBlock(ExpressionCodegen.java:1790)
  47. at org.jetbrains.kotlin.codegen.CodegenStatementVisitor.visitBlockExpression(CodegenStatementVisitor.java:56)
  48. at org.jetbrains.kotlin.codegen.CodegenStatementVisitor.visitBlockExpression(CodegenStatementVisitor.java:22)
  49. at org.jetbrains.kotlin.psi.KtBlockExpression.accept(KtBlockExpression.java:44)
  50. at org.jetbrains.kotlin.codegen.ExpressionCodegen.genQualified(ExpressionCodegen.java:331)
  51. at org.jetbrains.kotlin.codegen.ExpressionCodegen.genStatement(ExpressionCodegen.java:394)
  52. at org.jetbrains.kotlin.codegen.ExpressionCodegen.gen(ExpressionCodegen.java:360)
  53. at org.jetbrains.kotlin.codegen.ExpressionCodegen.returnExpression(ExpressionCodegen.java:2253)
  54. at org.jetbrains.kotlin.codegen.FunctionGenerationStrategy$FunctionDefault.doGenerateBody(FunctionGenerationStrategy.java:49)
  55. at org.jetbrains.kotlin.codegen.FunctionGenerationStrategy$CodegenBased.generateBody(FunctionGenerationStrategy.java:69)
  56. at org.jetbrains.kotlin.codegen.FunctionCodegen.generateMethodBody(FunctionCodegen.java:458)
  57. at org.jetbrains.kotlin.codegen.FunctionCodegen.generateMethod(FunctionCodegen.java:232)
  58. at org.jetbrains.kotlin.codegen.FunctionCodegen.generateMethod(FunctionCodegen.java:157)
  59. at org.jetbrains.kotlin.codegen.FunctionCodegen.gen(FunctionCodegen.java:132)
  60. at org.jetbrains.kotlin.codegen.MemberCodegen.genSimpleMember(MemberCodegen.java:190)
  61. at org.jetbrains.kotlin.codegen.ScriptCodegen.genMembers(ScriptCodegen.java:229)
  62. at org.jetbrains.kotlin.codegen.ScriptCodegen.generateBody(ScriptCodegen.java:100)
  63. at org.jetbrains.kotlin.codegen.MemberCodegen.generate(MemberCodegen.java:127)
  64. at org.jetbrains.kotlin.codegen.PackageCodegenImpl.generateFile(PackageCodegenImpl.java:119)
  65. at org.jetbrains.kotlin.codegen.PackageCodegenImpl.generate(PackageCodegenImpl.java:65)
  66. at org.jetbrains.kotlin.codegen.KotlinCodegenFacade.generatePackage(KotlinCodegenFacade.java:99)
  67. at org.jetbrains.kotlin.codegen.KotlinCodegenFacade.doGenerateFiles(KotlinCodegenFacade.java:77)
  68. at org.jetbrains.kotlin.codegen.KotlinCodegenFacade.compileCorrectFiles(KotlinCodegenFacade.java:44)
  69. at org.jetbrains.kotlin.cli.jvm.compiler.KotlinToJVMBytecodeCompiler.generate(KotlinToJVMBytecodeCompiler.kt:417)
  70. at org.jetbrains.kotlin.cli.jvm.compiler.KotlinToJVMBytecodeCompiler.analyzeAndGenerate(KotlinToJVMBytecodeCompiler.kt:328)
  71. at org.jetbrains.kotlin.cli.jvm.compiler.KotlinToJVMBytecodeCompiler.compileScript(KotlinToJVMBytecodeCompiler.kt:532)
  72. at org.gradle.script.lang.kotlin.support.KotlinCompilerKt.compileKotlinScriptToDirectory(KotlinCompiler.kt:70)
  73. at org.gradle.script.lang.kotlin.provider.CachingKotlinCompiler$compileTo$1.invoke(CachingKotlinCompiler.kt:134)
  74. at org.gradle.script.lang.kotlin.provider.CachingKotlinCompiler$compileTo$1.invoke(CachingKotlinCompiler.kt:45)
  75. at org.gradle.script.lang.kotlin.provider.CachingKotlinCompiler.withProgressLoggingFor(CachingKotlinCompiler.kt:185)
  76. at org.gradle.script.lang.kotlin.provider.CachingKotlinCompiler.compileTo(CachingKotlinCompiler.kt:132)
  77. at org.gradle.script.lang.kotlin.provider.CachingKotlinCompiler.access$compileTo(CachingKotlinCompiler.kt:45)
  78. at org.gradle.script.lang.kotlin.provider.CachingKotlinCompiler$compileWithCache$cacheDir$2.execute(CachingKotlinCompiler.kt:114)
  79. at org.gradle.script.lang.kotlin.provider.CachingKotlinCompiler$compileWithCache$cacheDir$2.execute(CachingKotlinCompiler.kt:45)
  80. at org.gradle.cache.internal.DefaultPersistentDirectoryCache$Initializer.initialize(DefaultPersistentDirectoryCache.java:92)
  81. at org.gradle.cache.internal.FixedSharedModeCrossProcessCacheAccess$1.run(FixedSharedModeCrossProcessCacheAccess.java:73)
  82. at org.gradle.cache.internal.DefaultFileLockManager$DefaultFileLock.doWriteAction(DefaultFileLockManager.java:184)
  83. at org.gradle.cache.internal.DefaultFileLockManager$DefaultFileLock.writeFile(DefaultFileLockManager.java:174)
  84. at org.gradle.cache.internal.FixedSharedModeCrossProcessCacheAccess.open(FixedSharedModeCrossProcessCacheAccess.java:71)
  85. at org.gradle.cache.internal.DefaultCacheAccess.open(DefaultCacheAccess.java:130)
  86. at org.gradle.cache.internal.DefaultPersistentDirectoryStore.open(DefaultPersistentDirectoryStore.java:55)
  87. at org.gradle.cache.internal.DefaultPersistentDirectoryStore.open(DefaultPersistentDirectoryStore.java:30)
  88. at org.gradle.cache.internal.DefaultCacheFactory.doOpen(DefaultCacheFactory.java:89)
  89. at org.gradle.cache.internal.DefaultCacheFactory.open(DefaultCacheFactory.java:63)
  90. at org.gradle.cache.internal.DefaultCacheRepository$PersistentCacheBuilder.open(DefaultCacheRepository.java:116)
  91. at org.gradle.script.lang.kotlin.provider.CachingKotlinCompiler.compileWithCache(CachingKotlinCompiler.kt:116)
  92. at org.gradle.script.lang.kotlin.provider.CachingKotlinCompiler.compileBuildScript(CachingKotlinCompiler.kt:92)
  93. at org.gradle.script.lang.kotlin.provider.KotlinBuildScriptCompiler.compileScriptFile(KotlinBuildScriptCompiler.kt:195)
  94. at org.gradle.script.lang.kotlin.provider.KotlinBuildScriptCompiler.executeScriptBodyOn(KotlinBuildScriptCompiler.kt:107)
  95. at org.gradle.script.lang.kotlin.provider.KotlinBuildScriptCompiler.access$executeScriptBodyOn(KotlinBuildScriptCompiler.kt:44)
  96. at org.gradle.script.lang.kotlin.provider.KotlinBuildScriptCompiler$compileTopLevelScript$1.invoke(KotlinBuildScriptCompiler.kt:92)
  97. at org.gradle.script.lang.kotlin.provider.KotlinBuildScriptCompiler$compileTopLevelScript$1.invoke(KotlinBuildScriptCompiler.kt:44)
  98. at org.gradle.script.lang.kotlin.provider.KotlinScriptPlugin.apply(KotlinScriptPlugin.kt:42)
  99. at org.gradle.configuration.project.BuildScriptProcessor.execute(BuildScriptProcessor.java:39)
  100. at org.gradle.configuration.project.BuildScriptProcessor.execute(BuildScriptProcessor.java:26)
  101. at org.gradle.configuration.project.ConfigureActionsProjectEvaluator.evaluate(ConfigureActionsProjectEvaluator.java:34)
  102. at org.gradle.configuration.project.LifecycleProjectEvaluator.doConfigure(LifecycleProjectEvaluator.java:70)
  103. at org.gradle.configuration.project.LifecycleProjectEvaluator.access$000(LifecycleProjectEvaluator.java:33)
  104. at org.gradle.configuration.project.LifecycleProjectEvaluator$1.execute(LifecycleProjectEvaluator.java:53)
  105. at org.gradle.configuration.project.LifecycleProjectEvaluator$1.execute(LifecycleProjectEvaluator.java:50)
  106. at org.gradle.internal.Transformers$4.transform(Transformers.java:169)
  107. at org.gradle.internal.progress.DefaultBuildOperationExecutor.run(DefaultBuildOperationExecutor.java:106)
  108. at org.gradle.internal.progress.DefaultBuildOperationExecutor.run(DefaultBuildOperationExecutor.java:61)
  109. at org.gradle.configuration.project.LifecycleProjectEvaluator.evaluate(LifecycleProjectEvaluator.java:50)
  110. at org.gradle.api.internal.project.DefaultProject.evaluate(DefaultProject.java:599)
  111. at org.gradle.api.internal.project.DefaultProject.evaluate(DefaultProject.java:125)
  112. at org.gradle.execution.TaskPathProjectEvaluator.configure(TaskPathProjectEvaluator.java:35)
  113. at org.gradle.execution.TaskPathProjectEvaluator.configureHierarchy(TaskPathProjectEvaluator.java:60)
  114. at org.gradle.configuration.DefaultBuildConfigurer.configure(DefaultBuildConfigurer.java:38)
  115. at org.gradle.initialization.DefaultGradleLauncher$ConfigureBuildAction.execute(DefaultGradleLauncher.java:233)
  116. at org.gradle.initialization.DefaultGradleLauncher$ConfigureBuildAction.execute(DefaultGradleLauncher.java:230)
  117. at org.gradle.internal.Transformers$4.transform(Transformers.java:169)
  118. at org.gradle.internal.progress.DefaultBuildOperationExecutor.run(DefaultBuildOperationExecutor.java:106)
  119. at org.gradle.internal.progress.DefaultBuildOperationExecutor.run(DefaultBuildOperationExecutor.java:56)
  120. at org.gradle.initialization.DefaultGradleLauncher.doBuildStages(DefaultGradleLauncher.java:160)
  121. at org.gradle.initialization.DefaultGradleLauncher.doBuild(DefaultGradleLauncher.java:119)
  122. at org.gradle.initialization.DefaultGradleLauncher.run(DefaultGradleLauncher.java:102)
  123. at org.gradle.launcher.exec.GradleBuildController.run(GradleBuildController.java:71)
  124. at org.gradle.tooling.internal.provider.ExecuteBuildActionRunner.run(ExecuteBuildActionRunner.java:28)
  125. at org.gradle.launcher.exec.ChainingBuildActionRunner.run(ChainingBuildActionRunner.java:35)
  126. at org.gradle.launcher.exec.InProcessBuildActionExecuter.execute(InProcessBuildActionExecuter.java:41)
  127. at org.gradle.launcher.exec.InProcessBuildActionExecuter.execute(InProcessBuildActionExecuter.java:26)
  128. at org.gradle.tooling.internal.provider.ContinuousBuildActionExecuter.execute(ContinuousBuildActionExecuter.java:75)
  129. at org.gradle.tooling.internal.provider.ContinuousBuildActionExecuter.execute(ContinuousBuildActionExecuter.java:49)
  130. at org.gradle.tooling.internal.provider.ServicesSetupBuildActionExecuter.execute(ServicesSetupBuildActionExecuter.java:49)
  131. at org.gradle.tooling.internal.provider.ServicesSetupBuildActionExecuter.execute(ServicesSetupBuildActionExecuter.java:31)
  132. at org.gradle.launcher.daemon.server.exec.ExecuteBuild.doBuild(ExecuteBuild.java:67)
  133. at org.gradle.launcher.daemon.server.exec.BuildCommandOnly.execute(BuildCommandOnly.java:36)
  134. at org.gradle.launcher.daemon.server.api.DaemonCommandExecution.proceed(DaemonCommandExecution.java:120)
  135. at org.gradle.launcher.daemon.server.exec.WatchForDisconnection.execute(WatchForDisconnection.java:47)
  136. at org.gradle.launcher.daemon.server.api.DaemonCommandExecution.proceed(DaemonCommandExecution.java:120)
  137. at org.gradle.launcher.daemon.server.exec.ResetDeprecationLogger.execute(ResetDeprecationLogger.java:26)
  138. at org.gradle.launcher.daemon.server.api.DaemonCommandExecution.proceed(DaemonCommandExecution.java:120)
  139. at org.gradle.launcher.daemon.server.exec.RequestStopIfSingleUsedDaemon.execute(RequestStopIfSingleUsedDaemon.java:34)
  140. at org.gradle.launcher.daemon.server.api.DaemonCommandExecution.proceed(DaemonCommandExecution.java:120)
  141. at org.gradle.launcher.daemon.server.exec.ForwardClientInput$2.call(ForwardClientInput.java:74)
  142. at org.gradle.launcher.daemon.server.exec.ForwardClientInput$2.call(ForwardClientInput.java:72)
  143. at org.gradle.util.Swapper.swap(Swapper.java:38)
  144. at org.gradle.launcher.daemon.server.exec.ForwardClientInput.execute(ForwardClientInput.java:72)
  145. at org.gradle.launcher.daemon.server.api.DaemonCommandExecution.proceed(DaemonCommandExecution.java:120)
  146. at org.gradle.launcher.daemon.server.exec.LogAndCheckHealth.execute(LogAndCheckHealth.java:50)
  147. at org.gradle.launcher.daemon.server.api.DaemonCommandExecution.proceed(DaemonCommandExecution.java:120)
  148. at org.gradle.launcher.daemon.server.exec.LogToClient.doBuild(LogToClient.java:60)
  149. at org.gradle.launcher.daemon.server.exec.BuildCommandOnly.execute(BuildCommandOnly.java:36)
  150. at org.gradle.launcher.daemon.server.api.DaemonCommandExecution.proceed(DaemonCommandExecution.java:120)
  151. at org.gradle.launcher.daemon.server.exec.EstablishBuildEnvironment.doBuild(EstablishBuildEnvironment.java:72)
  152. at org.gradle.launcher.daemon.server.exec.BuildCommandOnly.execute(BuildCommandOnly.java:36)
  153. at org.gradle.launcher.daemon.server.api.DaemonCommandExecution.proceed(DaemonCommandExecution.java:120)
  154. at org.gradle.launcher.daemon.server.exec.StartBuildOrRespondWithBusy$1.run(StartBuildOrRespondWithBusy.java:50)
  155. at org.gradle.launcher.daemon.server.DaemonStateCoordinator$1.run(DaemonStateCoordinator.java:297)
  156. at org.gradle.internal.concurrent.ExecutorPolicy$CatchAndRecordFailures.onExecute(ExecutorPolicy.java:63)
  157. at org.gradle.internal.concurrent.StoppableExecutorImpl$1.run(StoppableExecutorImpl.java:46)
  158. at java.util.concurrent.ThreadPoolExecutor.runWorker(ThreadPoolExecutor.java:1142)
  159. at java.util.concurrent.ThreadPoolExecutor$Worker.run(ThreadPoolExecutor.java:617)
  160. at java.lang.Thread.run(Thread.java:745)
  161. Caused by: java.lang.AssertionError: No resolved call for 'isEmpty()' at (331,46) in /home/bartosz/Desktop/dev/java/Minecraft/CubicChunks/CubicChunks/build.gradle.kts
  162. at org.jetbrains.kotlin.resolve.calls.callUtil.CallUtilKt.getResolvedCallWithAssert(callUtil.kt:187)
  163. at org.jetbrains.kotlin.codegen.ExpressionCodegen.visitCallExpression(ExpressionCodegen.java:2656)
  164. at org.jetbrains.kotlin.codegen.ExpressionCodegen.visitCallExpression(ExpressionCodegen.java:121)
  165. at org.jetbrains.kotlin.psi.KtCallExpression.accept(KtCallExpression.java:35)
  166. at org.jetbrains.kotlin.codegen.ExpressionCodegen.genQualified(ExpressionCodegen.java:331)
  167. ... 142 more
  168. (/home/bartosz/Desktop/dev/java/Minecraft/CubicChunks/CubicChunks/build.gradle.kts (331:46))
  169.  
  170. FAILURE: Build failed with an exception.
  171.  
  172. * What went wrong:
  173. A problem occurred configuring root project 'CubicChunks'.
  174. > Could not open cache directory 54plkzr789iuz7f93gysjukwl (/home/bartosz/.gradle/caches/3.4-20170117200919+0000/gradle-script-kotlin/54plkzr789iuz7f93gysjukwl).
  175. > Internal error: org.jetbrains.kotlin.codegen.CompilationException: Back-end (JVM) Internal error: No resolved call for 'isEmpty()' at (331,46) in /home/bartosz/Desktop/dev/java/Minecraft/CubicChunks/CubicChunks/build.gradle.kts
  176. Cause: No resolved call for 'isEmpty()' at (331,46) in /home/bartosz/Desktop/dev/java/Minecraft/CubicChunks/CubicChunks/build.gradle.kts
  177. File being compiled and position: (331,46) in /home/bartosz/Desktop/dev/java/Minecraft/CubicChunks/CubicChunks/build.gradle.kts
  178. PsiElement: isEmpty()
  179. The root cause was thrown at: callUtil.kt:187
  180. at org.jetbrains.kotlin.codegen.ExpressionCodegen.genQualified(ExpressionCodegen.java:350)
  181. at org.jetbrains.kotlin.codegen.ExpressionCodegen.genQualified(ExpressionCodegen.java:313)
  182. at org.jetbrains.kotlin.codegen.ExpressionCodegen.visitDotQualifiedExpression(ExpressionCodegen.java:3354)
  183. at org.jetbrains.kotlin.codegen.ExpressionCodegen.visitDotQualifiedExpression(ExpressionCodegen.java:121)
  184. at org.jetbrains.kotlin.psi.KtDotQualifiedExpression.accept(KtDotQualifiedExpression.kt:31)
  185. at org.jetbrains.kotlin.codegen.ExpressionCodegen.genQualified(ExpressionCodegen.java:331)
  186. at org.jetbrains.kotlin.codegen.ExpressionCodegen.genQualified(ExpressionCodegen.java:313)
  187. at org.jetbrains.kotlin.codegen.ExpressionCodegen.gen(ExpressionCodegen.java:356)
  188. at org.jetbrains.kotlin.codegen.ExpressionCodegen.generateIfExpression(ExpressionCodegen.java:501)
  189. at org.jetbrains.kotlin.codegen.ExpressionCodegen.visitIfExpression(ExpressionCodegen.java:496)
  190. at org.jetbrains.kotlin.codegen.ExpressionCodegen.visitIfExpression(ExpressionCodegen.java:121)
  191. at org.jetbrains.kotlin.psi.KtIfExpression.accept(KtIfExpression.java:33)
  192. at org.jetbrains.kotlin.codegen.ExpressionCodegen.genQualified(ExpressionCodegen.java:331)
  193. at org.jetbrains.kotlin.codegen.ExpressionCodegen.genQualified(ExpressionCodegen.java:313)
  194. at org.jetbrains.kotlin.codegen.ExpressionCodegen.gen(ExpressionCodegen.java:356)
  195. at org.jetbrains.kotlin.codegen.ExpressionCodegen.visitProperty(ExpressionCodegen.java:3894)
  196. at org.jetbrains.kotlin.codegen.ExpressionCodegen.visitProperty(ExpressionCodegen.java:121)
  197. at org.jetbrains.kotlin.psi.KtProperty.accept(KtProperty.java:57)
  198. at org.jetbrains.kotlin.codegen.CodegenStatementVisitor.visitKtElement(CodegenStatementVisitor.java:31)
  199. at org.jetbrains.kotlin.codegen.CodegenStatementVisitor.visitKtElement(CodegenStatementVisitor.java:22)
  200. at org.jetbrains.kotlin.psi.KtVisitor.visitExpression(KtVisitor.java:178)
  201. at org.jetbrains.kotlin.psi.KtVisitor.visitDeclaration(KtVisitor.java:29)
  202. at org.jetbrains.kotlin.psi.KtVisitor.visitNamedDeclaration(KtVisitor.java:390)
  203. at org.jetbrains.kotlin.psi.KtVisitor.visitProperty(KtVisitor.java:57)
  204. at org.jetbrains.kotlin.psi.KtProperty.accept(KtProperty.java:57)
  205. at org.jetbrains.kotlin.codegen.ExpressionCodegen.genQualified(ExpressionCodegen.java:331)
  206. at org.jetbrains.kotlin.codegen.ExpressionCodegen.genStatement(ExpressionCodegen.java:394)
  207. at org.jetbrains.kotlin.codegen.ExpressionCodegen.generateBlock(ExpressionCodegen.java:1840)
  208. at org.jetbrains.kotlin.codegen.ExpressionCodegen.generateBlock(ExpressionCodegen.java:1790)
  209. at org.jetbrains.kotlin.codegen.CodegenStatementVisitor.visitBlockExpression(CodegenStatementVisitor.java:56)
  210. at org.jetbrains.kotlin.codegen.CodegenStatementVisitor.visitBlockExpression(CodegenStatementVisitor.java:22)
  211. at org.jetbrains.kotlin.psi.KtBlockExpression.accept(KtBlockExpression.java:44)
  212. at org.jetbrains.kotlin.codegen.ExpressionCodegen.genQualified(ExpressionCodegen.java:331)
  213. at org.jetbrains.kotlin.codegen.ExpressionCodegen.genStatement(ExpressionCodegen.java:394)
  214. at org.jetbrains.kotlin.codegen.ExpressionCodegen.gen(ExpressionCodegen.java:360)
  215. at org.jetbrains.kotlin.codegen.ExpressionCodegen.returnExpression(ExpressionCodegen.java:2253)
  216. at org.jetbrains.kotlin.codegen.FunctionGenerationStrategy$FunctionDefault.doGenerateBody(FunctionGenerationStrategy.java:49)
  217. at org.jetbrains.kotlin.codegen.FunctionGenerationStrategy$CodegenBased.generateBody(FunctionGenerationStrategy.java:69)
  218. at org.jetbrains.kotlin.codegen.FunctionCodegen.generateMethodBody(FunctionCodegen.java:458)
  219. at org.jetbrains.kotlin.codegen.FunctionCodegen.generateMethod(FunctionCodegen.java:232)
  220. at org.jetbrains.kotlin.codegen.FunctionCodegen.generateMethod(FunctionCodegen.java:157)
  221. at org.jetbrains.kotlin.codegen.FunctionCodegen.gen(FunctionCodegen.java:132)
  222. at org.jetbrains.kotlin.codegen.MemberCodegen.genSimpleMember(MemberCodegen.java:190)
  223. at org.jetbrains.kotlin.codegen.ScriptCodegen.genMembers(ScriptCodegen.java:229)
  224. at org.jetbrains.kotlin.codegen.ScriptCodegen.generateBody(ScriptCodegen.java:100)
  225. at org.jetbrains.kotlin.codegen.MemberCodegen.generate(MemberCodegen.java:127)
  226. at org.jetbrains.kotlin.codegen.PackageCodegenImpl.generateFile(PackageCodegenImpl.java:119)
  227. at org.jetbrains.kotlin.codegen.PackageCodegenImpl.generate(PackageCodegenImpl.java:65)
  228. at org.jetbrains.kotlin.codegen.KotlinCodegenFacade.generatePackage(KotlinCodegenFacade.java:99)
  229. at org.jetbrains.kotlin.codegen.KotlinCodegenFacade.doGenerateFiles(KotlinCodegenFacade.java:77)
  230. at org.jetbrains.kotlin.codegen.KotlinCodegenFacade.compileCorrectFiles(KotlinCodegenFacade.java:44)
  231. at org.jetbrains.kotlin.cli.jvm.compiler.KotlinToJVMBytecodeCompiler.generate(KotlinToJVMBytecodeCompiler.kt:417)
  232. at org.jetbrains.kotlin.cli.jvm.compiler.KotlinToJVMBytecodeCompiler.analyzeAndGenerate(KotlinToJVMBytecodeCompiler.kt:328)
  233. at org.jetbrains.kotlin.cli.jvm.compiler.KotlinToJVMBytecodeCompiler.compileScript(KotlinToJVMBytecodeCompiler.kt:532)
  234. at org.gradle.script.lang.kotlin.support.KotlinCompilerKt.compileKotlinScriptToDirectory(KotlinCompiler.kt:70)
  235. at org.gradle.script.lang.kotlin.provider.CachingKotlinCompiler$compileTo$1.invoke(CachingKotlinCompiler.kt:134)
  236. at org.gradle.script.lang.kotlin.provider.CachingKotlinCompiler$compileTo$1.invoke(CachingKotlinCompiler.kt:45)
  237. at org.gradle.script.lang.kotlin.provider.CachingKotlinCompiler.withProgressLoggingFor(CachingKotlinCompiler.kt:185)
  238. at org.gradle.script.lang.kotlin.provider.CachingKotlinCompiler.compileTo(CachingKotlinCompiler.kt:132)
  239. at org.gradle.script.lang.kotlin.provider.CachingKotlinCompiler.access$compileTo(CachingKotlinCompiler.kt:45)
  240. at org.gradle.script.lang.kotlin.provider.CachingKotlinCompiler$compileWithCache$cacheDir$2.execute(CachingKotlinCompiler.kt:114)
  241. at org.gradle.script.lang.kotlin.provider.CachingKotlinCompiler$compileWithCache$cacheDir$2.execute(CachingKotlinCompiler.kt:45)
  242. at org.gradle.cache.internal.DefaultPersistentDirectoryCache$Initializer.initialize(DefaultPersistentDirectoryCache.java:92)
  243. at org.gradle.cache.internal.FixedSharedModeCrossProcessCacheAccess$1.run(FixedSharedModeCrossProcessCacheAccess.java:73)
  244. at org.gradle.cache.internal.DefaultFileLockManager$DefaultFileLock.doWriteAction(DefaultFileLockManager.java:184)
  245. at org.gradle.cache.internal.DefaultFileLockManager$DefaultFileLock.writeFile(DefaultFileLockManager.java:174)
  246. at org.gradle.cache.internal.FixedSharedModeCrossProcessCacheAccess.open(FixedSharedModeCrossProcessCacheAccess.java:71)
  247. at org.gradle.cache.internal.DefaultCacheAccess.open(DefaultCacheAccess.java:130)
  248. at org.gradle.cache.internal.DefaultPersistentDirectoryStore.open(DefaultPersistentDirectoryStore.java:55)
  249. at org.gradle.cache.internal.DefaultPersistentDirectoryStore.open(DefaultPersistentDirectoryStore.java:30)
  250. at org.gradle.cache.internal.DefaultCacheFactory.doOpen(DefaultCacheFactory.java:89)
  251. at org.gradle.cache.internal.DefaultCacheFactory.open(DefaultCacheFactory.java:63)
  252. at org.gradle.cache.internal.DefaultCacheRepository$PersistentCacheBuilder.open(DefaultCacheRepository.java:116)
  253. at org.gradle.script.lang.kotlin.provider.CachingKotlinCompiler.compileWithCache(CachingKotlinCompiler.kt:116)
  254. at org.gradle.script.lang.kotlin.provider.CachingKotlinCompiler.compileBuildScript(CachingKotlinCompiler.kt:92)
  255. at org.gradle.script.lang.kotlin.provider.KotlinBuildScriptCompiler.compileScriptFile(KotlinBuildScriptCompiler.kt:195)
  256. at org.gradle.script.lang.kotlin.provider.KotlinBuildScriptCompiler.executeScriptBodyOn(KotlinBuildScriptCompiler.kt:107)
  257. at org.gradle.script.lang.kotlin.provider.KotlinBuildScriptCompiler.access$executeScriptBodyOn(KotlinBuildScriptCompiler.kt:44)
  258. at org.gradle.script.lang.kotlin.provider.KotlinBuildScriptCompiler$compileTopLevelScript$1.invoke(KotlinBuildScriptCompiler.kt:92)
  259. at org.gradle.script.lang.kotlin.provider.KotlinBuildScriptCompiler$compileTopLevelScript$1.invoke(KotlinBuildScriptCompiler.kt:44)
  260. at org.gradle.script.lang.kotlin.provider.KotlinScriptPlugin.apply(KotlinScriptPlugin.kt:42)
  261. at org.gradle.configuration.project.BuildScriptProcessor.execute(BuildScriptProcessor.java:39)
  262. at org.gradle.configuration.project.BuildScriptProcessor.execute(BuildScriptProcessor.java:26)
  263. at org.gradle.configuration.project.ConfigureActionsProjectEvaluator.evaluate(ConfigureActionsProjectEvaluator.java:34)
  264. at org.gradle.configuration.project.LifecycleProjectEvaluator.doConfigure(LifecycleProjectEvaluator.java:70)
  265. at org.gradle.configuration.project.LifecycleProjectEvaluator.access$000(LifecycleProjectEvaluator.java:33)
  266. at org.gradle.configuration.project.LifecycleProjectEvaluator$1.execute(LifecycleProjectEvaluator.java:53)
  267. at org.gradle.configuration.project.LifecycleProjectEvaluator$1.execute(LifecycleProjectEvaluator.java:50)
  268. at org.gradle.internal.Transformers$4.transform(Transformers.java:169)
  269. at org.gradle.internal.progress.DefaultBuildOperationExecutor.run(DefaultBuildOperationExecutor.java:106)
  270. at org.gradle.internal.progress.DefaultBuildOperationExecutor.run(DefaultBuildOperationExecutor.java:61)
  271. at org.gradle.configuration.project.LifecycleProjectEvaluator.evaluate(LifecycleProjectEvaluator.java:50)
  272. at org.gradle.api.internal.project.DefaultProject.evaluate(DefaultProject.java:599)
  273. at org.gradle.api.internal.project.DefaultProject.evaluate(DefaultProject.java:125)
  274. at org.gradle.execution.TaskPathProjectEvaluator.configure(TaskPathProjectEvaluator.java:35)
  275. at org.gradle.execution.TaskPathProjectEvaluator.configureHierarchy(TaskPathProjectEvaluator.java:60)
  276. at org.gradle.configuration.DefaultBuildConfigurer.configure(DefaultBuildConfigurer.java:38)
  277. at org.gradle.initialization.DefaultGradleLauncher$ConfigureBuildAction.execute(DefaultGradleLauncher.java:233)
  278. at org.gradle.initialization.DefaultGradleLauncher$ConfigureBuildAction.execute(DefaultGradleLauncher.java:230)
  279. at org.gradle.internal.Transformers$4.transform(Transformers.java:169)
  280. at org.gradle.internal.progress.DefaultBuildOperationExecutor.run(DefaultBuildOperationExecutor.java:106)
  281. at org.gradle.internal.progress.DefaultBuildOperationExecutor.run(DefaultBuildOperationExecutor.java:56)
  282. at org.gradle.initialization.DefaultGradleLauncher.doBuildStages(DefaultGradleLauncher.java:160)
  283. at org.gradle.initialization.DefaultGradleLauncher.doBuild(DefaultGradleLauncher.java:119)
  284. at org.gradle.initialization.DefaultGradleLauncher.run(DefaultGradleLauncher.java:102)
  285. at org.gradle.launcher.exec.GradleBuildController.run(GradleBuildController.java:71)
  286. at org.gradle.tooling.internal.provider.ExecuteBuildActionRunner.run(ExecuteBuildActionRunner.java:28)
  287. at org.gradle.launcher.exec.ChainingBuildActionRunner.run(ChainingBuildActionRunner.java:35)
  288. at org.gradle.launcher.exec.InProcessBuildActionExecuter.execute(InProcessBuildActionExecuter.java:41)
  289. at org.gradle.launcher.exec.InProcessBuildActionExecuter.execute(InProcessBuildActionExecuter.java:26)
  290. at org.gradle.tooling.internal.provider.ContinuousBuildActionExecuter.execute(ContinuousBuildActionExecuter.java:75)
  291. at org.gradle.tooling.internal.provider.ContinuousBuildActionExecuter.execute(ContinuousBuildActionExecuter.java:49)
  292. at org.gradle.tooling.internal.provider.ServicesSetupBuildActionExecuter.execute(ServicesSetupBuildActionExecuter.java:49)
  293. at org.gradle.tooling.internal.provider.ServicesSetupBuildActionExecuter.execute(ServicesSetupBuildActionExecuter.java:31)
  294. at org.gradle.launcher.daemon.server.exec.ExecuteBuild.doBuild(ExecuteBuild.java:67)
  295. at org.gradle.launcher.daemon.server.exec.BuildCommandOnly.execute(BuildCommandOnly.java:36)
  296. at org.gradle.launcher.daemon.server.api.DaemonCommandExecution.proceed(DaemonCommandExecution.java:120)
  297. at org.gradle.launcher.daemon.server.exec.WatchForDisconnection.execute(WatchForDisconnection.java:47)
  298. at org.gradle.launcher.daemon.server.api.DaemonCommandExecution.proceed(DaemonCommandExecution.java:120)
  299. at org.gradle.launcher.daemon.server.exec.ResetDeprecationLogger.execute(ResetDeprecationLogger.java:26)
  300. at org.gradle.launcher.daemon.server.api.DaemonCommandExecution.proceed(DaemonCommandExecution.java:120)
  301. at org.gradle.launcher.daemon.server.exec.RequestStopIfSingleUsedDaemon.execute(RequestStopIfSingleUsedDaemon.java:34)
  302. at org.gradle.launcher.daemon.server.api.DaemonCommandExecution.proceed(DaemonCommandExecution.java:120)
  303. at org.gradle.launcher.daemon.server.exec.ForwardClientInput$2.call(ForwardClientInput.java:74)
  304. at org.gradle.launcher.daemon.server.exec.ForwardClientInput$2.call(ForwardClientInput.java:72)
  305. at org.gradle.util.Swapper.swap(Swapper.java:38)
  306. at org.gradle.launcher.daemon.server.exec.ForwardClientInput.execute(ForwardClientInput.java:72)
  307. at org.gradle.launcher.daemon.server.api.DaemonCommandExecution.proceed(DaemonCommandExecution.java:120)
  308. at org.gradle.launcher.daemon.server.exec.LogAndCheckHealth.execute(LogAndCheckHealth.java:50)
  309. at org.gradle.launcher.daemon.server.api.DaemonCommandExecution.proceed(DaemonCommandExecution.java:120)
  310. at org.gradle.launcher.daemon.server.exec.LogToClient.doBuild(LogToClient.java:60)
  311. at org.gradle.launcher.daemon.server.exec.BuildCommandOnly.execute(BuildCommandOnly.java:36)
  312. at org.gradle.launcher.daemon.server.api.DaemonCommandExecution.proceed(DaemonCommandExecution.java:120)
  313. at org.gradle.launcher.daemon.server.exec.EstablishBuildEnvironment.doBuild(EstablishBuildEnvironment.java:72)
  314. at org.gradle.launcher.daemon.server.exec.BuildCommandOnly.execute(BuildCommandOnly.java:36)
  315. at org.gradle.launcher.daemon.server.api.DaemonCommandExecution.proceed(DaemonCommandExecution.java:120)
  316. at org.gradle.launcher.daemon.server.exec.StartBuildOrRespondWithBusy$1.run(StartBuildOrRespondWithBusy.java:50)
  317. at org.gradle.launcher.daemon.server.DaemonStateCoordinator$1.run(DaemonStateCoordinator.java:297)
  318. at org.gradle.internal.concurrent.ExecutorPolicy$CatchAndRecordFailures.onExecute(ExecutorPolicy.java:63)
  319. at org.gradle.internal.concurrent.StoppableExecutorImpl$1.run(StoppableExecutorImpl.java:46)
  320. at java.util.concurrent.ThreadPoolExecutor.runWorker(ThreadPoolExecutor.java:1142)
  321. at java.util.concurrent.ThreadPoolExecutor$Worker.run(ThreadPoolExecutor.java:617)
  322. at java.lang.Thread.run(Thread.java:745)
  323. Caused by: java.lang.AssertionError: No resolved call for 'isEmpty()' at (331,46) in /home/bartosz/Desktop/dev/java/Minecraft/CubicChunks/CubicChunks/build.gradle.kts
  324. at org.jetbrains.kotlin.resolve.calls.callUtil.CallUtilKt.getResolvedCallWithAssert(callUtil.kt:187)
  325. at org.jetbrains.kotlin.codegen.ExpressionCodegen.visitCallExpression(ExpressionCodegen.java:2656)
  326. at org.jetbrains.kotlin.codegen.ExpressionCodegen.visitCallExpression(ExpressionCodegen.java:121)
  327. at org.jetbrains.kotlin.psi.KtCallExpression.accept(KtCallExpression.java:35)
  328. at org.jetbrains.kotlin.codegen.ExpressionCodegen.genQualified(ExpressionCodegen.java:331)
  329. ... 142 more
  330.  
  331.  
  332. * Try:
  333. Run with --info or --debug option to get more log output.
  334.  
  335. * Exception is:
  336. org.gradle.api.ProjectConfigurationException: A problem occurred configuring root project 'CubicChunks'.
  337. at org.gradle.configuration.project.LifecycleProjectEvaluator.addConfigurationFailure(LifecycleProjectEvaluator.java:94)
  338. at org.gradle.configuration.project.LifecycleProjectEvaluator.doConfigure(LifecycleProjectEvaluator.java:72)
  339. at org.gradle.configuration.project.LifecycleProjectEvaluator.access$000(LifecycleProjectEvaluator.java:33)
  340. at org.gradle.configuration.project.LifecycleProjectEvaluator$1.execute(LifecycleProjectEvaluator.java:53)
  341. at org.gradle.configuration.project.LifecycleProjectEvaluator$1.execute(LifecycleProjectEvaluator.java:50)
  342. at org.gradle.internal.Transformers$4.transform(Transformers.java:169)
  343. at org.gradle.internal.progress.DefaultBuildOperationExecutor.run(DefaultBuildOperationExecutor.java:106)
  344. at org.gradle.internal.progress.DefaultBuildOperationExecutor.run(DefaultBuildOperationExecutor.java:61)
  345. at org.gradle.configuration.project.LifecycleProjectEvaluator.evaluate(LifecycleProjectEvaluator.java:50)
  346. at org.gradle.api.internal.project.DefaultProject.evaluate(DefaultProject.java:599)
  347. at org.gradle.api.internal.project.DefaultProject.evaluate(DefaultProject.java:125)
  348. at org.gradle.execution.TaskPathProjectEvaluator.configure(TaskPathProjectEvaluator.java:35)
  349. at org.gradle.execution.TaskPathProjectEvaluator.configureHierarchy(TaskPathProjectEvaluator.java:60)
  350. at org.gradle.configuration.DefaultBuildConfigurer.configure(DefaultBuildConfigurer.java:38)
  351. at org.gradle.initialization.DefaultGradleLauncher$ConfigureBuildAction.execute(DefaultGradleLauncher.java:233)
  352. at org.gradle.initialization.DefaultGradleLauncher$ConfigureBuildAction.execute(DefaultGradleLauncher.java:230)
  353. at org.gradle.internal.Transformers$4.transform(Transformers.java:169)
  354. at org.gradle.internal.progress.DefaultBuildOperationExecutor.run(DefaultBuildOperationExecutor.java:106)
  355. at org.gradle.internal.progress.DefaultBuildOperationExecutor.run(DefaultBuildOperationExecutor.java:56)
  356. at org.gradle.initialization.DefaultGradleLauncher.doBuildStages(DefaultGradleLauncher.java:160)
  357. at org.gradle.initialization.DefaultGradleLauncher.doBuild(DefaultGradleLauncher.java:119)
  358. at org.gradle.initialization.DefaultGradleLauncher.run(DefaultGradleLauncher.java:102)
  359. at org.gradle.launcher.exec.GradleBuildController.run(GradleBuildController.java:71)
  360. at org.gradle.tooling.internal.provider.ExecuteBuildActionRunner.run(ExecuteBuildActionRunner.java:28)
  361. at org.gradle.launcher.exec.ChainingBuildActionRunner.run(ChainingBuildActionRunner.java:35)
  362. at org.gradle.launcher.exec.InProcessBuildActionExecuter.execute(InProcessBuildActionExecuter.java:41)
  363. at org.gradle.launcher.exec.InProcessBuildActionExecuter.execute(InProcessBuildActionExecuter.java:26)
  364. at org.gradle.tooling.internal.provider.ContinuousBuildActionExecuter.execute(ContinuousBuildActionExecuter.java:75)
  365. at org.gradle.tooling.internal.provider.ContinuousBuildActionExecuter.execute(ContinuousBuildActionExecuter.java:49)
  366. at org.gradle.tooling.internal.provider.ServicesSetupBuildActionExecuter.execute(ServicesSetupBuildActionExecuter.java:49)
  367. at org.gradle.tooling.internal.provider.ServicesSetupBuildActionExecuter.execute(ServicesSetupBuildActionExecuter.java:31)
  368. at org.gradle.launcher.daemon.server.exec.ExecuteBuild.doBuild(ExecuteBuild.java:67)
  369. at org.gradle.launcher.daemon.server.exec.BuildCommandOnly.execute(BuildCommandOnly.java:36)
  370. at org.gradle.launcher.daemon.server.api.DaemonCommandExecution.proceed(DaemonCommandExecution.java:120)
  371. at org.gradle.launcher.daemon.server.exec.WatchForDisconnection.execute(WatchForDisconnection.java:47)
  372. at org.gradle.launcher.daemon.server.api.DaemonCommandExecution.proceed(DaemonCommandExecution.java:120)
  373. at org.gradle.launcher.daemon.server.exec.ResetDeprecationLogger.execute(ResetDeprecationLogger.java:26)
  374. at org.gradle.launcher.daemon.server.api.DaemonCommandExecution.proceed(DaemonCommandExecution.java:120)
  375. at org.gradle.launcher.daemon.server.exec.RequestStopIfSingleUsedDaemon.execute(RequestStopIfSingleUsedDaemon.java:34)
  376. at org.gradle.launcher.daemon.server.api.DaemonCommandExecution.proceed(DaemonCommandExecution.java:120)
  377. at org.gradle.launcher.daemon.server.exec.ForwardClientInput$2.call(ForwardClientInput.java:74)
  378. at org.gradle.launcher.daemon.server.exec.ForwardClientInput$2.call(ForwardClientInput.java:72)
  379. at org.gradle.util.Swapper.swap(Swapper.java:38)
  380. at org.gradle.launcher.daemon.server.exec.ForwardClientInput.execute(ForwardClientInput.java:72)
  381. at org.gradle.launcher.daemon.server.api.DaemonCommandExecution.proceed(DaemonCommandExecution.java:120)
  382. at org.gradle.launcher.daemon.server.exec.LogAndCheckHealth.execute(LogAndCheckHealth.java:50)
  383. at org.gradle.launcher.daemon.server.api.DaemonCommandExecution.proceed(DaemonCommandExecution.java:120)
  384. at org.gradle.launcher.daemon.server.exec.LogToClient.doBuild(LogToClient.java:60)
  385. at org.gradle.launcher.daemon.server.exec.BuildCommandOnly.execute(BuildCommandOnly.java:36)
  386. at org.gradle.launcher.daemon.server.api.DaemonCommandExecution.proceed(DaemonCommandExecution.java:120)
  387. at org.gradle.launcher.daemon.server.exec.EstablishBuildEnvironment.doBuild(EstablishBuildEnvironment.java:72)
  388. at org.gradle.launcher.daemon.server.exec.BuildCommandOnly.execute(BuildCommandOnly.java:36)
  389. at org.gradle.launcher.daemon.server.api.DaemonCommandExecution.proceed(DaemonCommandExecution.java:120)
  390. at org.gradle.launcher.daemon.server.exec.StartBuildOrRespondWithBusy$1.run(StartBuildOrRespondWithBusy.java:50)
  391. at org.gradle.launcher.daemon.server.DaemonStateCoordinator$1.run(DaemonStateCoordinator.java:297)
  392. at org.gradle.internal.concurrent.ExecutorPolicy$CatchAndRecordFailures.onExecute(ExecutorPolicy.java:63)
  393. at org.gradle.internal.concurrent.StoppableExecutorImpl$1.run(StoppableExecutorImpl.java:46)
  394. Caused by: org.gradle.cache.CacheOpenException: Could not open cache directory 54plkzr789iuz7f93gysjukwl (/home/bartosz/.gradle/caches/3.4-20170117200919+0000/gradle-script-kotlin/54plkzr789iuz7f93gysjukwl).
  395. at org.gradle.cache.internal.DefaultPersistentDirectoryStore.open(DefaultPersistentDirectoryStore.java:57)
  396. at org.gradle.cache.internal.DefaultPersistentDirectoryStore.open(DefaultPersistentDirectoryStore.java:30)
  397. at org.gradle.cache.internal.DefaultCacheFactory.doOpen(DefaultCacheFactory.java:89)
  398. at org.gradle.cache.internal.DefaultCacheFactory.open(DefaultCacheFactory.java:63)
  399. at org.gradle.cache.internal.DefaultCacheRepository$PersistentCacheBuilder.open(DefaultCacheRepository.java:116)
  400. at org.gradle.script.lang.kotlin.provider.CachingKotlinCompiler.compileWithCache(CachingKotlinCompiler.kt:116)
  401. at org.gradle.script.lang.kotlin.provider.CachingKotlinCompiler.compileBuildScript(CachingKotlinCompiler.kt:92)
  402. at org.gradle.script.lang.kotlin.provider.KotlinBuildScriptCompiler.compileScriptFile(KotlinBuildScriptCompiler.kt:195)
  403. at org.gradle.script.lang.kotlin.provider.KotlinBuildScriptCompiler.executeScriptBodyOn(KotlinBuildScriptCompiler.kt:107)
  404. at org.gradle.script.lang.kotlin.provider.KotlinBuildScriptCompiler.access$executeScriptBodyOn(KotlinBuildScriptCompiler.kt:44)
  405. at org.gradle.script.lang.kotlin.provider.KotlinBuildScriptCompiler$compileTopLevelScript$1.invoke(KotlinBuildScriptCompiler.kt:92)
  406. at org.gradle.script.lang.kotlin.provider.KotlinBuildScriptCompiler$compileTopLevelScript$1.invoke(KotlinBuildScriptCompiler.kt:44)
  407. at org.gradle.script.lang.kotlin.provider.KotlinScriptPlugin.apply(KotlinScriptPlugin.kt:42)
  408. at org.gradle.configuration.project.BuildScriptProcessor.execute(BuildScriptProcessor.java:39)
  409. at org.gradle.configuration.project.BuildScriptProcessor.execute(BuildScriptProcessor.java:26)
  410. at org.gradle.configuration.project.ConfigureActionsProjectEvaluator.evaluate(ConfigureActionsProjectEvaluator.java:34)
  411. at org.gradle.configuration.project.LifecycleProjectEvaluator.doConfigure(LifecycleProjectEvaluator.java:70)
  412. ... 55 more
  413. Caused by: java.lang.IllegalStateException: Internal error: org.jetbrains.kotlin.codegen.CompilationException: Back-end (JVM) Internal error: No resolved call for 'isEmpty()' at (331,46) in /home/bartosz/Desktop/dev/java/Minecraft/CubicChunks/CubicChunks/build.gradle.kts
  414. Cause: No resolved call for 'isEmpty()' at (331,46) in /home/bartosz/Desktop/dev/java/Minecraft/CubicChunks/CubicChunks/build.gradle.kts
  415. File being compiled and position: (331,46) in /home/bartosz/Desktop/dev/java/Minecraft/CubicChunks/CubicChunks/build.gradle.kts
  416. PsiElement: isEmpty()
  417. The root cause was thrown at: callUtil.kt:187
  418. at org.jetbrains.kotlin.codegen.ExpressionCodegen.genQualified(ExpressionCodegen.java:350)
  419. at org.jetbrains.kotlin.codegen.ExpressionCodegen.genQualified(ExpressionCodegen.java:313)
  420. at org.jetbrains.kotlin.codegen.ExpressionCodegen.visitDotQualifiedExpression(ExpressionCodegen.java:3354)
  421. at org.jetbrains.kotlin.codegen.ExpressionCodegen.visitDotQualifiedExpression(ExpressionCodegen.java:121)
  422. at org.jetbrains.kotlin.psi.KtDotQualifiedExpression.accept(KtDotQualifiedExpression.kt:31)
  423. at org.jetbrains.kotlin.codegen.ExpressionCodegen.genQualified(ExpressionCodegen.java:331)
  424. at org.jetbrains.kotlin.codegen.ExpressionCodegen.genQualified(ExpressionCodegen.java:313)
  425. at org.jetbrains.kotlin.codegen.ExpressionCodegen.gen(ExpressionCodegen.java:356)
  426. at org.jetbrains.kotlin.codegen.ExpressionCodegen.generateIfExpression(ExpressionCodegen.java:501)
  427. at org.jetbrains.kotlin.codegen.ExpressionCodegen.visitIfExpression(ExpressionCodegen.java:496)
  428. at org.jetbrains.kotlin.codegen.ExpressionCodegen.visitIfExpression(ExpressionCodegen.java:121)
  429. at org.jetbrains.kotlin.psi.KtIfExpression.accept(KtIfExpression.java:33)
  430. at org.jetbrains.kotlin.codegen.ExpressionCodegen.genQualified(ExpressionCodegen.java:331)
  431. at org.jetbrains.kotlin.codegen.ExpressionCodegen.genQualified(ExpressionCodegen.java:313)
  432. at org.jetbrains.kotlin.codegen.ExpressionCodegen.gen(ExpressionCodegen.java:356)
  433. at org.jetbrains.kotlin.codegen.ExpressionCodegen.visitProperty(ExpressionCodegen.java:3894)
  434. at org.jetbrains.kotlin.codegen.ExpressionCodegen.visitProperty(ExpressionCodegen.java:121)
  435. at org.jetbrains.kotlin.psi.KtProperty.accept(KtProperty.java:57)
  436. at org.jetbrains.kotlin.codegen.CodegenStatementVisitor.visitKtElement(CodegenStatementVisitor.java:31)
  437. at org.jetbrains.kotlin.codegen.CodegenStatementVisitor.visitKtElement(CodegenStatementVisitor.java:22)
  438. at org.jetbrains.kotlin.psi.KtVisitor.visitExpression(KtVisitor.java:178)
  439. at org.jetbrains.kotlin.psi.KtVisitor.visitDeclaration(KtVisitor.java:29)
  440. at org.jetbrains.kotlin.psi.KtVisitor.visitNamedDeclaration(KtVisitor.java:390)
  441. at org.jetbrains.kotlin.psi.KtVisitor.visitProperty(KtVisitor.java:57)
  442. at org.jetbrains.kotlin.psi.KtProperty.accept(KtProperty.java:57)
  443. at org.jetbrains.kotlin.codegen.ExpressionCodegen.genQualified(ExpressionCodegen.java:331)
  444. at org.jetbrains.kotlin.codegen.ExpressionCodegen.genStatement(ExpressionCodegen.java:394)
  445. at org.jetbrains.kotlin.codegen.ExpressionCodegen.generateBlock(ExpressionCodegen.java:1840)
  446. at org.jetbrains.kotlin.codegen.ExpressionCodegen.generateBlock(ExpressionCodegen.java:1790)
  447. at org.jetbrains.kotlin.codegen.CodegenStatementVisitor.visitBlockExpression(CodegenStatementVisitor.java:56)
  448. at org.jetbrains.kotlin.codegen.CodegenStatementVisitor.visitBlockExpression(CodegenStatementVisitor.java:22)
  449. at org.jetbrains.kotlin.psi.KtBlockExpression.accept(KtBlockExpression.java:44)
  450. at org.jetbrains.kotlin.codegen.ExpressionCodegen.genQualified(ExpressionCodegen.java:331)
  451. at org.jetbrains.kotlin.codegen.ExpressionCodegen.genStatement(ExpressionCodegen.java:394)
  452. at org.jetbrains.kotlin.codegen.ExpressionCodegen.gen(ExpressionCodegen.java:360)
  453. at org.jetbrains.kotlin.codegen.ExpressionCodegen.returnExpression(ExpressionCodegen.java:2253)
  454. at org.jetbrains.kotlin.codegen.FunctionGenerationStrategy$FunctionDefault.doGenerateBody(FunctionGenerationStrategy.java:49)
  455. at org.jetbrains.kotlin.codegen.FunctionGenerationStrategy$CodegenBased.generateBody(FunctionGenerationStrategy.java:69)
  456. at org.jetbrains.kotlin.codegen.FunctionCodegen.generateMethodBody(FunctionCodegen.java:458)
  457. at org.jetbrains.kotlin.codegen.FunctionCodegen.generateMethod(FunctionCodegen.java:232)
  458. at org.jetbrains.kotlin.codegen.FunctionCodegen.generateMethod(FunctionCodegen.java:157)
  459. at org.jetbrains.kotlin.codegen.FunctionCodegen.gen(FunctionCodegen.java:132)
  460. at org.jetbrains.kotlin.codegen.MemberCodegen.genSimpleMember(MemberCodegen.java:190)
  461. at org.jetbrains.kotlin.codegen.ScriptCodegen.genMembers(ScriptCodegen.java:229)
  462. at org.jetbrains.kotlin.codegen.ScriptCodegen.generateBody(ScriptCodegen.java:100)
  463. at org.jetbrains.kotlin.codegen.MemberCodegen.generate(MemberCodegen.java:127)
  464. at org.jetbrains.kotlin.codegen.PackageCodegenImpl.generateFile(PackageCodegenImpl.java:119)
  465. at org.jetbrains.kotlin.codegen.PackageCodegenImpl.generate(PackageCodegenImpl.java:65)
  466. at org.jetbrains.kotlin.codegen.KotlinCodegenFacade.generatePackage(KotlinCodegenFacade.java:99)
  467. at org.jetbrains.kotlin.codegen.KotlinCodegenFacade.doGenerateFiles(KotlinCodegenFacade.java:77)
  468. at org.jetbrains.kotlin.codegen.KotlinCodegenFacade.compileCorrectFiles(KotlinCodegenFacade.java:44)
  469. at org.jetbrains.kotlin.cli.jvm.compiler.KotlinToJVMBytecodeCompiler.generate(KotlinToJVMBytecodeCompiler.kt:417)
  470. at org.jetbrains.kotlin.cli.jvm.compiler.KotlinToJVMBytecodeCompiler.analyzeAndGenerate(KotlinToJVMBytecodeCompiler.kt:328)
  471. at org.jetbrains.kotlin.cli.jvm.compiler.KotlinToJVMBytecodeCompiler.compileScript(KotlinToJVMBytecodeCompiler.kt:532)
  472. at org.gradle.script.lang.kotlin.support.KotlinCompilerKt.compileKotlinScriptToDirectory(KotlinCompiler.kt:70)
  473. at org.gradle.script.lang.kotlin.provider.CachingKotlinCompiler$compileTo$1.invoke(CachingKotlinCompiler.kt:134)
  474. at org.gradle.script.lang.kotlin.provider.CachingKotlinCompiler$compileTo$1.invoke(CachingKotlinCompiler.kt:45)
  475. at org.gradle.script.lang.kotlin.provider.CachingKotlinCompiler.withProgressLoggingFor(CachingKotlinCompiler.kt:185)
  476. at org.gradle.script.lang.kotlin.provider.CachingKotlinCompiler.compileTo(CachingKotlinCompiler.kt:132)
  477. at org.gradle.script.lang.kotlin.provider.CachingKotlinCompiler.access$compileTo(CachingKotlinCompiler.kt:45)
  478. at org.gradle.script.lang.kotlin.provider.CachingKotlinCompiler$compileWithCache$cacheDir$2.execute(CachingKotlinCompiler.kt:114)
  479. at org.gradle.script.lang.kotlin.provider.CachingKotlinCompiler$compileWithCache$cacheDir$2.execute(CachingKotlinCompiler.kt:45)
  480. at org.gradle.cache.internal.DefaultPersistentDirectoryCache$Initializer.initialize(DefaultPersistentDirectoryCache.java:92)
  481. at org.gradle.cache.internal.FixedSharedModeCrossProcessCacheAccess$1.run(FixedSharedModeCrossProcessCacheAccess.java:73)
  482. at org.gradle.cache.internal.DefaultFileLockManager$DefaultFileLock.doWriteAction(DefaultFileLockManager.java:184)
  483. at org.gradle.cache.internal.DefaultFileLockManager$DefaultFileLock.writeFile(DefaultFileLockManager.java:174)
  484. at org.gradle.cache.internal.FixedSharedModeCrossProcessCacheAccess.open(FixedSharedModeCrossProcessCacheAccess.java:71)
  485. at org.gradle.cache.internal.DefaultCacheAccess.open(DefaultCacheAccess.java:130)
  486. at org.gradle.cache.internal.DefaultPersistentDirectoryStore.open(DefaultPersistentDirectoryStore.java:55)
  487. at org.gradle.cache.internal.DefaultPersistentDirectoryStore.open(DefaultPersistentDirectoryStore.java:30)
  488. at org.gradle.cache.internal.DefaultCacheFactory.doOpen(DefaultCacheFactory.java:89)
  489. at org.gradle.cache.internal.DefaultCacheFactory.open(DefaultCacheFactory.java:63)
  490. at org.gradle.cache.internal.DefaultCacheRepository$PersistentCacheBuilder.open(DefaultCacheRepository.java:116)
  491. at org.gradle.script.lang.kotlin.provider.CachingKotlinCompiler.compileWithCache(CachingKotlinCompiler.kt:116)
  492. at org.gradle.script.lang.kotlin.provider.CachingKotlinCompiler.compileBuildScript(CachingKotlinCompiler.kt:92)
  493. at org.gradle.script.lang.kotlin.provider.KotlinBuildScriptCompiler.compileScriptFile(KotlinBuildScriptCompiler.kt:195)
  494. at org.gradle.script.lang.kotlin.provider.KotlinBuildScriptCompiler.executeScriptBodyOn(KotlinBuildScriptCompiler.kt:107)
  495. at org.gradle.script.lang.kotlin.provider.KotlinBuildScriptCompiler.access$executeScriptBodyOn(KotlinBuildScriptCompiler.kt:44)
  496. at org.gradle.script.lang.kotlin.provider.KotlinBuildScriptCompiler$compileTopLevelScript$1.invoke(KotlinBuildScriptCompiler.kt:92)
  497. at org.gradle.script.lang.kotlin.provider.KotlinBuildScriptCompiler$compileTopLevelScript$1.invoke(KotlinBuildScriptCompiler.kt:44)
  498. at org.gradle.script.lang.kotlin.provider.KotlinScriptPlugin.apply(KotlinScriptPlugin.kt:42)
  499. at org.gradle.configuration.project.BuildScriptProcessor.execute(BuildScriptProcessor.java:39)
  500. at org.gradle.configuration.project.BuildScriptProcessor.execute(BuildScriptProcessor.java:26)
  501. at org.gradle.configuration.project.ConfigureActionsProjectEvaluator.evaluate(ConfigureActionsProjectEvaluator.java:34)
  502. at org.gradle.configuration.project.LifecycleProjectEvaluator.doConfigure(LifecycleProjectEvaluator.java:70)
  503. at org.gradle.configuration.project.LifecycleProjectEvaluator.access$000(LifecycleProjectEvaluator.java:33)
  504. at org.gradle.configuration.project.LifecycleProjectEvaluator$1.execute(LifecycleProjectEvaluator.java:53)
  505. at org.gradle.configuration.project.LifecycleProjectEvaluator$1.execute(LifecycleProjectEvaluator.java:50)
  506. at org.gradle.internal.Transformers$4.transform(Transformers.java:169)
  507. at org.gradle.internal.progress.DefaultBuildOperationExecutor.run(DefaultBuildOperationExecutor.java:106)
  508. at org.gradle.internal.progress.DefaultBuildOperationExecutor.run(DefaultBuildOperationExecutor.java:61)
  509. at org.gradle.configuration.project.LifecycleProjectEvaluator.evaluate(LifecycleProjectEvaluator.java:50)
  510. at org.gradle.api.internal.project.DefaultProject.evaluate(DefaultProject.java:599)
  511. at org.gradle.api.internal.project.DefaultProject.evaluate(DefaultProject.java:125)
  512. at org.gradle.execution.TaskPathProjectEvaluator.configure(TaskPathProjectEvaluator.java:35)
  513. at org.gradle.execution.TaskPathProjectEvaluator.configureHierarchy(TaskPathProjectEvaluator.java:60)
  514. at org.gradle.configuration.DefaultBuildConfigurer.configure(DefaultBuildConfigurer.java:38)
  515. at org.gradle.initialization.DefaultGradleLauncher$ConfigureBuildAction.execute(DefaultGradleLauncher.java:233)
  516. at org.gradle.initialization.DefaultGradleLauncher$ConfigureBuildAction.execute(DefaultGradleLauncher.java:230)
  517. at org.gradle.internal.Transformers$4.transform(Transformers.java:169)
  518. at org.gradle.internal.progress.DefaultBuildOperationExecutor.run(DefaultBuildOperationExecutor.java:106)
  519. at org.gradle.internal.progress.DefaultBuildOperationExecutor.run(DefaultBuildOperationExecutor.java:56)
  520. at org.gradle.initialization.DefaultGradleLauncher.doBuildStages(DefaultGradleLauncher.java:160)
  521. at org.gradle.initialization.DefaultGradleLauncher.doBuild(DefaultGradleLauncher.java:119)
  522. at org.gradle.initialization.DefaultGradleLauncher.run(DefaultGradleLauncher.java:102)
  523. at org.gradle.launcher.exec.GradleBuildController.run(GradleBuildController.java:71)
  524. at org.gradle.tooling.internal.provider.ExecuteBuildActionRunner.run(ExecuteBuildActionRunner.java:28)
  525. at org.gradle.launcher.exec.ChainingBuildActionRunner.run(ChainingBuildActionRunner.java:35)
  526. at org.gradle.launcher.exec.InProcessBuildActionExecuter.execute(InProcessBuildActionExecuter.java:41)
  527. at org.gradle.launcher.exec.InProcessBuildActionExecuter.execute(InProcessBuildActionExecuter.java:26)
  528. at org.gradle.tooling.internal.provider.ContinuousBuildActionExecuter.execute(ContinuousBuildActionExecuter.java:75)
  529. at org.gradle.tooling.internal.provider.ContinuousBuildActionExecuter.execute(ContinuousBuildActionExecuter.java:49)
  530. at org.gradle.tooling.internal.provider.ServicesSetupBuildActionExecuter.execute(ServicesSetupBuildActionExecuter.java:49)
  531. at org.gradle.tooling.internal.provider.ServicesSetupBuildActionExecuter.execute(ServicesSetupBuildActionExecuter.java:31)
  532. at org.gradle.launcher.daemon.server.exec.ExecuteBuild.doBuild(ExecuteBuild.java:67)
  533. at org.gradle.launcher.daemon.server.exec.BuildCommandOnly.execute(BuildCommandOnly.java:36)
  534. at org.gradle.launcher.daemon.server.api.DaemonCommandExecution.proceed(DaemonCommandExecution.java:120)
  535. at org.gradle.launcher.daemon.server.exec.WatchForDisconnection.execute(WatchForDisconnection.java:47)
  536. at org.gradle.launcher.daemon.server.api.DaemonCommandExecution.proceed(DaemonCommandExecution.java:120)
  537. at org.gradle.launcher.daemon.server.exec.ResetDeprecationLogger.execute(ResetDeprecationLogger.java:26)
  538. at org.gradle.launcher.daemon.server.api.DaemonCommandExecution.proceed(DaemonCommandExecution.java:120)
  539. at org.gradle.launcher.daemon.server.exec.RequestStopIfSingleUsedDaemon.execute(RequestStopIfSingleUsedDaemon.java:34)
  540. at org.gradle.launcher.daemon.server.api.DaemonCommandExecution.proceed(DaemonCommandExecution.java:120)
  541. at org.gradle.launcher.daemon.server.exec.ForwardClientInput$2.call(ForwardClientInput.java:74)
  542. at org.gradle.launcher.daemon.server.exec.ForwardClientInput$2.call(ForwardClientInput.java:72)
  543. at org.gradle.util.Swapper.swap(Swapper.java:38)
  544. at org.gradle.launcher.daemon.server.exec.ForwardClientInput.execute(ForwardClientInput.java:72)
  545. at org.gradle.launcher.daemon.server.api.DaemonCommandExecution.proceed(DaemonCommandExecution.java:120)
  546. at org.gradle.launcher.daemon.server.exec.LogAndCheckHealth.execute(LogAndCheckHealth.java:50)
  547. at org.gradle.launcher.daemon.server.api.DaemonCommandExecution.proceed(DaemonCommandExecution.java:120)
  548. at org.gradle.launcher.daemon.server.exec.LogToClient.doBuild(LogToClient.java:60)
  549. at org.gradle.launcher.daemon.server.exec.BuildCommandOnly.execute(BuildCommandOnly.java:36)
  550. at org.gradle.launcher.daemon.server.api.DaemonCommandExecution.proceed(DaemonCommandExecution.java:120)
  551. at org.gradle.launcher.daemon.server.exec.EstablishBuildEnvironment.doBuild(EstablishBuildEnvironment.java:72)
  552. at org.gradle.launcher.daemon.server.exec.BuildCommandOnly.execute(BuildCommandOnly.java:36)
  553. at org.gradle.launcher.daemon.server.api.DaemonCommandExecution.proceed(DaemonCommandExecution.java:120)
  554. at org.gradle.launcher.daemon.server.exec.StartBuildOrRespondWithBusy$1.run(StartBuildOrRespondWithBusy.java:50)
  555. at org.gradle.launcher.daemon.server.DaemonStateCoordinator$1.run(DaemonStateCoordinator.java:297)
  556. at org.gradle.internal.concurrent.ExecutorPolicy$CatchAndRecordFailures.onExecute(ExecutorPolicy.java:63)
  557. at org.gradle.internal.concurrent.StoppableExecutorImpl$1.run(StoppableExecutorImpl.java:46)
  558. at java.util.concurrent.ThreadPoolExecutor.runWorker(ThreadPoolExecutor.java:1142)
  559. at java.util.concurrent.ThreadPoolExecutor$Worker.run(ThreadPoolExecutor.java:617)
  560. at java.lang.Thread.run(Thread.java:745)
  561. Caused by: java.lang.AssertionError: No resolved call for 'isEmpty()' at (331,46) in /home/bartosz/Desktop/dev/java/Minecraft/CubicChunks/CubicChunks/build.gradle.kts
  562. at org.jetbrains.kotlin.resolve.calls.callUtil.CallUtilKt.getResolvedCallWithAssert(callUtil.kt:187)
  563. at org.jetbrains.kotlin.codegen.ExpressionCodegen.visitCallExpression(ExpressionCodegen.java:2656)
  564. at org.jetbrains.kotlin.codegen.ExpressionCodegen.visitCallExpression(ExpressionCodegen.java:121)
  565. at org.jetbrains.kotlin.psi.KtCallExpression.accept(KtCallExpression.java:35)
  566. at org.jetbrains.kotlin.codegen.ExpressionCodegen.genQualified(ExpressionCodegen.java:331)
  567. ... 142 more
  568.  
  569. at org.gradle.script.lang.kotlin.support.KotlinCompilerKt.compileKotlinScriptToDirectory(KotlinCompiler.kt:227)
  570. at org.gradle.script.lang.kotlin.provider.CachingKotlinCompiler$compileTo$1.invoke(CachingKotlinCompiler.kt:134)
  571. at org.gradle.script.lang.kotlin.provider.CachingKotlinCompiler$compileTo$1.invoke(CachingKotlinCompiler.kt:45)
  572. at org.gradle.script.lang.kotlin.provider.CachingKotlinCompiler.withProgressLoggingFor(CachingKotlinCompiler.kt:185)
  573. at org.gradle.script.lang.kotlin.provider.CachingKotlinCompiler.compileTo(CachingKotlinCompiler.kt:132)
  574. at org.gradle.script.lang.kotlin.provider.CachingKotlinCompiler.access$compileTo(CachingKotlinCompiler.kt:45)
  575. at org.gradle.script.lang.kotlin.provider.CachingKotlinCompiler$compileWithCache$cacheDir$2.execute(CachingKotlinCompiler.kt:114)
  576. at org.gradle.script.lang.kotlin.provider.CachingKotlinCompiler$compileWithCache$cacheDir$2.execute(CachingKotlinCompiler.kt:45)
  577. at org.gradle.cache.internal.DefaultPersistentDirectoryCache$Initializer.initialize(DefaultPersistentDirectoryCache.java:92)
  578. at org.gradle.cache.internal.FixedSharedModeCrossProcessCacheAccess$1.run(FixedSharedModeCrossProcessCacheAccess.java:73)
  579. at org.gradle.cache.internal.DefaultFileLockManager$DefaultFileLock.doWriteAction(DefaultFileLockManager.java:184)
  580. at org.gradle.cache.internal.DefaultFileLockManager$DefaultFileLock.writeFile(DefaultFileLockManager.java:174)
  581. at org.gradle.cache.internal.FixedSharedModeCrossProcessCacheAccess.open(FixedSharedModeCrossProcessCacheAccess.java:71)
  582. at org.gradle.cache.internal.DefaultCacheAccess.open(DefaultCacheAccess.java:130)
  583. at org.gradle.cache.internal.DefaultPersistentDirectoryStore.open(DefaultPersistentDirectoryStore.java:55)
  584. ... 71 more
  585.  
  586.  
  587. BUILD FAILED
  588.  
  589. Total time: 15.252 secs
Advertisement
Add Comment
Please, Sign In to add comment