Want more features on Pastebin? Sign Up, it's FREE!
Guest

Untitled

By: a guest on Jun 20th, 2012  |  syntax: None  |  size: 7.45 KB  |  views: 30  |  expires: Never
download  |  raw  |  embed  |  report abuse  |  print
Text below is selected. Please press Ctrl+C to copy to your clipboard. (⌘+C on Mac)
  1. parser-spec:
  2.      [echo]
  3.      [echo] Executing Parser Spec
  4.      [java] Executing '/usr/lib/jvm/java-6-openjdk-i386/jre/bin/java' with arguments:
  5.      [java] '-Dfile.encoding=utf-8'
  6.      [java] '-Xmx256m'
  7.      [java] '-jar'
  8.      [java] '/home/andrea/Downloads/thatcher-env-js-cb738b9/rhino/js.jar'
  9.      [java] '-opt'
  10.      [java] '-1'
  11.      [java] '/home/andrea/Downloads/thatcher-env-js-cb738b9/specs/parser/boot.js'
  12.      [java]
  13.      [java] The ' characters around the executable and arguments are
  14.      [java] not part of the command.
  15.      [echo]
  16.  
  17. local-settings:
  18. Skipped because property 'HAS_LOCAL' set.
  19.  
  20. xhr-spec:
  21.      [echo]
  22.      [echo] Executing XMLHttpRequest Spec
  23.      [java] Executing '/usr/lib/jvm/java-6-openjdk-i386/jre/bin/java' with arguments:
  24.      [java] '-Dfile.encoding=utf-8'
  25.      [java] '-Xmx256m'
  26.      [java] '-jar'
  27.      [java] '/home/andrea/Downloads/thatcher-env-js-cb738b9/rhino/js.jar'
  28.      [java] '/home/andrea/Downloads/thatcher-env-js-cb738b9/specs/xhr/boot.js'
  29.      [java]
  30.      [java] The ' characters around the executable and arguments are
  31.      [java] not part of the command.
  32.      [java] mocking global document object.
  33.      [java] mocking global document location.
  34.      [java] org.mozilla.javascript.WrappedException: Wrapped java.net.ConnectException: Connection timed out (dist/xhr.js#766)
  35.      [java]     at org.mozilla.javascript.Context.throwAsScriptRuntimeEx(Context.java:1773)
  36.      [java]     at org.mozilla.javascript.MemberBox.invoke(MemberBox.java:183)
  37.      [java]     at org.mozilla.javascript.NativeJavaMethod.call(NativeJavaMethod.java:247)
  38.      [java]     at org.mozilla.javascript.optimizer.OptRuntime.callProp0(OptRuntime.java:119)
  39.      [java]     at org.mozilla.javascript.gen.c5._c18(Unknown Source)
  40.      [java]     at org.mozilla.javascript.gen.c5.call(Unknown Source)
  41.      [java]     at org.mozilla.javascript.Interpreter.interpretLoop(Interpreter.java:3330)
  42.      [java]     at script.makeRequest(dist/xhr.js:766)
  43.      [java]     at script(dist/xhr.js:817)
  44.      [java]     at script(dist/xhr.js:635)
  45.      [java]     at script(dist/xhr.js:658)
  46.      [java]     at script(specs/xhr/spec.js:26)
  47.      [java]     at org.mozilla.javascript.Interpreter.interpret(Interpreter.java:2487)
  48.      [java]     at org.mozilla.javascript.InterpretedFunction.exec(InterpretedFunction.java:178)
  49.      [java]     at org.mozilla.javascript.tools.shell.Main.evaluateScript(Main.java:564)
  50.      [java]     at org.mozilla.javascript.tools.shell.Main.processFileSecure(Main.java:486)
  51.      [java]     at org.mozilla.javascript.tools.shell.Main.processFile(Main.java:452)
  52.      [java]     at org.mozilla.javascript.tools.shell.Global.load(Global.java:244)
  53.      [java]     at sun.reflect.NativeMethodAccessorImpl.invoke0(Native Method)
  54.      [java]     at sun.reflect.NativeMethodAccessorImpl.invoke(NativeMethodAccessorImpl.java:57)
  55.      [java]     at sun.reflect.DelegatingMethodAccessorImpl.invoke(DelegatingMethodAccessorImpl.java:43)
  56.      [java]     at java.lang.reflect.Method.invoke(Method.java:616)
  57.      [java]     at org.mozilla.javascript.MemberBox.invoke(MemberBox.java:161)
  58.      [java]     at org.mozilla.javascript.FunctionObject.call(FunctionObject.java:413)
  59.      [java]     at org.mozilla.javascript.optimizer.OptRuntime.callName(OptRuntime.java:97)
  60.      [java]     at org.mozilla.javascript.gen.c1._c0(Unknown Source)
  61.      [java]     at org.mozilla.javascript.gen.c1.call(Unknown Source)
  62.      [java]     at org.mozilla.javascript.ContextFactory.doTopCall(ContextFactory.java:398)
  63.      [java]     at org.mozilla.javascript.ScriptRuntime.doTopCall(ScriptRuntime.java:3065)
  64.      [java]     at org.mozilla.javascript.gen.c1.call(Unknown Source)
  65.      [java]     at org.mozilla.javascript.gen.c1.exec(Unknown Source)
  66.      [java]     at org.mozilla.javascript.tools.shell.Main.evaluateScript(Main.java:564)
  67.      [java]     at org.mozilla.javascript.tools.shell.Main.processFileSecure(Main.java:486)
  68.      [java]     at org.mozilla.javascript.tools.shell.Main.processFile(Main.java:452)
  69.      [java]     at org.mozilla.javascript.tools.shell.Main.processSource(Main.java:443)
  70.      [java]     at org.mozilla.javascript.tools.shell.Main.processFiles(Main.java:196)
  71.      [java]     at org.mozilla.javascript.tools.shell.Main$IProxy.run(Main.java:117)
  72.      [java]     at org.mozilla.javascript.Context.call(Context.java:515)
  73.      [java]     at org.mozilla.javascript.ContextFactory.call(ContextFactory.java:507)
  74.      [java]     at org.mozilla.javascript.tools.shell.Main.exec(Main.java:179)
  75.      [java]     at org.mozilla.javascript.tools.shell.Main.main(Main.java:157)
  76.      [java] Caused by: java.net.ConnectException: Connection timed out
  77.      [java]     at java.net.PlainSocketImpl.socketConnect(Native Method)
  78.      [java]     at java.net.AbstractPlainSocketImpl.doConnect(AbstractPlainSocketImpl.java:327)
  79.      [java]     at java.net.AbstractPlainSocketImpl.connectToAddress(AbstractPlainSocketImpl.java:193)
  80.      [java]     at java.net.AbstractPlainSocketImpl.connect(AbstractPlainSocketImpl.java:180)
  81.      [java]     at java.net.SocksSocketImpl.connect(SocksSocketImpl.java:384)
  82.      [java]     at java.net.Socket.connect(Socket.java:546)
  83.      [java]     at java.net.Socket.connect(Socket.java:495)
  84.      [java]     at sun.net.NetworkClient.doConnect(NetworkClient.java:178)
  85.      [java]     at sun.net.www.http.HttpClient.openServer(HttpClient.java:409)
  86.      [java]     at sun.net.www.http.HttpClient.openServer(HttpClient.java:530)
  87.      [java]     at sun.net.www.http.HttpClient.<init>(HttpClient.java:240)
  88.      [java]     at sun.net.www.http.HttpClient.New(HttpClient.java:321)
  89.      [java]     at sun.net.www.http.HttpClient.New(HttpClient.java:338)
  90.      [java]     at sun.net.www.protocol.http.HttpURLConnection.getNewHttpClient(HttpURLConnection.java:935)
  91.      [java]     at sun.net.www.protocol.http.HttpURLConnection.plainConnect(HttpURLConnection.java:876)
  92.      [java]     at sun.net.www.protocol.http.HttpURLConnection.connect(HttpURLConnection.java:801)
  93.      [java]     at sun.reflect.NativeMethodAccessorImpl.invoke0(Native Method)
  94.      [java]     at sun.reflect.NativeMethodAccessorImpl.invoke(NativeMethodAccessorImpl.java:57)
  95.      [java]     at sun.reflect.DelegatingMethodAccessorImpl.invoke(DelegatingMethodAccessorImpl.java:43)
  96.      [java]     at java.lang.reflect.Method.invoke(Method.java:616)
  97.      [java]     at org.mozilla.javascript.MemberBox.invoke(MemberBox.java:161)
  98.      [java]     ... 34 more
  99.  
  100. BUILD FAILED
  101. /home/andrea/Downloads/thatcher-env-js-cb738b9/build.xml:602: Java returned: 3
  102.         at org.apache.tools.ant.taskdefs.Java.execute(Java.java:111)
  103.         at org.apache.tools.ant.UnknownElement.execute(UnknownElement.java:291)
  104.         at sun.reflect.GeneratedMethodAccessor4.invoke(Unknown Source)
  105.         at sun.reflect.DelegatingMethodAccessorImpl.invoke(DelegatingMethodAccessorImpl.java:43)
  106.         at java.lang.reflect.Method.invoke(Method.java:616)
  107.         at org.apache.tools.ant.dispatch.DispatchUtils.execute(DispatchUtils.java:106)
  108.         at org.apache.tools.ant.Task.perform(Task.java:348)
  109.         at org.apache.tools.ant.Target.execute(Target.java:390)
  110.         at org.apache.tools.ant.Target.performTasks(Target.java:411)
  111.         at org.apache.tools.ant.Project.executeSortedTargets(Project.java:1399)
  112.         at org.apache.tools.ant.Project.executeTarget(Project.java:1368)
  113.         at org.apache.tools.ant.helper.DefaultExecutor.executeTargets(DefaultExecutor.java:41)
  114.         at org.apache.tools.ant.Project.executeTargets(Project.java:1251)
  115.         at org.apache.tools.ant.Main.runBuild(Main.java:809)
  116.         at org.apache.tools.ant.Main.startAnt(Main.java:217)
  117.         at org.apache.tools.ant.launch.Launcher.run(Launcher.java:280)
  118.         at org.apache.tools.ant.launch.Launcher.main(Launcher.java:109)
  119.  
  120. Total time: 1 minute 24 seconds
clone this paste RAW Paste Data