This week only. Pastebin PRO Accounts Christmas Special! Don't miss out!Want more features on Pastebin? Sign Up, it's FREE!
Guest

compcache

By: a guest on Nov 30th, 2010  |  syntax: None  |  size: 1.91 KB  |  views: 84  |  expires: Never
download  |  raw  |  embed  |  report abuse  |  print
Text below is selected. Please press Ctrl+C to copy to your clipboard. (⌘+C on Mac)
  1. ==> Building and installing package
  2. ==> Determining latest hg revision...
  3. real URL is https://compcache.googlecode.com/hg/
  4. requesting all changes
  5. adding changesets
  6. adding manifests
  7. adding file changes
  8. added 196 changesets with 629 changes to 282 files (+2 heads)
  9. updating to branch default
  10. 236 files updated, 0 files merged, 0 files removed, 0 files unresolved
  11.   -> Version found: 195
  12. ==> Making package: compcache 195-2 (Tue Nov 30 12:45:47 CST 2010)
  13. ==> Checking Runtime Dependencies...
  14. ==> Checking Buildtime Dependencies...
  15. ==> Retrieving Sources...
  16.   -> Found compcache.conf
  17.   -> Found compcache.init
  18. ==> Validating source files with md5sums...
  19.     compcache.conf ... Passed
  20.     compcache.init ... Passed
  21. ==> Extracting Sources...
  22. ==> Entering fakeroot environment...
  23. ==> Starting build()...
  24. 0 files updated, 0 files merged, 0 files removed, 0 files unresolved
  25. make -C "/lib/modules/2.6.36-ARCH/build" M=/tmp/yaourt-tmp-xaer0/aur-compcache/src/compcache modules
  26. make[1]: Entering directory `/usr/src/linux-2.6.36-ARCH'
  27.   CC [M]  /tmp/yaourt-tmp-xaer0/aur-compcache/src/compcache/zram_drv.o
  28. /tmp/yaourt-tmp-xaer0/aur-compcache/src/compcache/zram_drv.c: In function ‘zram_make_request’:
  29. /tmp/yaourt-tmp-xaer0/aur-compcache/src/compcache/zram_drv.c:461:2: error: implicit declaration of function ‘bio_rw_flagged’
  30. /tmp/yaourt-tmp-xaer0/aur-compcache/src/compcache/zram_drv.c:461:6: error: ‘BIO_RW_DISCARD’ undeclared (first use in this function)
  31. /tmp/yaourt-tmp-xaer0/aur-compcache/src/compcache/zram_drv.c:461:6: note: each undeclared identifier is reported only once for each function it appears in
  32. make[2]: *** [/tmp/yaourt-tmp-xaer0/aur-compcache/src/compcache/zram_drv.o] Error 1
  33. make[1]: *** [_module_/tmp/yaourt-tmp-xaer0/aur-compcache/src/compcache] Error 2
  34. make[1]: Leaving directory `/usr/src/linux-2.6.36-ARCH'
  35. make: *** [all] Error 2
  36.     Aborting...
  37. ==> ERROR: Makepkg was unable to build compcache.
clone this paste RAW Paste Data