Pastebin launched a little side project called VERYVIRAL.com, check it out ;-) Want more features on Pastebin? Sign Up, it's FREE!
Guest

Untitled

By: a guest on Nov 13th, 2010  |  syntax: None  |  size: 1.02 KB  |  views: 75  |  expires: Never
download  |  raw  |  embed  |  report abuse  |  print
Text below is selected. Please press Ctrl+C to copy to your clipboard. (⌘+C on Mac)
  1. plugins/imagepng/plugin.cpp: In function ‘void user_error_fn(png_struct*, const char*)’:
  2. plugins/imagepng/plugin.cpp:44:20: warning: ‘png_struct_def::jmpbuf’ is deprecated (declared at /usr/include/libpng14/png.h:1119)
  3. plugins/imagepng/plugin.cpp:44:20: warning: ‘png_struct_def::jmpbuf’ is deprecated (declared at /usr/include/libpng14/png.h:1119)
  4. plugins/imagepng/plugin.cpp: In function ‘Image* LoadPNGBuff(unsigned char*)’:
  5. plugins/imagepng/plugin.cpp:92:7: warning: ‘png_struct_def::jmpbuf’ is deprecated (declared at /usr/include/libpng14/png.h:1119)
  6. plugins/imagepng/plugin.cpp:92:7: warning: ‘png_struct_def::jmpbuf’ is deprecated (declared at /usr/include/libpng14/png.h:1119)
  7. plugins/imagepng/plugin.cpp:111:36: error: ‘png_set_gray_1_2_4_to_8’ was not declared in this scope
  8. plugins/imagepng/plugin.cpp:156:48: error: ‘png_infopp_NULL’ was not declared in this scope
  9. scons: *** [build/release/plugins/imagepng/plugin.os] Error 1
  10. scons: building terminated because of errors.
  11.     Aborting...