Want more features on Pastebin? Sign Up, it's FREE!
Guest

exactimage-build-fail

By: a guest on Jan 29th, 2013  |  syntax: Bash  |  size: 7.02 KB  |  views: 31  |  expires: Never
download  |  raw  |  embed  |  report abuse  |  print
Text below is selected. Please press Ctrl+C to copy to your clipboard. (⌘+C on Mac)
  1. ==> Making package: exactimage 0.8.7-1 (Tue Jan 29 23:32:03 CET 2013)
  2. ==> Checking runtime dependencies...
  3. ==> Checking buildtime dependencies...
  4. ==> Retrieving Sources...
  5.   -> Found exact-image-0.8.7.tar.bz2
  6.   -> Found makefile-cflags.patch
  7.   -> Found agg-missing-includes.patch
  8.   -> Found utility-timer-dead-code.diff
  9.   -> Found libpng15.patch
  10.   -> Found g++-4.7.patch
  11.   -> Found patch-lib__ContourUtility.cc
  12.   -> Found patch-lib__ContourMatching.cc
  13.   -> Found patch-codecs__xpm.cc
  14.   -> Found patch-codecs__jpeg.cc
  15.   -> Found patch-bardecode__code128.hh
  16.   -> Found patch-codecs__bmp.cc
  17.   -> Found patch-lib__ImageIterator2.hh
  18.   -> Found patch-edisplay_edisplay.cc
  19.   -> Found patch-codecs__gif.cc
  20. ==> Validating source files with md5sums...
  21.     exact-image-0.8.7.tar.bz2 ... Passed
  22.     makefile-cflags.patch ... Passed
  23.     agg-missing-includes.patch ... Passed
  24.     utility-timer-dead-code.diff ... Passed
  25.     libpng15.patch ... Passed
  26.     g++-4.7.patch ... Passed
  27.     patch-lib__ContourUtility.cc ... Passed
  28.     patch-lib__ContourMatching.cc ... Passed
  29.     patch-codecs__xpm.cc ... Passed
  30.     patch-codecs__jpeg.cc ... Passed
  31.     patch-bardecode__code128.hh ... Passed
  32.     patch-codecs__bmp.cc ... Passed
  33.     patch-lib__ImageIterator2.hh ... Passed
  34.     patch-edisplay_edisplay.cc ... Passed
  35.     patch-codecs__gif.cc ... Passed
  36. ==> Extracting Sources...
  37.   -> Extracting exact-image-0.8.7.tar.bz2 with bsdtar
  38. ==> Removing existing pkg/ directory...
  39. ==> Starting build()...
  40. ==> Patching for Makefile CFLAGS --> From DEBIAN Project.
  41. patching file Makefile
  42. ==> Patching for missing includes --> From DEBIAN Project.
  43. patching file codecs/agg_svg_path_renderer.hh
  44. patching file codecs/svg.cc
  45. patching file lib/agg.hh
  46. ==> Patching for dead code in utility/Timer.cc --> From DEBIAN Project.
  47. patching file utility/Timer.cc
  48. patching file utility/Timer.hh
  49. ==> Patching for compiling w/libpng-1.5 --> From DEBIAN Project.
  50. patching file codecs/png.cc
  51. ==> Patching for compiling w/gcc++-4.7 --> From DEBIAN Project.
  52. patching file edisplay/edisplay.cc
  53. ==> Patching for ContourUtility.cc --> From FreeBSDProject.
  54. patching file lib/ContourUtility.cc
  55. ==> Patching for ContourMatching.cc --> From FreeBSDProject.
  56. patching file lib/ContourMatching.cc
  57. ==> Patching for codecs__xpm.cc --> From FreeBSDProject.
  58. patching file codecs/xpm.cc
  59. ==> Patching for codecs__jpeg.cc --> From FreeBSDProject.
  60. patching file codecs/jpeg.cc
  61. Hunk #1 succeeded at 688 (offset 5 lines).
  62. ==> Patching for bardecode__code128.hh --> From FreeBSDProject.
  63. patching file bardecode/code128.hh
  64. Hunk #1 succeeded at 236 (offset 1 line).
  65. ==> Patching for codecs__bmp.cc --> From FreeBSDProject.
  66. patching file codecs/bmp.cc
  67. Hunk #1 succeeded at 473 with fuzz 2 (offset 32 lines).
  68. Hunk #2 succeeded at 551 (offset 27 lines).
  69. Hunk #3 succeeded at 623 with fuzz 1 (offset 27 lines).
  70. ==> Patching for lib__ImageIterator2.hh --> From FreeBSDProject.
  71. patching file lib/ImageIterator2.hh
  72. ==> Patching for edisplay_edisplay.cc --> From FreeBSDProject.
  73. patching file ./edisplay/edisplay.cc
  74. ==> Patching for codecs__gif.cc --> From FreeBSDProject (Partly!).
  75. patching file codecs/gif.cc
  76. ==> Patching for python2...
  77. checking whether the C++ compiler works ... yes
  78. checking for C++ STL support ... yes
  79. checking for C++ templates ... yes
  80. checking for C++ template specialization ... yes
  81. checking for C++ partial template specialization ... yes
  82. checking whether C++ supports templates ... yes
  83. checking for header iostream ... found
  84. checking for header string ... found
  85. checking for header iostream ... found
  86. checking for header sstream ... found
  87. checking for header fstream ... found
  88. checking for package x11 (atleast 11.0) ... yes (11.0)
  89. checking for package libagg (atleast 2.3) ... yes (2.5.0)
  90. checking for package freetype2 (atleast 9.5.0) ... yes (16.0.10)
  91. checking for package evas (atleast 0.9.9) ... no
  92.  
  93. Enlightenment Evas was not found - edisplay is disabled.
  94. Evas can be obtained from: www.enlightenment.org
  95.  
  96. checking for header Evas_Engine_GL_X11.h ... not found
  97. checking for package libjpeg  ... yes
  98. checking for package libtiff  ... yes
  99. checking for package libpng (atleast 1.2) ... yes (1.5.13)
  100. checking for package libungif  ... yes
  101. checking for package jasper  ... yes
  102. checking for package expat  ... yes
  103. checking for package OpenEXR (atleast 1.2.0) ... yes (1.7.1)
  104. checking for package lcms (atleast 1.10) ... yes (1.19)
  105. checking for package bardecode  ... no
  106. For optional, proprietary barcode recognition, place it in 'external/'.
  107.  
  108. checking for package swig (atleast 1.3.32) ... yes (1.3.40)
  109. checking for package lua (atleast 5.1) ... yes (5.2.1)
  110. checking for package perl (atleast 5.8.0) ... yes (5.16.2)
  111. checking for package php (atleast 5.2.0) ... no
  112. checking for package python (atleast 2.5.0) ... yes (2.7.3)
  113. checking for package ruby (atleast 1.8.5) ... yes (1.9.3p374)
  114.   C++       objdir/lib/Colorspace.o
  115.   C++       objdir/lib/agg.o
  116.   C++       objdir/lib/Matrix.o
  117.   C++       objdir/lib/scale.o
  118.   C++       objdir/lib/hocr.o
  119.   C++       objdir/lib/rotate.o
  120.   C++       objdir/lib/ContourUtility.o
  121.   C++       objdir/lib/ContourMatching.o
  122.   C++       objdir/lib/segmentation.o
  123.   C++       objdir/lib/vectorial.o
  124.   LINK LIB  objdir/lib/lib.a
  125.   C++       objdir/codecs/jpeg.o
  126.   C++       objdir/codecs/dcraw.o
  127.   C++       objdir/codecs/pdf.o
  128.   C++       objdir/codecs/agg_svg_parser.o
  129.   C++       objdir/codecs/xpm.o
  130.   C++       objdir/codecs/bmp.o
  131.   C++       objdir/codecs/png.o
  132.   C++       objdir/codecs/agg_svg_path_renderer.o
  133.   C++       objdir/codecs/svg.o
  134.   LINK LIB  objdir/codecs/lib.a
  135.   C++       objdir/bardecode/Scanner.o
  136.   LINK LIB  objdir/bardecode/bardecode.a
  137.   C++       objdir/frontends/optimize2bw.o
  138.   LINK EXEC objdir/frontends/optimize2bw
  139.   C++       objdir/frontends/bardecode.o
  140.   LINK EXEC objdir/frontends/bardecode
  141.   C++       objdir/frontends/hocr2pdf.o
  142.   LINK EXEC objdir/frontends/hocr2pdf
  143.   C++       objdir/frontends/edentify.o
  144.   LINK EXEC objdir/frontends/edentify
  145.   C++       objdir/frontends/empty-page.o
  146.   LINK EXEC objdir/frontends/empty-page
  147.   C++       objdir/frontends/e2mtiff.o
  148.   LINK EXEC objdir/frontends/e2mtiff
  149.   C++       objdir/frontends/econvert.o
  150.   LINK EXEC objdir/frontends/econvert
  151.   C++       objdir/api/api.o
  152.   LINK LIB  objdir/api/api.a
  153.   LINK DYN  objdir/api/lua/ExactImage.so
  154. objdir/api/lua/api-lua-wrap.cc: In function ‘int _wrap_decodeImage(lua_State*)’:
  155. objdir/api/lua/api-lua-wrap.cc:2189:48: error: ‘lua_strlen’ was not declared in this scope
  156. objdir/api/lua/api-lua-wrap.cc: At global scope:
  157. objdir/api/lua/api-lua-wrap.cc:6953:1: error: elements of array ‘const luaL_reg swig_commands []’ have incomplete type
  158. objdir/api/lua/api-lua-wrap.cc:6953:1: error: storage size of ‘swig_commands’ isn’t known
  159. objdir/api/lua/api-lua-wrap.cc: In function ‘int luaopen_ExactImage(lua_State*)’:
  160. objdir/api/lua/api-lua-wrap.cc:7280:19: error: ‘LUA_GLOBALSINDEX’ was not declared in this scope
  161. make: *** [objdir/api/lua/ExactImage.so] Error 1
  162. ==> ERROR: A failure occurred in build().
  163.     Aborting...
clone this paste RAW Paste Data