Pastebin launched a little side project called VERYVIRAL.com, check it out ;-) Want more features on Pastebin? Sign Up, it's FREE!
Guest

Untitled

By: a guest on Aug 4th, 2012  |  syntax: None  |  size: 11.94 KB  |  views: 27  |  expires: Never
download  |  raw  |  embed  |  report abuse  |  print
Text below is selected. Please press Ctrl+C to copy to your clipboard. (⌘+C on Mac)
  1. make  all-am
  2. make[1]: Entering directory `/scratch/src/libarchive-build'
  3.   CC       libarchive/archive_crypto.lo
  4.   CC       libarchive/archive_acl.lo
  5.   CC       libarchive/archive_check_magic.lo
  6.   CC       libarchive/archive_entry_copy_stat.lo
  7.   CC       libarchive/archive_entry_link_resolver.lo
  8.   CC       libarchive/archive_entry.lo
  9.   CC       libarchive/archive_entry_stat.lo
  10.   CC       libarchive/archive_entry_sparse.lo
  11.   CC       libarchive/archive_entry_strmode.lo
  12.   CC       libarchive/archive_entry_xattr.lo
  13.   CC       libarchive/archive_getdate.lo
  14.   CC       libarchive/archive_match.lo
  15.   CC       libarchive/archive_options.lo
  16.   CC       libarchive/archive_pathmatch.lo
  17.   CC       libarchive/archive_ppmd7.lo
  18.   CC       libarchive/archive_rb.lo
  19.   CC       libarchive/archive_read.lo
  20.   CC       libarchive/archive_read_data_into_fd.lo
  21.   CC       libarchive/archive_read_disk_entry_from_file.lo
  22. libarchive/archive_read_disk_entry_from_file.c: In function 'setup_acls':
  23. libarchive/archive_read_disk_entry_from_file.c:425:31: error: 'ACL_TYPE_NFS4' undeclared (first use in this function)
  24. libarchive/archive_read_disk_entry_from_file.c:425:31: note: each undeclared identifier is reported only once for each function it appears in
  25. libarchive/archive_read_disk_entry_from_file.c: At top level:
  26. libarchive/archive_read_disk_entry_from_file.c:484:39: error: 'ACL_READ_DATA' undeclared here (not in a function)
  27. libarchive/archive_read_disk_entry_from_file.c:484:9: error: missing initializer [-Werror=missing-field-initializers]
  28. libarchive/archive_read_disk_entry_from_file.c:484:9: error: (near initialization for 'acl_perm_map[3].platform_perm') [-Werror=missing-field-initializers]
  29. libarchive/archive_read_disk_entry_from_file.c:485:44: error: 'ACL_LIST_DIRECTORY' undeclared here (not in a function)
  30. libarchive/archive_read_disk_entry_from_file.c:485:9: error: missing initializer [-Werror=missing-field-initializers]
  31. libarchive/archive_read_disk_entry_from_file.c:485:9: error: (near initialization for 'acl_perm_map[4].platform_perm') [-Werror=missing-field-initializers]
  32. libarchive/archive_read_disk_entry_from_file.c:486:40: error: 'ACL_WRITE_DATA' undeclared here (not in a function)
  33. libarchive/archive_read_disk_entry_from_file.c:486:9: error: missing initializer [-Werror=missing-field-initializers]
  34. libarchive/archive_read_disk_entry_from_file.c:486:9: error: (near initialization for 'acl_perm_map[5].platform_perm') [-Werror=missing-field-initializers]
  35. libarchive/archive_read_disk_entry_from_file.c:487:38: error: 'ACL_ADD_FILE' undeclared here (not in a function)
  36. libarchive/archive_read_disk_entry_from_file.c:487:9: error: missing initializer [-Werror=missing-field-initializers]
  37. libarchive/archive_read_disk_entry_from_file.c:487:9: error: (near initialization for 'acl_perm_map[6].platform_perm') [-Werror=missing-field-initializers]
  38. libarchive/archive_read_disk_entry_from_file.c:488:41: error: 'ACL_APPEND_DATA' undeclared here (not in a function)
  39. libarchive/archive_read_disk_entry_from_file.c:488:9: error: missing initializer [-Werror=missing-field-initializers]
  40. libarchive/archive_read_disk_entry_from_file.c:488:9: error: (near initialization for 'acl_perm_map[7].platform_perm') [-Werror=missing-field-initializers]
  41. libarchive/archive_read_disk_entry_from_file.c:489:46: error: 'ACL_ADD_SUBDIRECTORY' undeclared here (not in a function)
  42. libarchive/archive_read_disk_entry_from_file.c:489:9: error: missing initializer [-Werror=missing-field-initializers]
  43. libarchive/archive_read_disk_entry_from_file.c:489:9: error: (near initialization for 'acl_perm_map[8].platform_perm') [-Werror=missing-field-initializers]
  44. libarchive/archive_read_disk_entry_from_file.c:490:46: error: 'ACL_READ_NAMED_ATTRS' undeclared here (not in a function)
  45. libarchive/archive_read_disk_entry_from_file.c:490:9: error: missing initializer [-Werror=missing-field-initializers]
  46. libarchive/archive_read_disk_entry_from_file.c:490:9: error: (near initialization for 'acl_perm_map[9].platform_perm') [-Werror=missing-field-initializers]
  47. libarchive/archive_read_disk_entry_from_file.c:491:47: error: 'ACL_WRITE_NAMED_ATTRS' undeclared here (not in a function)
  48. libarchive/archive_read_disk_entry_from_file.c:491:9: error: missing initializer [-Werror=missing-field-initializers]
  49. libarchive/archive_read_disk_entry_from_file.c:491:9: error: (near initialization for 'acl_perm_map[10].platform_perm') [-Werror=missing-field-initializers]
  50. libarchive/archive_read_disk_entry_from_file.c:492:42: error: 'ACL_DELETE_CHILD' undeclared here (not in a function)
  51. libarchive/archive_read_disk_entry_from_file.c:492:9: error: missing initializer [-Werror=missing-field-initializers]
  52. libarchive/archive_read_disk_entry_from_file.c:492:9: error: (near initialization for 'acl_perm_map[11].platform_perm') [-Werror=missing-field-initializers]
  53. libarchive/archive_read_disk_entry_from_file.c:493:45: error: 'ACL_READ_ATTRIBUTES' undeclared here (not in a function)
  54. libarchive/archive_read_disk_entry_from_file.c:493:9: error: missing initializer [-Werror=missing-field-initializers]
  55. libarchive/archive_read_disk_entry_from_file.c:493:9: error: (near initialization for 'acl_perm_map[12].platform_perm') [-Werror=missing-field-initializers]
  56. libarchive/archive_read_disk_entry_from_file.c:494:46: error: 'ACL_WRITE_ATTRIBUTES' undeclared here (not in a function)
  57. libarchive/archive_read_disk_entry_from_file.c:494:9: error: missing initializer [-Werror=missing-field-initializers]
  58. libarchive/archive_read_disk_entry_from_file.c:494:9: error: (near initialization for 'acl_perm_map[13].platform_perm') [-Werror=missing-field-initializers]
  59. libarchive/archive_read_disk_entry_from_file.c:495:36: error: 'ACL_DELETE' undeclared here (not in a function)
  60. libarchive/archive_read_disk_entry_from_file.c:495:9: error: missing initializer [-Werror=missing-field-initializers]
  61. libarchive/archive_read_disk_entry_from_file.c:495:9: error: (near initialization for 'acl_perm_map[14].platform_perm') [-Werror=missing-field-initializers]
  62. libarchive/archive_read_disk_entry_from_file.c:496:38: error: 'ACL_READ_ACL' undeclared here (not in a function)
  63. libarchive/archive_read_disk_entry_from_file.c:496:9: error: missing initializer [-Werror=missing-field-initializers]
  64. libarchive/archive_read_disk_entry_from_file.c:496:9: error: (near initialization for 'acl_perm_map[15].platform_perm') [-Werror=missing-field-initializers]
  65. libarchive/archive_read_disk_entry_from_file.c:497:39: error: 'ACL_WRITE_ACL' undeclared here (not in a function)
  66. libarchive/archive_read_disk_entry_from_file.c:497:9: error: missing initializer [-Werror=missing-field-initializers]
  67. libarchive/archive_read_disk_entry_from_file.c:497:9: error: (near initialization for 'acl_perm_map[16].platform_perm') [-Werror=missing-field-initializers]
  68. libarchive/archive_read_disk_entry_from_file.c:498:41: error: 'ACL_WRITE_OWNER' undeclared here (not in a function)
  69. libarchive/archive_read_disk_entry_from_file.c:498:9: error: missing initializer [-Werror=missing-field-initializers]
  70. libarchive/archive_read_disk_entry_from_file.c:498:9: error: (near initialization for 'acl_perm_map[17].platform_perm') [-Werror=missing-field-initializers]
  71. libarchive/archive_read_disk_entry_from_file.c:499:41: error: 'ACL_SYNCHRONIZE' undeclared here (not in a function)
  72. libarchive/archive_read_disk_entry_from_file.c:499:9: error: missing initializer [-Werror=missing-field-initializers]
  73. libarchive/archive_read_disk_entry_from_file.c:499:9: error: (near initialization for 'acl_perm_map[18].platform_perm') [-Werror=missing-field-initializers]
  74. libarchive/archive_read_disk_entry_from_file.c:506:48: error: 'ACL_ENTRY_FILE_INHERIT' undeclared here (not in a function)
  75. libarchive/archive_read_disk_entry_from_file.c:506:9: error: initializer element is not constant
  76. libarchive/archive_read_disk_entry_from_file.c:506:9: error: (near initialization for 'acl_inherit_map[0].platform_inherit')
  77. libarchive/archive_read_disk_entry_from_file.c:506:9: error: missing initializer [-Werror=missing-field-initializers]
  78. libarchive/archive_read_disk_entry_from_file.c:506:9: error: (near initialization for 'acl_inherit_map[0].platform_inherit') [-Werror=missing-field-initializers]
  79. libarchive/archive_read_disk_entry_from_file.c:507:46: error: 'ACL_ENTRY_DIRECTORY_INHERIT' undeclared here (not in a function)
  80. libarchive/archive_read_disk_entry_from_file.c:507:2: error: initializer element is not constant
  81. libarchive/archive_read_disk_entry_from_file.c:507:2: error: (near initialization for 'acl_inherit_map[1].platform_inherit')
  82. libarchive/archive_read_disk_entry_from_file.c:507:2: error: missing initializer [-Werror=missing-field-initializers]
  83. libarchive/archive_read_disk_entry_from_file.c:507:2: error: (near initialization for 'acl_inherit_map[1].platform_inherit') [-Werror=missing-field-initializers]
  84. libarchive/archive_read_disk_entry_from_file.c:508:49: error: 'ACL_ENTRY_NO_PROPAGATE_INHERIT' undeclared here (not in a function)
  85. libarchive/archive_read_disk_entry_from_file.c:508:2: error: initializer element is not constant
  86. libarchive/archive_read_disk_entry_from_file.c:508:2: error: (near initialization for 'acl_inherit_map[2].platform_inherit')
  87. libarchive/archive_read_disk_entry_from_file.c:508:2: error: missing initializer [-Werror=missing-field-initializers]
  88. libarchive/archive_read_disk_entry_from_file.c:508:2: error: (near initialization for 'acl_inherit_map[2].platform_inherit') [-Werror=missing-field-initializers]
  89. libarchive/archive_read_disk_entry_from_file.c:509:41: error: 'ACL_ENTRY_INHERIT_ONLY' undeclared here (not in a function)
  90. libarchive/archive_read_disk_entry_from_file.c:509:2: error: initializer element is not constant
  91. libarchive/archive_read_disk_entry_from_file.c:509:2: error: (near initialization for 'acl_inherit_map[3].platform_inherit')
  92. libarchive/archive_read_disk_entry_from_file.c:509:2: error: missing initializer [-Werror=missing-field-initializers]
  93. libarchive/archive_read_disk_entry_from_file.c:509:2: error: (near initialization for 'acl_inherit_map[3].platform_inherit') [-Werror=missing-field-initializers]
  94. libarchive/archive_read_disk_entry_from_file.c: In function 'translate_acl':
  95. libarchive/archive_read_disk_entry_from_file.c:517:2: error: unknown type name 'acl_entry_type_t'
  96. libarchive/archive_read_disk_entry_from_file.c:518:2: error: unknown type name 'acl_flagset_t'
  97. libarchive/archive_read_disk_entry_from_file.c:529:2: error: implicit declaration of function 'acl_get_brand_np' [-Werror=implicit-function-declaration]
  98. libarchive/archive_read_disk_entry_from_file.c:531:7: error: 'ACL_BRAND_POSIX' undeclared (first use in this function)
  99. libarchive/archive_read_disk_entry_from_file.c:542:7: error: 'ACL_BRAND_NFS4' undeclared (first use in this function)
  100. libarchive/archive_read_disk_entry_from_file.c:585:8: error: 'ACL_EVERYONE' undeclared (first use in this function)
  101. libarchive/archive_read_disk_entry_from_file.c:598:3: error: implicit declaration of function 'acl_get_entry_type_np' [-Werror=implicit-function-declaration]
  102. libarchive/archive_read_disk_entry_from_file.c:601:9: error: 'ACL_ENTRY_TYPE_ALLOW' undeclared (first use in this function)
  103. libarchive/archive_read_disk_entry_from_file.c:604:9: error: 'ACL_ENTRY_TYPE_DENY' undeclared (first use in this function)
  104. libarchive/archive_read_disk_entry_from_file.c:607:9: error: 'ACL_ENTRY_TYPE_AUDIT' undeclared (first use in this function)
  105. libarchive/archive_read_disk_entry_from_file.c:610:9: error: 'ACL_ENTRY_TYPE_ALARM' undeclared (first use in this function)
  106. libarchive/archive_read_disk_entry_from_file.c:620:3: error: implicit declaration of function 'acl_get_flagset_np' [-Werror=implicit-function-declaration]
  107. libarchive/archive_read_disk_entry_from_file.c:622:4: error: implicit declaration of function 'acl_get_flag_np' [-Werror=implicit-function-declaration]
  108. cc1: all warnings being treated as errors
  109. make[1]: *** [libarchive/archive_read_disk_entry_from_file.lo] Error 1
  110. make[1]: *** Waiting for unfinished jobs....
  111. make[1]: Leaving directory `/scratch/src/libarchive-build'
  112. make: *** [all] Error 2
  113. ==> ERROR: A failure occurred in build().
  114.     Aborting...